[
  "Color Space",
  "Outdoor Light",
  "Indoor Light",
  "Day Time",
  "Weather",
  "Occluded",
  "Crowded",
  "Object Category",
  "Object Area",
  "Object Volume",
  "Keyword",
  "AU_10 Active",
  "AU_11 Active",
  "AU_12 Active",
  "AU_13 Active",
  "AU_14 Active",
  "AU_15 Active",
  "AU_16 Active",
  "AU_17 Active",
  "AU_18 Active",
  "AU_19 Active",
  "AU_20 Active",
  "AU_21 Active",
  "AU_22 Active",
  "AU_23 Active",
  "AU_24 Active",
  "AU_25 Active",
  "AU_26 Active",
  "AU_27 Active",
  "AU_28 Active",
  "AU_29 Active",
  "AU_30 Active",
  "AU_31 Active",
  "AU_32 Active",
  "AU_33 Active",
  "AU_34 Active",
  "AU_35 Active",
  "AU_36 Active",
  "AU_37 Active",
  "AU_38 Active",
  "AU_39 Active",
  "AU_40 Active",
  "AU_41 Active",
  "AU_42 Active",
  "AU_43 Active",
  "AU_44 Active",
  "AU_45 Active",
  "AU_46 Active",
  "AU_01 Active",
  "AU_02 Active",
  "AU_04 Active",
  "AU_05 Active",
  "AU_06 Active",
  "AU_07 Active",
  "AU_08 Active",
  "AU_09 Active",
  "AU_51 Active",
  "AU_52 Active",
  "AU_53 Active",
  "AU_54 Active",
  "AU_55 Active",
  "AU_56 Active",
  "AU_57 Active",
  "AU_58 Active",
  "AU_M55 Active",
  "AU_M56 Active",
  "AU_M57 Active",
  "AU_M59 Active",
  "AU_M60 Active",
  "AU_M83 Active",
  "AU_61 Active",
  "AU_62 Active",
  "AU_63 Active",
  "AU_64 Active",
  "AU_65 Active",
  "AU_66 Active",
  "AU_69 Active",
  "AU_M61 Active",
  "AU_M62 Active",
  "AU_M68 Active",
  "AU_M69 Active",
  "AU_70 Active",
  "AU_71 Active",
  "AU_72 Active",
  "AU_73 Active",
  "AU_74 Active",
  "AU_50 Active",
  "AU_80 Active",
  "AU_81 Active",
  "AU_82 Active",
  "AU_84 Active",
  "AU_85 Active",
  "AU_91 Active",
  "AU_92 Active",
  "AU_97 Active",
  "AU_98 Active",
  "EmoAnger Active",
  "EmoDisgust Active",
  "EmoFear Active",
  "EmoHappiness Active",
  "EmoNeutral Active",
  "EmoSadness Active",
  "EmoSurprise Active",
  "EmoContempt Active",
  "Age",
  "Age Group",
  "Gender",
  "Ethnicity",
  "Nationality",
  "Face Area",
  "Face Volume",
  "Drowsy",
  "Face Orientation",
  "Headpose Yaw",
  "Headpose Pitch",
  "Headpose Roll",
  "Eyes Orientation",
  "Eyes Closed",
  "Eyes on Road",
  "Gaze LeftEye Yaw",
  "Gaze LeftEye Pitch",
  "Gaze RightEye Yaw",
  "Gaze RightEye Pitch",
  "AFF Pain Score",
  "SEN Pain Score",
  "OPR Pain Score",
  "VAS Pain Score",
  "PSPI Pain Score",
  "Facial Hair",
  "Glasses",
  "Hair Style",
  "Hair Color",
  "Skin Type",
  "Wearing TShirt",
  "Wearing PulloverJacket",
  "Wearing ThickWinterJacket",
  "Wearing Hat",
  "Wearing BaseballCap",
  "Wearing Hoodie",
  "Wearing Mask",
  "Body Type",
  "Body Area",
  "Body Volume",
  "Left Hand Area",
  "Left Hand Volume",
  "Right Hand Area",
  "Right Hand Volume",
  "Left Foot Area",
  "Left Foot Volume",
  "Right Foot Area",
  "Right Foot Volume",
  "Left Eye Area",
  "Left Eye Volume",
  "Right Eye Area",
  "Right Eye Volume",
  "Hands on Wheel"
]