UNI airbu 614
UNI subsidi 148
UNI south 53139
UNI african 10846
UNI sanction 235
UNI leverag 78
UNI buyout 37
UNI satellit 2361
UNI launch 1292
UNI contract 1293
UNI insid 1648
UNI trade 6956
UNI prime 3948
UNI lend 183
UNI rate 2932
UNI move 1995
UNI predict 499
UNI mci 60
UNI rail 6815
UNI strike 2970
UNI weather 1722
UNI relat 33099
UNI fatal 635
UNI merit 822
UNI pai 465
UNI senior 7533
UNI israel 5733
UNI role 1047
UNI iran 8542
UNI contra 374
UNI affair 6137
UNI militari 10350
UNI coup 2647
UNI d 343
UNI etat 67
UNI machin 5220
UNI translat 1582
UNI hostag 377
UNI take 3645
UNI inform 5800
UNI retriev 352
UNI system 23639
UNI natur 9192
UNI languag 45303
UNI process 4081
UNI polit 9816
UNI motiv 367
UNI civil 8868
UNI disturb 375
UNI health 9499
UNI hazard 655
UNI fine 2148
UNI diamet 112
UNI fiber 847
UNI attempt 556
UNI reviv 886
UNI salt 2447
UNI treati 4883
UNI surrog 90
UNI motherhood 51
UNI border 3703
UNI incurs 48
UNI demograph 1539
UNI shift 967
UNI u 720
UNI s 527
UNI across 603
UNI nation 93839
UNI boundari 1029
UNI conflict 2606
UNI polici 4116
UNI autom 947
UNI constitut 6102
UNI origin 5210
UNI intent 684
UNI poach 39
UNI greenpeac 43
UNI peac 4800
UNI frg 9
UNI parti 28869
UNI posit 2272
UNI 1988 6289
UNI presidenti 8672
UNI candid 2034
UNI platform 2225
UNI financi 3292
UNI crunch 146
UNI televangelist 18
UNI wake 1747
UNI ptl 10
UNI genet 1675
UNI engin 15952
UNI measur 2413
UNI protect 4792
UNI atmospher 685
UNI altern 3479
UNI renew 1013
UNI energi 6836
UNI plant 7642
UNI equip 1283
UNI instal 420
UNI offici 1897
UNI corrupt 658
UNI bank 15124
UNI failur 607
UNI crimin 2240
UNI action 5472
UNI offic 16006
UNI fail 437
UNI crude 175
UNI oil 5173
UNI price 3752
UNI trend 384
UNI downstream 38
UNI invest 2064
UNI opec 28
UNI member 8551
UNI state 156279
UNI data 4012
UNI proven 62
UNI reserv 8864
UNI ga 4293
UNI armi 14999
UNI acquisit 519
UNI advanc 3270
UNI weapon 2541
UNI intern 41948
UNI sale 1719
UNI back 6786
UNI rifl 3977
UNI associ 24859
UNI comput 10606
UNI aid 1935
UNI crime 3654
UNI medic 8594
UNI diagnosi 186
UNI optic 1779
UNI applic 1870
UNI manufactur 2593
UNI control 6927
UNI transfer 3130
UNI high 49306
UNI technolog 13171
UNI design 6771
UNI star 19535
UNI war 31359
UNI anti 642
UNI missil 2311
UNI defens 4860
UNI laser 1371
UNI research 9994
UNI strateg 1204
UNI welfar 1127
UNI reform 3908
UNI catastroph 212
UNI insur 2766
UNI black 20333
UNI mondai 14
UNI japanes 8028
UNI regul 1674
UNI protectionist 13
UNI find 947
UNI innov 1218
UNI compani 26803
UNI resist 1769
UNI africa 8988
UNI govern 11706
UNI nuclear 4394
UNI prolifer 82
UNI fund 3166
UNI biotechnolog 292
UNI new 108220
UNI space 9433
UNI non 1207
UNI commerci 2283
UNI impact 1480
UNI 1986 4880
UNI immigr 1792
UNI law 21414
UNI gener 27170
UNI drug 3418
UNI substitut 530
UNI capac 473
UNI cellular 590
UNI telephon 1824
UNI network 11484
UNI terrorist 1219
UNI econom 5996
UNI terror 2453
UNI death 10793
UNI cancer 2315
UNI fight 5437
UNI carcinogen 43
UNI tradit 2210
UNI therapi 1802
UNI smoke 1416
UNI ethic 1215
UNI modern 4754
UNI ssr 507
UNI arm 9088
UNI agreement 2920
UNI privat 2715
UNI asset 833
UNI soviet 6853
UNI spy 0
UNI jewish 3592
UNI emigr 298
UNI mcdonnel 569
UNI dougla 6821
UNI aircraft 4994
UNI stealth 193
UNI hubbl 158
UNI telescop 986
UNI human 8968
UNI genom 573
UNI project 9418
UNI possibl 450
UNI contribut 336
UNI gene 13898
UNI map 2830
UNI medicin 4669
UNI diversif 33
UNI pacif 7569
UNI telesi 8
UNI expans 961
UNI theme 1493
UNI park 47308
UNI industri 9351
UNI iranian 1999
UNI support 3404
UNI lebanes 1000
UNI taker 52
UNI islam 6153
UNI revolut 4431
UNI domest 1207
UNI foreign 5561
UNI social 8248
UNI fundament 750
UNI japan 9327
UNI handl 386
UNI surplu 109
UNI grain 695
UNI farm 10805
UNI farmer 1457
UNI manag 11069
UNI problem 3267
UNI unit 83485
UNI influenc 638
UNI pro 4279
UNI lobbi 264
UNI negoti 356
UNI end 5954
UNI nicaraguan 252
UNI product 7242
UNI economi 2981
UNI horn 3425
UNI espionag 138
UNI campaign 4485
UNI financ 2677
UNI cope 395
UNI overcrowd 8
UNI prison 5258
UNI accus 193
UNI cheat 315
UNI contractor 206
UNI us 493
UNI coverag 215
UNI long 10358
UNI term 2451
UNI care 3271
UNI spill 497
UNI right 10594
UNI wing 5932
UNI christian 14554
UNI effort 202
UNI enact 39
UNI gun 5404
UNI legisl 6894
UNI caus 1037
UNI treatment 1204
UNI multipl 1445
UNI sclerosi 153
UNI ms 24
UNI limit 6926
UNI congress 5497
UNI propos 737
UNI try 0
UNI place 16158
UNI number 12089
UNI discuss 125
UNI subject 624
UNI consecut 57
UNI electr 6904
UNI car 7428
UNI develop 9861
UNI vitamin 375
UNI cure 641
UNI acid 5557
UNI rain 2494
UNI automobil 2138
UNI recal 279
UNI vehicl 3942
UNI purpos 433
UNI vietnam 2744
UNI veteran 1154
UNI agent 2616
UNI orang 4346
UNI serv 501
UNI soldier 2857
UNI issu 1671
UNI entitl 64
UNI award 35677
UNI monetari 337
UNI illeg 519
UNI activ 3193
UNI tobacco 922
UNI advertis 1353
UNI young 10428
UNI standard 4902
UNI test 7254
UNI cultur 11520
UNI bia 628
UNI show 12301
UNI violenc 1403
UNI explicit 81
UNI amtrak 1807
UNI cost 1186
UNI garbag 341
UNI trash 332
UNI remov 475
UNI consequ 298
UNI implant 270
UNI silicon 571
UNI gel 246
UNI mutual 886
UNI individu 4070
UNI effect 5396
UNI ban 1760
UNI wast 1197
UNI cleanup 73
UNI superfund 137
UNI known 488
UNI site 6775
UNI nra 53
UNI prevent 1244
UNI real 5697
UNI life 15158
UNI investig 1752
UNI english 10641
UNI dog 6199
UNI maul 189
UNI breed 928
UNI result 4791
UNI injuri 703
UNI report 3769
UNI restaur 2084
UNI land 10460
UNI ineffect 11
UNI embargo 83
UNI abus 1275
UNI elderli 79
UNI famili 15046
UNI overfish 16
UNI creat 436
UNI food 5960
UNI fish 5080
UNI deficit 189
UNI asbesto 101
UNI lawsuit 142
UNI corpor 11047
UNI pension 627
UNI plan 4850
UNI differ 1443
UNI learn 2771
UNI level 2310
UNI among 696
UNI inner 1155
UNI sign 3400
UNI demis 59
UNI independ 8559
UNI publish 3908
UNI beachfront 4
UNI eros 136
UNI murder 5140
UNI instanc 92
UNI fraud 463
UNI involv 1013
UNI improv 987
UNI school 112997
UNI sprai 0
UNI etc 104
UNI relev 100
UNI refer 1195
UNI toi 253
UNI r 213
UNI danger 1786
UNI child 4319
UNI document 1172
UNI mai 1032
UNI present 2738
UNI amount 66
UNI monei 0
UNI earn 208
UNI writer 5582
UNI stock 2736
UNI market 9770
UNI perturb 97
UNI attribut 371
UNI choic 1802
UNI voucher 50
UNI jurisprud 110
UNI benefit 750
UNI legal 2635
UNI assist 3224
UNI suicid 1475
UNI textil 652
UNI import 1119
BIG airbu,subsidi 0
BIG south,african 2627
BIG african,sanction 1
BIG leverag,buyout 8
BIG satellit,launch 42
BIG launch,contract 0
BIG insid,trade 15
BIG prime,lend 3
BIG lend,rate 6
BIG rate,move 0
BIG move,predict 0
BIG rail,strike 7
BIG weather,relat 5
BIG relat,fatal 2
BIG merit,pai 0
BIG pai,senior 0
BIG israel,role 0
BIG role,iran 0
BIG iran,contra 7
BIG contra,affair 2
BIG militari,coup 66
BIG coup,d 2
BIG d,etat 2
BIG machin,translat 43
BIG hostag,take 11
BIG inform,retriev 61
BIG retriev,system 17
BIG system,system 10
BIG natur,languag 61
BIG languag,process 28
BIG process,natur 0
BIG polit,motiv 1
BIG motiv,civil 0
BIG civil,disturb 13
BIG health,hazard 18
BIG hazard,fine 0
BIG fine,diamet 0
BIG diamet,fiber 0
BIG attempt,reviv 2
BIG reviv,salt 0
BIG salt,treati 5
BIG surrog,motherhood 2
BIG border,incurs 0
BIG demograph,shift 1
BIG shift,u 0
BIG u,s 0
BIG shift,across 0
BIG across,nation 0
BIG nation,boundari 3
BIG conflict,polici 0
BIG s,constitut 0
BIG constitut,origin 0
BIG origin,intent 2
BIG greenpeac,peac 0
BIG frg,frg 0
BIG frg,polit 0
BIG polit,parti 1789
BIG parti,posit 1
BIG 1988,presidenti 2
BIG presidenti,candid 238
BIG candid,platform 0
BIG financi,crunch 0
BIG crunch,televangelist 0
BIG televangelist,wake 0
BIG wake,ptl 0
BIG genet,engin 71
BIG measur,protect 4
BIG protect,atmospher 1
BIG altern,renew 2
BIG renew,energi 398
BIG energi,plant 13
BIG plant,equip 2
BIG equip,instal 0
BIG offici,corrupt 2
BIG bank,failur 17
BIG crimin,action 1
BIG action,offic 1
BIG offic,fail 0
BIG crude,oil 72
BIG oil,price 32
BIG price,trend 5
BIG downstream,invest 0
BIG invest,opec 0
BIG opec,member 0
BIG member,state 210
BIG data,proven 1
BIG proven,reserv 4
BIG reserv,oil 0
BIG oil,natur 0
BIG natur,ga 295
BIG s,armi 0
BIG armi,acquisit 9
BIG acquisit,advanc 0
BIG advanc,weapon 0
BIG weapon,system 108
BIG intern,militari 24
BIG militari,equip 130
BIG equip,sale 2
BIG back,nation 0
BIG nation,rifl 17
BIG rifl,associ 28
BIG comput,aid 59
BIG aid,crime 3
BIG aid,medic 3
BIG medic,diagnosi 9
BIG fiber,optic 48
BIG optic,applic 0
BIG optic,equip 0
BIG equip,manufactur 22
BIG iran,iran 0
BIG control,transfer 0
BIG transfer,high 0
BIG high,technolog 37
BIG design,star 14
BIG star,war 1437
BIG war,anti 0
BIG anti,missil 1
BIG missil,defens 78
BIG defens,system 88
BIG laser,research 3
BIG research,applic 1
BIG applic,u 0
BIG s,strateg 0
BIG strateg,defens 10
BIG welfar,reform 13
BIG catastroph,health 1
BIG health,insur 172
BIG black,mondai 0
BIG s,control 0
BIG control,insid 0
BIG japanes,regul 0
BIG regul,insid 0
BIG japanes,japanes 2
BIG japanes,protectionist 0
BIG protectionist,measur 0
BIG find,innov 0
BIG innov,compani 1
BIG black,resist 0
BIG resist,south 3
BIG south,africa 4705
BIG africa,south 15
BIG african,govern 8
BIG nuclear,prolifer 4
BIG fund,biotechnolog 0
BIG new,space 11
BIG space,satellit 5
BIG satellit,applic 3
BIG non,commerci 1
BIG commerci,satellit 3
BIG impact,1986 0
BIG 1986,immigr 1
BIG immigr,law 29
BIG gener,drug 6
BIG drug,substitut 0
BIG capac,u 0
BIG s,cellular 0
BIG cellular,telephon 8
BIG telephon,network 20
BIG intern,terrorist 5
BIG action,intern 6
BIG econom,impact 29
BIG impact,intern 0
BIG intern,terror 4
BIG death,cancer 1
BIG rate,new 0
BIG new,cancer 0
BIG cancer,fight 1
BIG fight,drug 0
BIG research,control 0
BIG control,carcinogen 0
BIG altern,tradit 0
BIG tradit,cancer 0
BIG cancer,therapi 19
BIG anti,smoke 3
BIG smoke,action 0
BIG action,govern 0
BIG medic,ethic 17
BIG ethic,modern 0
BIG modern,technolog 5
BIG s,u 0
BIG u,ssr 0
BIG ssr,arm 0
BIG arm,control 57
BIG control,agreement 4
BIG privat,state 2
BIG state,asset 5
BIG soviet,soviet 9
BIG soviet,spy 0
BIG spy,u 0
BIG jewish,jewish 0
BIG jewish,emigr 7
BIG emigr,u 0
BIG s,relat 0
BIG mcdonnel,dougla 207
BIG dougla,contract 0
BIG contract,militari 0
BIG militari,aircraft 212
BIG stealth,aircraft 4
BIG hubbl,hubbl 0
BIG hubbl,space 12
BIG space,telescop 68
BIG human,genom 43
BIG genom,project 42
BIG possibl,contribut 0
BIG contribut,gene 0
BIG gene,map 4
BIG map,medicin 0
BIG diversif,pacif 0
BIG pacif,telesi 3
BIG telesi,pacif 0
BIG expans,u 0
BIG s,theme 0
BIG theme,park 222
BIG park,industri 3
BIG iranian,iranian 0
BIG iranian,support 4
BIG support,lebanes 0
BIG lebanes,hostag 1
BIG hostag,taker 0
BIG iran,islam 5
BIG islam,revolut 79
BIG revolut,domest 0
BIG domest,foreign 0
BIG foreign,social 0
BIG polit,impact 5
BIG impact,islam 0
BIG islam,fundament 9
BIG japan,handl 0
BIG handl,trade 0
BIG trade,surplu 1
BIG surplu,u 0
BIG impact,govern 0
BIG govern,regul 3
BIG regul,grain 0
BIG grain,farm 0
BIG farm,intern 4
BIG protect,u 0
BIG s,farmer 0
BIG manag,problem 0
BIG problem,unit 3
BIG unit,nation 4315
BIG influenc,pro 0
BIG pro,israel 0
BIG israel,israel 3
BIG israel,lobbi 17
BIG negoti,end 3
BIG end,nicaraguan 0
BIG nicaraguan,nicaraguan 0
BIG nicaraguan,civil 7
BIG civil,war 2811
BIG product,trend 0
BIG trend,u 0
BIG s,economi 0
BIG conflict,horn 3
BIG horn,africa 70
BIG africa,africa 1
BIG industri,espionag 3
BIG espionag,espionag 0
BIG s,polit 0
BIG polit,campaign 12
BIG campaign,financ 34
BIG cope,overcrowd 0
BIG overcrowd,prison 2
BIG accus,cheat 0
BIG cheat,contractor 0
BIG contractor,us 0
BIG us,defens 0
BIG defens,project 0
BIG insur,coverag 3
BIG coverag,pai 0
BIG pai,long 1
BIG long,term 69
BIG term,care 10
BIG oil,spill 263
BIG right,wing 34
BIG wing,christian 0
BIG christian,fundament 8
BIG fundament,us 0
BIG effort,enact 0
BIG enact,gun 0
BIG gun,control 42
BIG control,legisl 1
BIG caus,treatment 0
BIG treatment,multipl 2
BIG multipl,sclerosi 62
BIG sclerosi,ms 0
BIG term,limit 31
BIG limit,member 0
BIG member,us 0
BIG us,congress 3
BIG congress,propos 0
BIG propos,try 0
BIG try,place 0
BIG place,limit 1
BIG limit,number 0
BIG number,term 0
BIG term,member 0
BIG member,discuss 0
BIG discuss,subject 0
BIG subject,limit 0
BIG number,consecut 0
BIG electr,car 91
BIG car,develop 9
BIG vitamin,cure 0
BIG cure,caus 0
BIG acid,rain 17
BIG automobil,recal 0
BIG recal,vehicl 0
BIG vehicl,purpos 0
BIG purpos,recal 0
BIG recal,number 0
BIG vietnam,veteran 58
BIG veteran,agent 0
BIG agent,orang 19
BIG orang,serv 0
BIG serv,south 3
BIG south,vietnam 115
BIG vietnam,number 0
BIG number,us 0
BIG us,soldier 0
BIG soldier,issu 0
BIG issu,veteran 0
BIG veteran,entitl 0
BIG entitl,award 0
BIG award,monetari 0
BIG drug,illeg 2
BIG illeg,activ 3
BIG activ,manufactur 0
BIG tobacco,compani 70
BIG compani,advertis 0
BIG advertis,young 0
BIG standard,test 31
BIG test,cultur 2
BIG cultur,bia 3
BIG regul,show 0
BIG show,violenc 0
BIG violenc,explicit 0
BIG financ,amtrak 0
BIG cost,garbag 0
BIG garbag,trash 0
BIG trash,remov 0
BIG consequ,implant 0
BIG implant,silicon 0
BIG silicon,gel 1
BIG us,mutual 0
BIG mutual,fund 51
BIG fund,individu 0
BIG individu,s 0
BIG effect,medic 4
BIG medic,product 10
BIG smoke,ban 28
BIG hazard,wast 25
BIG wast,cleanup 0
BIG cleanup,superfund 0
BIG superfund,law 0
BIG law,associ 28
BIG associ,cost 4
BIG cost,known 0
BIG known,number 0
BIG number,site 0
BIG nra,prevent 0
BIG prevent,gun 6
BIG real,life 134
BIG life,privat 1
BIG privat,investig 20
BIG english,offici 5
BIG offici,languag 122
BIG languag,us 0
BIG dog,maul 0
BIG maul,breed 0
BIG breed,number 0
BIG number,dog 0
BIG dog,s 0
BIG s,known 0
BIG known,result 0
BIG result,injuri 0
BIG injuri,death 0
BIG death,report 2
BIG report,number 6
BIG number,injuri 0
BIG us,restaur 0
BIG restaur,foreign 0
BIG foreign,land 9
BIG ineffect,us 0
BIG us,embargo 0
BIG embargo,sanction 0
BIG abus,elderli 0
BIG elderli,famili 0
BIG famili,member 75
BIG member,medic 0
BIG commerci,overfish 0
BIG overfish,creat 0
BIG creat,food 0
BIG food,fish 2
BIG fish,deficit 0
BIG asbesto,relat 1
BIG relat,lawsuit 0
BIG corpor,pension 0
BIG pension,plan 34
BIG plan,fund 1
BIG reform,us 0
BIG us,welfar 0
BIG welfar,system 6
BIG differ,learn 2
BIG learn,level 1
BIG level,among 0
BIG among,inner 0
BIG sign,demis 0
BIG demis,independ 0
BIG independ,publish 15
BIG beachfront,eros 0
BIG real,motiv 0
BIG motiv,murder 1
BIG instanc,fraud 0
BIG fraud,involv 0
BIG involv,us 0
BIG us,comput 0
BIG effort,improv 0
BIG improv,us 0
BIG us,school 0
BIG spill,cleanup 0
BIG cleanup,sprai 0
BIG sprai,etc 0
BIG etc,relev 0
BIG relev,refer 0
BIG refer,cost 0
BIG cost,cleanup 0
BIG cleanup,number 0
BIG toi,r 0
BIG r,danger 0
BIG danger,caus 0
BIG caus,child 1
BIG child,relev 0
BIG relev,document 0
BIG document,mai 0
BIG mai,present 0
BIG present,inform 0
BIG inform,number 1
BIG amount,monei 0
BIG monei,earn 0
BIG earn,writer 0
BIG stock,market 158
BIG market,perturb 0
BIG perturb,attribut 0
BIG school,choic 15
BIG choic,voucher 3
BIG voucher,system 0
BIG system,effect 5
BIG reform,jurisprud 0
BIG jurisprud,system 0
BIG gene,therapi 33
BIG therapi,benefit 0
BIG legal,medic 0
BIG medic,assist 24
BIG assist,suicid 14
BIG impact,foreign 0
BIG foreign,textil 0
BIG textil,import 0
BIG import,us 0
PRX airbu,subsidi 0
PRX south,african 2635
PRX south,sanction 2
PRX african,sanction 0
PRX leverag,buyout 1
PRX satellit,launch 37
PRX satellit,contract 0
PRX launch,contract 0
PRX insid,trade 9
PRX prime,lend 2
PRX prime,rate 2
PRX prime,move 0
PRX prime,predict 0
PRX lend,rate 0
PRX lend,move 0
PRX lend,predict 0
PRX rate,move 1
PRX rate,predict 0
PRX move,predict 0
PRX rail,strike 1
PRX weather,relat 5
PRX weather,fatal 1
PRX relat,fatal 1
PRX merit,pai 0
PRX merit,senior 0
PRX pai,senior 0
PRX israel,role 0
PRX israel,iran 7
PRX israel,contra 0
PRX israel,affair 21
PRX role,iran 0
PRX role,contra 0
PRX role,affair 0
PRX iran,contra 4
PRX iran,affair 17
PRX contra,affair 0
PRX militari,coup 48
PRX militari,d 0
PRX militari,etat 0
PRX coup,d 2
PRX coup,etat 0
PRX d,etat 0
PRX machin,translat 15
PRX hostag,take 11
PRX inform,retriev 20
PRX inform,system 208
PRX retriev,system 3
PRX system,system 6648
PRX natur,languag 53
PRX natur,process 6
PRX natur,natur 8576
PRX languag,process 24
PRX languag,natur 61
PRX languag,languag 6162
PRX process,natur 24
PRX process,languag 33
PRX process,process 1659
PRX polit,motiv 1
PRX polit,civil 29
PRX polit,disturb 0
PRX motiv,civil 1
PRX motiv,disturb 0
PRX civil,disturb 9
PRX health,hazard 14
PRX health,fine 0
PRX health,diamet 0
PRX health,fiber 0
PRX hazard,fine 0
PRX hazard,diamet 0
PRX hazard,fiber 0
PRX fine,diamet 0
PRX fine,fiber 0
PRX diamet,fiber 0
PRX attempt,reviv 2
PRX attempt,salt 0
PRX attempt,treati 0
PRX reviv,salt 0
PRX reviv,treati 0
PRX salt,treati 0
PRX surrog,motherhood 0
PRX border,incurs 0
PRX demograph,shift 0
PRX demograph,u 0
PRX demograph,s 0
PRX shift,u 0
PRX shift,s 0
PRX u,s 0
PRX demograph,across 0
PRX demograph,nation 3
PRX demograph,boundari 0
PRX shift,across 0
PRX shift,nation 0
PRX shift,boundari 0
PRX across,nation 2
PRX across,boundari 0
PRX nation,boundari 5
PRX conflict,polici 3
PRX u,constitut 0
PRX u,origin 0
PRX u,intent 0
PRX s,constitut 0
PRX s,origin 0
PRX s,intent 0
PRX constitut,origin 1
PRX constitut,intent 0
PRX origin,intent 0
PRX greenpeac,peac 0
PRX frg,frg 4
PRX frg,polit 0
PRX frg,parti 0
PRX frg,posit 0
PRX polit,parti 1157
PRX polit,posit 137
PRX parti,posit 13
PRX 1988,presidenti 105
PRX 1988,candid 38
PRX 1988,platform 0
PRX presidenti,candid 204
PRX presidenti,platform 1
PRX candid,platform 0
PRX financi,crunch 0
PRX financi,televangelist 0
PRX financi,wake 0
PRX financi,ptl 0
PRX crunch,televangelist 0
PRX crunch,wake 0
PRX crunch,ptl 0
PRX televangelist,wake 0
PRX televangelist,ptl 0
PRX wake,ptl 0
PRX genet,engin 50
PRX measur,protect 8
PRX measur,atmospher 6
PRX protect,atmospher 0
PRX altern,renew 7
PRX altern,energi 34
PRX altern,plant 0
PRX altern,equip 0
PRX altern,instal 0
PRX renew,energi 346
PRX renew,plant 0
PRX renew,equip 0
PRX renew,instal 1
PRX energi,plant 3
PRX energi,equip 0
PRX energi,instal 4
PRX plant,equip 1
PRX plant,instal 0
PRX equip,instal 0
PRX offici,corrupt 6
PRX bank,failur 8
PRX crimin,action 1
PRX crimin,offic 13
PRX crimin,fail 0
PRX action,offic 10
PRX action,fail 2
PRX offic,fail 1
PRX crude,oil 55
PRX crude,price 3
PRX crude,trend 0
PRX oil,price 28
PRX oil,trend 1
PRX price,trend 0
PRX downstream,invest 0
PRX downstream,opec 0
PRX downstream,member 0
PRX downstream,state 0
PRX invest,opec 0
PRX invest,member 1
PRX invest,state 26
PRX opec,member 1
PRX opec,state 1
PRX member,state 644
PRX data,proven 0
PRX data,reserv 2
PRX data,oil 3
PRX data,natur 0
PRX data,ga 2
PRX proven,reserv 0
PRX proven,oil 4
PRX proven,natur 2
PRX proven,ga 3
PRX reserv,oil 58
PRX reserv,natur 1759
PRX reserv,ga 12
PRX oil,natur 20
PRX oil,ga 212
PRX natur,ga 239
PRX u,armi 0
PRX u,acquisit 0
PRX u,advanc 0
PRX u,weapon 0
PRX u,system 0
PRX s,armi 0
PRX s,acquisit 0
PRX s,advanc 0
PRX s,weapon 0
PRX s,system 0
PRX armi,acquisit 9
PRX armi,advanc 9
PRX armi,weapon 9
PRX armi,system 15
PRX acquisit,advanc 0
PRX acquisit,weapon 4
PRX acquisit,system 8
PRX advanc,weapon 2
PRX advanc,system 35
PRX weapon,system 37
PRX intern,militari 43
PRX intern,equip 17
PRX intern,sale 6
PRX militari,equip 119
PRX militari,sale 3
PRX equip,sale 2
PRX back,nation 12
PRX back,rifl 0
PRX back,associ 6
PRX nation,rifl 20
PRX nation,associ 1656
PRX rifl,associ 12
PRX comput,aid 66
PRX comput,crime 11
PRX aid,crime 2
PRX comput,medic 6
PRX comput,diagnosi 0
PRX aid,medic 12
PRX aid,diagnosi 3
PRX medic,diagnosi 3
PRX fiber,optic 99
PRX fiber,applic 0
PRX optic,applic 3
PRX fiber,equip 0
PRX fiber,manufactur 1
PRX optic,equip 0
PRX optic,manufactur 1
PRX equip,manufactur 13
PRX iran,iran 2556
PRX control,transfer 3
PRX control,high 3
PRX control,technolog 11
PRX transfer,high 0
PRX transfer,technolog 28
PRX high,technolog 116
PRX design,star 22
PRX design,war 3
PRX design,anti 0
PRX design,missil 5
PRX design,defens 6
PRX design,system 57
PRX star,war 1115
PRX star,anti 1
PRX star,missil 1
PRX star,defens 2
PRX star,system 54
PRX war,anti 13
PRX war,missil 7
PRX war,defens 20
PRX war,system 3
PRX anti,missil 3
PRX anti,defens 0
PRX anti,system 1
PRX missil,defens 75
PRX missil,system 9
PRX defens,system 32
PRX laser,research 2
PRX laser,applic 2
PRX laser,u 0
PRX laser,s 0
PRX laser,strateg 0
PRX laser,defens 4
PRX research,applic 8
PRX research,u 0
PRX research,s 0
PRX research,strateg 19
PRX research,defens 31
PRX applic,u 0
PRX applic,s 0
PRX applic,strateg 0
PRX applic,defens 3
PRX u,strateg 0
PRX u,defens 0
PRX s,strateg 0
PRX s,defens 0
PRX strateg,defens 11
PRX welfar,reform 8
PRX catastroph,health 1
PRX catastroph,insur 2
PRX health,insur 128
PRX black,mondai 0
PRX u,control 0
PRX u,insid 0
PRX u,trade 0
PRX s,control 0
PRX s,insid 0
PRX s,trade 0
PRX control,insid 0
PRX control,trade 6
PRX japanes,regul 0
PRX japanes,insid 0
PRX japanes,trade 13
PRX regul,insid 0
PRX regul,trade 13
PRX japanes,japanes 7864
PRX japanes,protectionist 0
PRX japanes,measur 3
PRX protectionist,measur 0
PRX find,innov 0
PRX find,compani 0
PRX innov,compani 2
PRX black,resist 3
PRX black,south 46
PRX black,africa 7
PRX black,african 62
PRX black,govern 0
PRX resist,south 8
PRX resist,africa 0
PRX resist,african 7
PRX resist,govern 3
PRX south,africa 1269
PRX south,south 51028
PRX south,govern 112
PRX africa,south 4754
PRX africa,african 12
PRX africa,govern 24
PRX african,govern 13
PRX nuclear,prolifer 6
PRX fund,biotechnolog 0
PRX new,space 20
PRX new,satellit 4
PRX new,applic 3
PRX space,satellit 9
PRX space,applic 14
PRX satellit,applic 9
PRX non,commerci 0
PRX non,satellit 0
PRX non,launch 0
PRX commerci,satellit 3
PRX commerci,launch 4
PRX impact,1986 0
PRX impact,immigr 10
PRX impact,law 1
PRX 1986,immigr 1
PRX 1986,law 3
PRX immigr,law 19
PRX gener,drug 8
PRX gener,substitut 2
PRX drug,substitut 0
PRX capac,u 0
PRX capac,s 0
PRX capac,cellular 0
PRX capac,telephon 0
PRX capac,network 3
PRX u,cellular 0
PRX u,telephon 0
PRX u,network 0
PRX s,cellular 0
PRX s,telephon 0
PRX s,network 0
PRX cellular,telephon 2
PRX cellular,network 1
PRX telephon,network 1
PRX intern,terrorist 5
PRX action,intern 25
PRX action,terrorist 1
PRX econom,impact 33
PRX econom,intern 107
PRX econom,terror 0
PRX impact,intern 3
PRX impact,terror 0
PRX intern,terror 3
PRX death,cancer 1
PRX rate,new 7
PRX rate,cancer 7
PRX rate,fight 0
PRX rate,drug 0
PRX new,cancer 12
PRX new,fight 12
PRX new,drug 18
PRX cancer,fight 10
PRX cancer,drug 4
PRX fight,drug 0
PRX research,control 18
PRX research,carcinogen 0
PRX control,carcinogen 0
PRX altern,tradit 4
PRX altern,cancer 6
PRX altern,therapi 8
PRX tradit,cancer 1
PRX tradit,therapi 0
PRX cancer,therapi 14
PRX anti,smoke 2
PRX anti,action 0
PRX anti,govern 2
PRX smoke,action 5
PRX smoke,govern 1
PRX action,govern 3
PRX medic,ethic 2
PRX medic,modern 2
PRX medic,technolog 20
PRX ethic,modern 3
PRX ethic,technolog 1
PRX modern,technolog 6
PRX u,u 495
PRX u,ssr 0
PRX u,arm 0
PRX u,agreement 0
PRX s,u 0
PRX s,ssr 0
PRX s,arm 0
PRX s,agreement 0
PRX ssr,arm 25
PRX ssr,control 0
PRX ssr,agreement 0
PRX arm,control 61
PRX arm,agreement 2
PRX control,agreement 3
PRX privat,state 15
PRX privat,asset 3
PRX state,asset 2
PRX soviet,soviet 6658
PRX soviet,spy 0
PRX soviet,u 0
PRX soviet,s 0
PRX spy,u 0
PRX spy,s 0
PRX jewish,jewish 3476
PRX jewish,emigr 3
PRX jewish,u 0
PRX jewish,s 0
PRX jewish,relat 7
PRX emigr,u 0
PRX emigr,s 0
PRX emigr,relat 0
PRX u,relat 0
PRX s,relat 0
PRX mcdonnel,dougla 205
PRX mcdonnel,contract 0
PRX mcdonnel,militari 0
PRX mcdonnel,aircraft 1
PRX dougla,contract 0
PRX dougla,militari 4
PRX dougla,aircraft 4
PRX contract,militari 1
PRX contract,aircraft 0
PRX militari,aircraft 139
PRX stealth,aircraft 0
PRX hubbl,hubbl 117
PRX hubbl,space 13
PRX hubbl,telescop 7
PRX space,telescop 26
PRX human,genom 37
PRX human,project 11
PRX genom,project 3
PRX possibl,contribut 0
PRX possibl,gene 0
PRX possibl,map 0
PRX possibl,medicin 0
PRX contribut,gene 0
PRX contribut,map 0
PRX contribut,medicin 0
PRX gene,map 0
PRX gene,medicin 0
PRX map,medicin 0
PRX diversif,pacif 0
PRX diversif,telesi 0
PRX pacif,telesi 2
PRX pacif,pacif 6960
PRX telesi,pacif 3
PRX telesi,telesi 3
PRX expans,u 0
PRX expans,s 0
PRX expans,theme 0
PRX expans,park 3
PRX expans,industri 4
PRX u,theme 0
PRX u,park 0
PRX u,industri 0
PRX s,theme 0
PRX s,park 0
PRX s,industri 0
PRX theme,park 65
PRX theme,industri 0
PRX park,industri 129
PRX iranian,iranian 1931
PRX iranian,support 5
PRX iranian,lebanes 0
PRX iranian,hostag 7
PRX iranian,taker 0
PRX support,lebanes 1
PRX support,hostag 0
PRX support,taker 0
PRX lebanes,hostag 1
PRX lebanes,taker 0
PRX hostag,taker 0
PRX iran,islam 218
PRX iran,revolut 24
PRX iran,domest 1
PRX iran,foreign 26
PRX iran,social 12
PRX islam,revolut 36
PRX islam,domest 8
PRX islam,foreign 2
PRX islam,social 9
PRX revolut,domest 3
PRX revolut,foreign 0
PRX revolut,social 19
PRX domest,foreign 27
PRX domest,social 2
PRX foreign,social 2
PRX polit,impact 4
PRX polit,islam 20
PRX polit,fundament 0
PRX impact,islam 0
PRX impact,fundament 0
PRX islam,fundament 9
PRX japan,handl 0
PRX japan,trade 21
PRX japan,surplu 0
PRX japan,u 0
PRX japan,s 1
PRX handl,trade 0
PRX handl,surplu 0
PRX handl,u 0
PRX handl,s 0
PRX trade,surplu 0
PRX trade,u 0
PRX trade,s 0
PRX surplu,u 0
PRX surplu,s 0
PRX impact,govern 0
PRX impact,regul 1
PRX impact,grain 0
PRX impact,farm 1
PRX govern,regul 5
PRX govern,grain 0
PRX govern,farm 2
PRX govern,intern 21
PRX regul,grain 0
PRX regul,farm 0
PRX regul,intern 37
PRX grain,farm 0
PRX grain,intern 4
PRX farm,intern 6
PRX protect,u 0
PRX protect,s 0
PRX protect,farmer 0
PRX u,farmer 0
PRX s,farmer 0
PRX manag,problem 2
PRX manag,unit 63
PRX manag,nation 170
PRX problem,unit 10
PRX problem,nation 9
PRX unit,nation 5066
PRX influenc,pro 0
PRX influenc,israel 0
PRX influenc,lobbi 1
PRX pro,israel 0
PRX pro,lobbi 0
PRX israel,israel 2945
PRX israel,lobbi 15
PRX negoti,end 3
PRX negoti,nicaraguan 0
PRX negoti,civil 0
PRX negoti,war 0
PRX end,nicaraguan 0
PRX end,civil 5
PRX end,war 66
PRX nicaraguan,nicaraguan 235
PRX nicaraguan,civil 9
PRX nicaraguan,war 4
PRX civil,war 1189
PRX product,trend 0
PRX product,u 0
PRX product,s 0
PRX product,economi 0
PRX trend,u 0
PRX trend,s 0
PRX trend,economi 0
PRX u,economi 0
PRX s,economi 0
PRX conflict,horn 4
PRX conflict,africa 1
PRX horn,africa 52
PRX africa,africa 3286
PRX industri,espionag 1
PRX espionag,espionag 87
PRX u,polit 0
PRX u,campaign 0
PRX u,financ 0
PRX s,polit 0
PRX s,campaign 0
PRX s,financ 0
PRX polit,campaign 15
PRX polit,financ 6
PRX campaign,financ 28
PRX cope,overcrowd 0
PRX cope,prison 0
PRX overcrowd,prison 3
PRX accus,cheat 0
PRX accus,contractor 0
PRX accus,us 0
PRX accus,defens 0
PRX accus,project 0
PRX cheat,contractor 0
PRX cheat,us 0
PRX cheat,defens 0
PRX cheat,project 0
PRX contractor,us 0
PRX contractor,defens 7
PRX contractor,project 0
PRX us,defens 0
PRX us,project 0
PRX defens,project 8
PRX insur,coverag 2
PRX insur,pai 0
PRX insur,long 1
PRX insur,term 5
PRX insur,care 5
PRX coverag,pai 0
PRX coverag,long 0
PRX coverag,term 0
PRX coverag,care 1
PRX pai,long 0
PRX pai,term 0
PRX pai,care 0
PRX long,term 69
PRX long,care 13
PRX term,care 9
PRX oil,spill 46
PRX right,wing 28
PRX right,christian 17
PRX right,fundament 65
PRX right,us 0
PRX wing,christian 1
PRX wing,fundament 0
PRX wing,us 0
PRX christian,fundament 9
PRX christian,us 0
PRX fundament,us 0
PRX effort,enact 0
PRX effort,gun 0
PRX effort,control 0
PRX effort,legisl 0
PRX enact,gun 0
PRX enact,control 0
PRX enact,legisl 1
PRX gun,control 41
PRX gun,legisl 2
PRX control,legisl 2
PRX caus,treatment 0
PRX caus,multipl 0
PRX caus,sclerosi 0
PRX caus,ms 0
PRX treatment,multipl 4
PRX treatment,sclerosi 0
PRX treatment,ms 0
PRX multipl,sclerosi 27
PRX multipl,ms 0
PRX sclerosi,ms 0
PRX term,limit 20
PRX term,member 0
PRX term,us 0
PRX term,congress 0
PRX term,propos 2
PRX term,try 0
PRX term,place 0
PRX term,number 2
PRX term,term 1111
PRX term,discuss 0
PRX term,subject 1
PRX term,consecut 0
PRX limit,member 0
PRX limit,us 0
PRX limit,congress 0
PRX limit,propos 0
PRX limit,try 0
PRX limit,place 2
PRX limit,limit 1668
PRX limit,number 0
PRX limit,term 31
PRX limit,discuss 0
PRX limit,subject 2
PRX limit,consecut 0
PRX member,us 0
PRX member,congress 59
PRX member,propos 0
PRX member,try 0
PRX member,place 0
PRX member,limit 0
PRX member,number 4
PRX member,term 1
PRX member,member 7023
PRX member,discuss 0
PRX member,subject 0
PRX member,consecut 0
PRX us,congress 0
PRX us,propos 1
PRX us,try 0
PRX us,place 1
PRX us,limit 0
PRX us,number 0
PRX us,term 0
PRX us,member 0
PRX us,discuss 0
PRX us,subject 0
PRX us,consecut 0
PRX congress,propos 2
PRX congress,try 0
PRX congress,place 0
PRX congress,limit 0
PRX congress,number 0
PRX congress,term 0
PRX congress,member 103
PRX congress,discuss 0
PRX congress,subject 6
PRX congress,consecut 0
PRX propos,try 0
PRX propos,place 0
PRX propos,limit 0
PRX propos,number 1
PRX propos,term 2
PRX propos,member 0
PRX propos,discuss 0
PRX propos,subject 0
PRX propos,consecut 0
PRX try,place 0
PRX try,limit 0
PRX try,number 0
PRX try,term 0
PRX try,member 0
PRX try,discuss 0
PRX try,subject 0
PRX try,consecut 0
PRX place,limit 1
PRX place,number 9
PRX place,term 0
PRX place,member 0
PRX place,discuss 0
PRX place,subject 0
PRX place,consecut 0
PRX number,term 2
PRX number,member 1
PRX number,discuss 0
PRX number,subject 0
PRX number,limit 1
PRX number,number 6474
PRX number,consecut 2
PRX discuss,subject 0
PRX discuss,limit 0
PRX discuss,number 0
PRX discuss,consecut 0
PRX subject,limit 2
PRX subject,number 0
PRX subject,consecut 0
PRX electr,car 52
PRX electr,develop 4
PRX car,develop 10
PRX vitamin,cure 0
PRX vitamin,caus 0
PRX cure,caus 0
PRX acid,rain 12
PRX automobil,recal 0
PRX automobil,vehicl 1
PRX automobil,purpos 0
PRX automobil,number 4
PRX recal,vehicl 13
PRX recal,purpos 0
PRX recal,recal 125
PRX recal,number 0
PRX vehicl,purpos 10
PRX vehicl,recal 0
PRX vehicl,number 6
PRX purpos,recal 0
PRX purpos,number 0
PRX vietnam,veteran 54
PRX vietnam,agent 1
PRX vietnam,orang 1
PRX vietnam,serv 0
PRX vietnam,south 123
PRX vietnam,vietnam 1245
PRX vietnam,number 2
PRX vietnam,us 0
PRX vietnam,soldier 2
PRX vietnam,issu 5
PRX vietnam,entitl 0
PRX vietnam,award 8
PRX vietnam,monetari 0
PRX veteran,agent 0
PRX veteran,orang 0
PRX veteran,serv 0
PRX veteran,south 9
PRX veteran,vietnam 67
PRX veteran,number 0
PRX veteran,us 1
PRX veteran,soldier 0
PRX veteran,issu 0
PRX veteran,veteran 973
PRX veteran,entitl 0
PRX veteran,award 1
PRX veteran,monetari 0
PRX agent,orang 16
PRX agent,serv 0
PRX agent,south 2
PRX agent,vietnam 0
PRX agent,number 0
PRX agent,us 0
PRX agent,soldier 0
PRX agent,issu 0
PRX agent,veteran 0
PRX agent,entitl 0
PRX agent,award 0
PRX agent,monetari 0
PRX orang,serv 0
PRX orang,south 50
PRX orang,vietnam 0
PRX orang,number 1
PRX orang,us 0
PRX orang,soldier 3
PRX orang,issu 0
PRX orang,veteran 0
PRX orang,entitl 0
PRX orang,award 2
PRX orang,monetari 0
PRX serv,south 3
PRX serv,vietnam 0
PRX serv,number 0
PRX serv,us 1
PRX serv,soldier 1
PRX serv,issu 0
PRX serv,veteran 0
PRX serv,entitl 0
PRX serv,award 0
PRX serv,monetari 0
PRX south,vietnam 36
PRX south,number 26
PRX south,us 1
PRX south,soldier 3
PRX south,issu 5
PRX south,veteran 8
PRX south,entitl 0
PRX south,award 108
PRX south,monetari 1
PRX number,us 0
PRX number,soldier 0
PRX number,issu 1
PRX number,veteran 0
PRX number,entitl 0
PRX number,award 1
PRX number,monetari 0
PRX us,soldier 0
PRX us,issu 0
PRX us,veteran 0
PRX us,entitl 0
PRX us,award 0
PRX us,monetari 0
PRX soldier,issu 0
PRX soldier,veteran 0
PRX soldier,entitl 0
PRX soldier,award 1
PRX soldier,monetari 0
PRX issu,veteran 0
PRX issu,entitl 0
PRX issu,award 2
PRX issu,monetari 0
PRX entitl,award 0
PRX entitl,monetari 0
PRX award,monetari 0
PRX gener,illeg 0
PRX gener,activ 2
PRX gener,manufactur 4
PRX drug,illeg 56
PRX drug,activ 0
PRX drug,manufactur 2
PRX illeg,activ 1
PRX illeg,manufactur 0
PRX activ,manufactur 0
PRX tobacco,compani 22
PRX tobacco,advertis 4
PRX tobacco,young 3
PRX compani,advertis 11
PRX compani,young 11
PRX advertis,young 1
PRX standard,test 29
PRX standard,cultur 1
PRX standard,bia 0
PRX test,cultur 6
PRX test,bia 1
PRX cultur,bia 0
PRX regul,show 0
PRX regul,violenc 0
PRX regul,explicit 0
PRX show,violenc 0
PRX show,explicit 0
PRX violenc,explicit 0
PRX financ,amtrak 0
PRX cost,garbag 0
PRX cost,trash 0
PRX cost,remov 0
PRX garbag,trash 1
PRX garbag,remov 0
PRX trash,remov 0
PRX consequ,implant 0
PRX consequ,silicon 0
PRX consequ,gel 0
PRX implant,silicon 3
PRX implant,gel 0
PRX silicon,gel 0
PRX us,mutual 0
PRX us,fund 0
PRX us,individu 0
PRX us,s 0
PRX mutual,fund 27
PRX mutual,individu 0
PRX mutual,s 0
PRX fund,individu 1
PRX fund,s 0
PRX individu,s 0
PRX effect,medic 4
PRX effect,product 5
PRX medic,product 5
PRX smoke,ban 13
PRX hazard,wast 20
PRX hazard,cleanup 0
PRX hazard,superfund 0
PRX hazard,law 0
PRX hazard,associ 3
PRX hazard,cost 0
PRX hazard,known 0
PRX hazard,number 0
PRX hazard,site 2
PRX wast,cleanup 0
PRX wast,superfund 4
PRX wast,law 1
PRX wast,associ 2
PRX wast,cost 0
PRX wast,known 0
PRX wast,number 3
PRX wast,site 4
PRX cleanup,superfund 0
PRX cleanup,law 0
PRX cleanup,associ 0
PRX cleanup,cost 0
PRX cleanup,known 0
PRX cleanup,number 0
PRX cleanup,site 0
PRX superfund,law 0
PRX superfund,associ 0
PRX superfund,cost 0
PRX superfund,known 0
PRX superfund,number 0
PRX superfund,site 65
PRX law,associ 52
PRX law,cost 7
PRX law,known 0
PRX law,number 6
PRX law,site 0
PRX associ,cost 7
PRX associ,known 1
PRX associ,number 9
PRX associ,site 11
PRX cost,known 0
PRX cost,number 0
PRX cost,site 0
PRX known,number 0
PRX known,site 0
PRX number,site 2
PRX nra,prevent 0
PRX nra,gun 1
PRX nra,control 0
PRX nra,legisl 0
PRX prevent,gun 9
PRX prevent,control 45
PRX prevent,legisl 2
PRX real,life 116
PRX real,privat 2
PRX real,investig 0
PRX life,privat 67
PRX life,investig 1
PRX privat,investig 3
PRX english,offici 8
PRX english,languag 187
PRX english,us 0
PRX offici,languag 73
PRX offici,us 0
PRX languag,us 0
PRX dog,maul 0
PRX dog,breed 30
PRX dog,number 0
PRX dog,dog 3172
PRX dog,s 1
PRX dog,known 0
PRX dog,result 0
PRX dog,injuri 0
PRX dog,death 3
PRX dog,report 0
PRX maul,breed 0
PRX maul,number 0
PRX maul,dog 0
PRX maul,s 0
PRX maul,known 0
PRX maul,result 0
PRX maul,injuri 0
PRX maul,death 0
PRX maul,report 0
PRX breed,number 0
PRX breed,dog 60
PRX breed,s 0
PRX breed,known 0
PRX breed,result 0
PRX breed,injuri 0
PRX breed,death 0
PRX breed,report 0
PRX number,dog 0
PRX number,s 0
PRX number,known 2
PRX number,result 1
PRX number,injuri 0
PRX number,death 6
PRX number,report 6
PRX s,known 0
PRX s,result 0
PRX s,injuri 0
PRX s,death 0
PRX s,report 0
PRX s,number 0
PRX known,result 0
PRX known,injuri 0
PRX known,death 0
PRX known,report 0
PRX result,injuri 0
PRX result,death 0
PRX result,report 0
PRX result,number 1
PRX injuri,death 2
PRX injuri,report 2
PRX injuri,number 0
PRX injuri,injuri 201
PRX death,report 11
PRX death,number 5
PRX death,injuri 7
PRX report,number 2
PRX report,injuri 2
PRX us,restaur 0
PRX us,foreign 0
PRX us,land 0
PRX restaur,foreign 0
PRX restaur,land 1
PRX foreign,land 4
PRX ineffect,us 0
PRX ineffect,embargo 0
PRX ineffect,sanction 0
PRX us,embargo 0
PRX us,sanction 0
PRX embargo,sanction 0
PRX abus,elderli 1
PRX abus,famili 2
PRX abus,member 8
PRX abus,medic 3
PRX elderli,famili 0
PRX elderli,member 0
PRX elderli,medic 0
PRX famili,member 119
PRX famili,medic 11
PRX member,medic 3
PRX commerci,overfish 0
PRX commerci,creat 0
PRX commerci,food 7
PRX commerci,fish 8
PRX commerci,deficit 0
PRX overfish,creat 0
PRX overfish,food 0
PRX overfish,fish 0
PRX overfish,deficit 0
PRX creat,food 1
PRX creat,fish 0
PRX creat,deficit 0
PRX food,fish 14
PRX food,deficit 0
PRX fish,deficit 0
PRX asbesto,relat 1
PRX asbesto,lawsuit 0
PRX relat,lawsuit 0
PRX corpor,pension 6
PRX corpor,plan 2
PRX corpor,fund 14
PRX pension,plan 4
PRX pension,fund 15
PRX plan,fund 0
PRX reform,us 0
PRX reform,welfar 15
PRX reform,system 11
PRX us,welfar 0
PRX us,system 0
PRX welfar,system 1
PRX differ,learn 4
PRX differ,level 1
PRX differ,among 1
PRX differ,inner 0
PRX learn,level 4
PRX learn,among 0
PRX learn,inner 0
PRX level,among 0
PRX level,inner 0
PRX among,inner 0
PRX sign,demis 0
PRX sign,independ 0
PRX sign,publish 2
PRX demis,independ 0
PRX demis,publish 0
PRX independ,publish 14
PRX beachfront,eros 0
PRX real,motiv 0
PRX real,murder 4
PRX motiv,murder 0
PRX instanc,fraud 0
PRX instanc,involv 0
PRX instanc,us 0
PRX instanc,comput 1
PRX fraud,involv 0
PRX fraud,us 0
PRX fraud,comput 10
PRX involv,us 0
PRX involv,comput 2
PRX us,comput 0
PRX effort,improv 2
PRX effort,us 0
PRX effort,school 0
PRX improv,us 0
PRX improv,school 12
PRX us,school 1
PRX oil,cleanup 3
PRX oil,sprai 0
PRX oil,etc 0
PRX oil,relev 0
PRX oil,refer 0
PRX oil,cost 0
PRX oil,number 1
PRX spill,cleanup 0
PRX spill,sprai 0
PRX spill,etc 0
PRX spill,relev 0
PRX spill,refer 0
PRX spill,cost 0
PRX spill,number 0
PRX cleanup,sprai 0
PRX cleanup,etc 0
PRX cleanup,relev 0
PRX cleanup,refer 0
PRX cleanup,cleanup 39
PRX sprai,etc 0
PRX sprai,relev 0
PRX sprai,refer 0
PRX sprai,cost 0
PRX sprai,cleanup 0
PRX sprai,number 0
PRX etc,relev 0
PRX etc,refer 0
PRX etc,cost 0
PRX etc,cleanup 0
PRX etc,number 0
PRX relev,refer 0
PRX relev,cost 0
PRX relev,cleanup 0
PRX relev,number 0
PRX refer,cost 0
PRX refer,cleanup 0
PRX refer,number 0
PRX cost,cleanup 0
PRX toi,r 0
PRX toi,danger 0
PRX toi,caus 0
PRX toi,child 0
PRX toi,relev 0
PRX toi,document 0
PRX toi,mai 0
PRX toi,present 0
PRX toi,inform 1
PRX toi,number 0
PRX r,danger 0
PRX r,caus 0
PRX r,child 0
PRX r,relev 0
PRX r,document 0
PRX r,mai 0
PRX r,present 0
PRX r,inform 0
PRX r,number 0
PRX danger,caus 1
PRX danger,child 1
PRX danger,relev 0
PRX danger,document 0
PRX danger,mai 0
PRX danger,present 21
PRX danger,inform 1
PRX danger,number 0
PRX caus,child 3
PRX caus,relev 0
PRX caus,document 0
PRX caus,mai 1
PRX caus,present 1
PRX caus,inform 0
PRX caus,number 0
PRX child,relev 2
PRX child,document 2
PRX child,mai 0
PRX child,present 3
PRX child,inform 4
PRX child,number 2
PRX relev,document 0
PRX relev,mai 0
PRX relev,present 0
PRX relev,inform 2
PRX document,mai 0
PRX document,present 0
PRX document,inform 21
PRX document,number 2
PRX mai,present 1
PRX mai,inform 0
PRX mai,number 0
PRX present,inform 1
PRX present,number 0
PRX inform,number 2
PRX amount,monei 0
PRX amount,earn 0
PRX amount,writer 0
PRX monei,earn 0
PRX monei,writer 0
PRX earn,writer 0
PRX stock,market 109
PRX stock,perturb 0
PRX stock,attribut 0
PRX market,perturb 0
PRX market,attribut 1
PRX perturb,attribut 0
PRX school,choic 18
PRX school,voucher 2
PRX school,system 52
PRX school,effect 2
PRX choic,voucher 2
PRX choic,system 0
PRX choic,effect 1
PRX voucher,system 0
PRX voucher,effect 0
PRX system,effect 13
PRX reform,jurisprud 0
PRX jurisprud,system 0
PRX gene,therapi 13
PRX gene,benefit 0
PRX therapi,benefit 0
PRX legal,medic 3
PRX legal,assist 20
PRX legal,suicid 0
PRX medic,assist 14
PRX medic,suicid 2
PRX assist,suicid 4
PRX impact,foreign 0
PRX impact,textil 0
PRX impact,import 0
PRX impact,us 0
PRX foreign,textil 0
PRX foreign,import 0
PRX foreign,us 0
PRX textil,import 0
PRX textil,us 0
PRX import,us 0
