,mean_fit_time,mean_score_time,mean_test_score,mean_train_score,param_C,param_degree,params,rank_test_score,split0_test_score,split0_train_score,split1_test_score,split1_train_score,split2_test_score,split2_train_score,std_fit_time,std_score_time,std_test_score,std_train_score
0,0.891829649607,0.533474127452,0.9136,0.981598752196,1,1,"{'C': 1, 'degree': 1}",1,0.931096464949,0.975983188232,0.902219556089,0.986798679868,0.907451923077,0.982014388489,0.0297217521369,0.0327818633754,0.0125675990908,0.00442517645443
1,0.931486288706,0.530536015828,0.9136,0.981598752196,1,2,"{'C': 1, 'degree': 2}",1,0.931096464949,0.975983188232,0.902219556089,0.986798679868,0.907451923077,0.982014388489,0.0469703834338,0.032034697245,0.0125675990908,0.00442517645443
2,0.897193988164,0.524126291275,0.9136,0.981598752196,1,3,"{'C': 1, 'degree': 3}",1,0.931096464949,0.975983188232,0.902219556089,0.986798679868,0.907451923077,0.982014388489,0.0262712102296,0.0321090070535,0.0125675990908,0.00442517645443
3,1.03522268931,0.67325703303,0.9136,0.981598752196,1,4,"{'C': 1, 'degree': 4}",1,0.931096464949,0.975983188232,0.902219556089,0.986798679868,0.907451923077,0.982014388489,0.115141230178,0.0616974961506,0.0125675990908,0.00442517645443
4,1.24119098981,0.737231969833,0.9136,0.981598752196,1,5,"{'C': 1, 'degree': 5}",1,0.931096464949,0.975983188232,0.902219556089,0.986798679868,0.907451923077,0.982014388489,0.0511447769526,0.0349750693433,0.0125675990908,0.00442517645443
5,1.26457762718,0.738399664561,0.9136,0.981598752196,1,6,"{'C': 1, 'degree': 6}",1,0.931096464949,0.975983188232,0.902219556089,0.986798679868,0.907451923077,0.982014388489,0.054994989839,0.0259308697171,0.0125675990908,0.00442517645443
6,1.14843527476,0.664325316747,0.9136,0.981598752196,1,7,"{'C': 1, 'degree': 7}",1,0.931096464949,0.975983188232,0.902219556089,0.986798679868,0.907451923077,0.982014388489,0.181546777227,0.11388648541,0.0125675990908,0.00442517645443
7,0.987335999807,0.582753419876,0.9136,0.981598752196,1,8,"{'C': 1, 'degree': 8}",1,0.931096464949,0.975983188232,0.902219556089,0.986798679868,0.907451923077,0.982014388489,0.0906793900166,0.038850036837,0.0125675990908,0.00442517645443
8,0.945221583049,0.527738332748,0.9136,0.981598752196,1,9,"{'C': 1, 'degree': 9}",1,0.931096464949,0.975983188232,0.902219556089,0.986798679868,0.907451923077,0.982014388489,0.0341066706178,0.0194336045235,0.0125675990908,0.00442517645443
9,0.925285021464,0.511978387833,0.9076,0.989599195228,2,1,"{'C': 2, 'degree': 1}",10,0.918514080288,0.984989492645,0.901619676065,0.994599459946,0.902644230769,0.989208633094,0.015988027742,0.017483942972,0.00773683167254,0.00393296088361
10,0.898465394974,0.491587003072,0.9076,0.989599195228,2,2,"{'C': 2, 'degree': 2}",10,0.918514080288,0.984989492645,0.901619676065,0.994599459946,0.902644230769,0.989208633094,0.0307805040788,0.0254491501028,0.00773683167254,0.00393296088361
11,0.978490988413,0.506729046504,0.9076,0.989599195228,2,3,"{'C': 2, 'degree': 3}",10,0.918514080288,0.984989492645,0.901619676065,0.994599459946,0.902644230769,0.989208633094,0.100875723827,0.0290043901503,0.00773683167254,0.00393296088361
12,0.979489247004,0.544863700867,0.9076,0.989599195228,2,4,"{'C': 2, 'degree': 4}",10,0.918514080288,0.984989492645,0.901619676065,0.994599459946,0.902644230769,0.989208633094,0.0714099025713,0.0389798380881,0.00773683167254,0.00393296088361
13,0.936477343241,0.516003052394,0.9076,0.989599195228,2,5,"{'C': 2, 'degree': 5}",10,0.918514080288,0.984989492645,0.901619676065,0.994599459946,0.902644230769,0.989208633094,0.0482438290867,0.0433761358394,0.00773683167254,0.00393296088361
14,0.937825600306,0.527477661769,0.9076,0.989599195228,2,6,"{'C': 2, 'degree': 6}",10,0.918514080288,0.984989492645,0.901619676065,0.994599459946,0.902644230769,0.989208633094,0.0265521184533,0.0159595148531,0.00773683167254,0.00393296088361
15,0.901201725006,0.491812944412,0.9076,0.989599195228,2,7,"{'C': 2, 'degree': 7}",10,0.918514080288,0.984989492645,0.901619676065,0.994599459946,0.902644230769,0.989208633094,0.0285235375803,0.0195764169674,0.00773683167254,0.00393296088361
16,1.03021963437,0.578400373459,0.9076,0.989599195228,2,8,"{'C': 2, 'degree': 8}",10,0.918514080288,0.984989492645,0.901619676065,0.994599459946,0.902644230769,0.989208633094,0.128357242836,0.113936445209,0.00773683167254,0.00393296088361
17,0.985069036484,0.521263360977,0.9076,0.989599195228,2,9,"{'C': 2, 'degree': 9}",10,0.918514080288,0.984989492645,0.901619676065,0.994599459946,0.902644230769,0.989208633094,0.062854384051,0.0161055948637,0.00773683167254,0.00393296088361
18,0.96959733963,0.519513368607,0.9056,0.992899436674,3,1,"{'C': 3, 'degree': 1}",19,0.910724985021,0.989492644851,0.900419916017,0.996699669967,0.905649038462,0.992505995204,0.0384033971551,0.0196526498568,0.00420885102197,0.00295537926467
19,1.01907436053,0.531661907832,0.9056,0.992899436674,3,2,"{'C': 3, 'degree': 2}",19,0.910724985021,0.989492644851,0.900419916017,0.996699669967,0.905649038462,0.992505995204,0.120701824395,0.00228790573242,0.00420885102197,0.00295537926467
20,0.97274462382,0.521989663442,0.9056,0.992899436674,3,3,"{'C': 3, 'degree': 3}",19,0.910724985021,0.989492644851,0.900419916017,0.996699669967,0.905649038462,0.992505995204,0.0386633487791,0.0267396562894,0.00420885102197,0.00295537926467
21,0.999180634816,0.564805269241,0.9056,0.992899436674,3,4,"{'C': 3, 'degree': 4}",19,0.910724985021,0.989492644851,0.900419916017,0.996699669967,0.905649038462,0.992505995204,0.0621120617914,0.0333764453652,0.00420885102197,0.00295537926467
22,0.892835060755,0.489295005798,0.9056,0.992899436674,3,5,"{'C': 3, 'degree': 5}",19,0.910724985021,0.989492644851,0.900419916017,0.996699669967,0.905649038462,0.992505995204,0.0285592794822,0.0186368406172,0.00420885102197,0.00295537926467
23,0.905317703883,0.5044790109,0.9056,0.992899436674,3,6,"{'C': 3, 'degree': 6}",19,0.910724985021,0.989492644851,0.900419916017,0.996699669967,0.905649038462,0.992505995204,0.0565820367715,0.0359189449364,0.00420885102197,0.00295537926467
24,0.907557725906,0.504174311956,0.9056,0.992899436674,3,7,"{'C': 3, 'degree': 7}",19,0.910724985021,0.989492644851,0.900419916017,0.996699669967,0.905649038462,0.992505995204,0.0330776059766,0.0246772868666,0.00420885102197,0.00295537926467
25,0.939457337062,0.53154929479,0.9056,0.992899436674,3,8,"{'C': 3, 'degree': 8}",19,0.910724985021,0.989492644851,0.900419916017,0.996699669967,0.905649038462,0.992505995204,0.0520607079873,0.00661824622037,0.00420885102197,0.00295537926467
26,1.42717266083,0.683396657308,0.9056,0.992899436674,3,9,"{'C': 3, 'degree': 9}",19,0.910724985021,0.989492644851,0.900419916017,0.996699669967,0.905649038462,0.992505995204,0.150603957803,0.0541606962815,0.00420885102197,0.00295537926467
27,1.29462536176,0.715764284134,0.9016,0.994699767487,4,1,"{'C': 4, 'degree': 1}",28,0.905931695626,0.992494746322,0.898020395921,0.997599759976,0.900841346154,0.994004796163,0.0582069299711,0.0303095790318,0.00327519052195,0.00214126597395
28,1.30096292496,0.722320715586,0.9016,0.994699767487,4,2,"{'C': 4, 'degree': 2}",28,0.905931695626,0.992494746322,0.898020395921,0.997599759976,0.900841346154,0.994004796163,0.0674797273324,0.033097515427,0.00327519052195,0.00214126597395
29,0.986449956894,0.533709367116,0.9016,0.994699767487,4,3,"{'C': 4, 'degree': 3}",28,0.905931695626,0.992494746322,0.898020395921,0.997599759976,0.900841346154,0.994004796163,0.0352313142995,0.01619511699,0.00327519052195,0.00214126597395
30,1.00015830994,0.528835058212,0.9016,0.994699767487,4,4,"{'C': 4, 'degree': 4}",28,0.905931695626,0.992494746322,0.898020395921,0.997599759976,0.900841346154,0.994004796163,0.0858680310723,0.0224092818444,0.00327519052195,0.00214126597395
31,0.987142086029,0.502827644348,0.9016,0.994699767487,4,5,"{'C': 4, 'degree': 5}",28,0.905931695626,0.992494746322,0.898020395921,0.997599759976,0.900841346154,0.994004796163,0.0269860442964,0.0256592002135,0.00327519052195,0.00214126597395
32,0.983096996943,0.53762904803,0.9016,0.994699767487,4,6,"{'C': 4, 'degree': 6}",28,0.905931695626,0.992494746322,0.898020395921,0.997599759976,0.900841346154,0.994004796163,0.0698093458316,0.0376237989461,0.00327519052195,0.00214126597395
33,1.02472758293,0.538603464762,0.9016,0.994699767487,4,7,"{'C': 4, 'degree': 7}",28,0.905931695626,0.992494746322,0.898020395921,0.997599759976,0.900841346154,0.994004796163,0.0435324636567,0.00722619868534,0.00327519052195,0.00214126597395
34,1.01502625148,0.53538775444,0.9016,0.994699767487,4,8,"{'C': 4, 'degree': 8}",28,0.905931695626,0.992494746322,0.898020395921,0.997599759976,0.900841346154,0.994004796163,0.0958455005175,0.0311065714474,0.00327519052195,0.00214126597395
35,1.20705898603,0.671255111694,0.9016,0.994699767487,4,9,"{'C': 4, 'degree': 9}",28,0.905931695626,0.992494746322,0.898020395921,0.997599759976,0.900841346154,0.994004796163,0.14523179509,0.0964505913138,0.00327519052195,0.00214126597395
36,1.31246670087,0.718504985174,0.8994,0.995999808103,5,1,"{'C': 5, 'degree': 1}",37,0.905332534452,0.994296007205,0.896820635873,0.998199819982,0.896033653846,0.995503597122,0.0706958874438,0.0188892972807,0.00421160470866,0.00163189206189
37,1.03659001986,0.544447422028,0.8994,0.995999808103,5,2,"{'C': 5, 'degree': 2}",37,0.905332534452,0.994296007205,0.896820635873,0.998199819982,0.896033653846,0.995503597122,0.0689447900449,0.0294195952957,0.00421160470866,0.00163189206189
38,0.971167564392,0.573445399602,0.8994,0.995999808103,5,3,"{'C': 5, 'degree': 3}",37,0.905332534452,0.994296007205,0.896820635873,0.998199819982,0.896033653846,0.995503597122,0.0475435680574,0.0672310615731,0.00421160470866,0.00163189206189
39,0.96108396848,0.518077770869,0.8994,0.995999808103,5,4,"{'C': 5, 'degree': 4}",37,0.905332534452,0.994296007205,0.896820635873,0.998199819982,0.896033653846,0.995503597122,0.0414786126967,0.0140117035062,0.00421160470866,0.00163189206189
40,1.05621695518,0.553760369619,0.8994,0.995999808103,5,5,"{'C': 5, 'degree': 5}",37,0.905332534452,0.994296007205,0.896820635873,0.998199819982,0.896033653846,0.995503597122,0.140742075978,0.099079990169,0.00421160470866,0.00163189206189
41,1.04537232717,0.579609711965,0.8994,0.995999808103,5,6,"{'C': 5, 'degree': 6}",37,0.905332534452,0.994296007205,0.896820635873,0.998199819982,0.896033653846,0.995503597122,0.196724230749,0.0925616596291,0.00421160470866,0.00163189206189
42,0.975134929021,0.534275372823,0.8994,0.995999808103,5,7,"{'C': 5, 'degree': 7}",37,0.905332534452,0.994296007205,0.896820635873,0.998199819982,0.896033653846,0.995503597122,0.0246269050864,0.0402933590286,0.00421160470866,0.00163189206189
43,1.00375374158,0.517512321472,0.8994,0.995999808103,5,8,"{'C': 5, 'degree': 8}",37,0.905332534452,0.994296007205,0.896820635873,0.998199819982,0.896033653846,0.995503597122,0.059206293568,0.0186177404216,0.00421160470866,0.00163189206189
44,1.0651113987,0.548182964325,0.8994,0.995999808103,5,9,"{'C': 5, 'degree': 9}",37,0.905332534452,0.994296007205,0.896820635873,0.998199819982,0.896033653846,0.995503597122,0.0504256910524,0.017912949363,0.00421160470866,0.00163189206189
45,1.04728039106,0.534879922867,0.8958,0.996400028251,6,1,"{'C': 6, 'degree': 1}",46,0.900539245057,0.995196637646,0.894421115777,0.998499849985,0.892427884615,0.995503597122,0.0189815267874,0.011305643486,0.00345188637335,0.00149007707076
46,1.05159576734,0.539416948954,0.8958,0.996400028251,6,2,"{'C': 6, 'degree': 2}",46,0.900539245057,0.995196637646,0.894421115777,0.998499849985,0.892427884615,0.995503597122,0.0586475949571,0.0219231978257,0.00345188637335,0.00149007707076
47,1.04790767034,0.527144352595,0.8958,0.996400028251,6,3,"{'C': 6, 'degree': 3}",46,0.900539245057,0.995196637646,0.894421115777,0.998499849985,0.892427884615,0.995503597122,0.048699397875,0.0309506690259,0.00345188637335,0.00149007707076
48,1.02925578753,0.54184961319,0.8958,0.996400028251,6,4,"{'C': 6, 'degree': 4}",46,0.900539245057,0.995196637646,0.894421115777,0.998499849985,0.892427884615,0.995503597122,0.0544186379038,0.0324066500525,0.00345188637335,0.00149007707076
49,1.15646068255,0.566343228022,0.8958,0.996400028251,6,5,"{'C': 6, 'degree': 5}",46,0.900539245057,0.995196637646,0.894421115777,0.998499849985,0.892427884615,0.995503597122,0.146920030089,0.0332880226675,0.00345188637335,0.00149007707076
50,1.08176104228,0.541016260783,0.8958,0.996400028251,6,6,"{'C': 6, 'degree': 6}",46,0.900539245057,0.995196637646,0.894421115777,0.998499849985,0.892427884615,0.995503597122,0.05906873398,0.0133045762166,0.00345188637335,0.00149007707076
51,1.08076834679,0.563055992126,0.8958,0.996400028251,6,7,"{'C': 6, 'degree': 7}",46,0.900539245057,0.995196637646,0.894421115777,0.998499849985,0.892427884615,0.995503597122,0.0131205265635,0.0134713803448,0.00345188637335,0.00149007707076
52,1.07450795174,0.566489378611,0.8958,0.996400028251,6,8,"{'C': 6, 'degree': 8}",46,0.900539245057,0.995196637646,0.894421115777,0.998499849985,0.892427884615,0.995503597122,0.0507360945526,0.0198209854409,0.00345188637335,0.00149007707076
53,1.03563364347,0.53004360199,0.8958,0.996400028251,6,9,"{'C': 6, 'degree': 9}",46,0.900539245057,0.995196637646,0.894421115777,0.998499849985,0.892427884615,0.995503597122,0.0605304213079,0.0143440806767,0.00345188637335,0.00149007707076
54,1.03362496694,0.554436683655,0.8946,0.99699999859,7,1,"{'C': 7, 'degree': 1}",55,0.900539245057,0.996097268088,0.893221355729,0.998499849985,0.890024038462,0.996402877698,0.028674249008,0.0202908103064,0.00440193053906,0.00106786858224
55,1.12697203954,0.56945625941,0.8946,0.99699999859,7,2,"{'C': 7, 'degree': 2}",55,0.900539245057,0.996097268088,0.893221355729,0.998499849985,0.890024038462,0.996402877698,0.0800264951963,0.0369465817689,0.00440193053906,0.00106786858224
56,1.06580630938,0.578799962997,0.8946,0.99699999859,7,3,"{'C': 7, 'degree': 3}",55,0.900539245057,0.996097268088,0.893221355729,0.998499849985,0.890024038462,0.996402877698,0.0377797081572,0.0381945107058,0.00440193053906,0.00106786858224
57,1.0697936217,0.564459085464,0.8946,0.99699999859,7,4,"{'C': 7, 'degree': 4}",55,0.900539245057,0.996097268088,0.893221355729,0.998499849985,0.890024038462,0.996402877698,0.0492527629946,0.0266061524337,0.00440193053906,0.00106786858224
58,1.12844936053,0.601027647654,0.8946,0.99699999859,7,5,"{'C': 7, 'degree': 5}",55,0.900539245057,0.996097268088,0.893221355729,0.998499849985,0.890024038462,0.996402877698,0.092547706953,0.0701909118154,0.00440193053906,0.00106786858224
59,1.11069297791,0.568269729614,0.8946,0.99699999859,7,6,"{'C': 7, 'degree': 6}",55,0.900539245057,0.996097268088,0.893221355729,0.998499849985,0.890024038462,0.996402877698,0.0504799721104,0.0283034375,0.00440193053906,0.00106786858224
60,1.0523220698,0.546668608983,0.8946,0.99699999859,7,7,"{'C': 7, 'degree': 7}",55,0.900539245057,0.996097268088,0.893221355729,0.998499849985,0.890024038462,0.996402877698,0.0432345901266,0.00978092339433,0.00440193053906,0.00106786858224
61,1.15233564377,0.654835303624,0.8946,0.99699999859,7,8,"{'C': 7, 'degree': 8}",55,0.900539245057,0.996097268088,0.893221355729,0.998499849985,0.890024038462,0.996402877698,0.137275830368,0.0908305889744,0.00440193053906,0.00106786858224
62,1.34458430608,0.707789341609,0.8946,0.99699999859,7,9,"{'C': 7, 'degree': 9}",55,0.900539245057,0.996097268088,0.893221355729,0.998499849985,0.890024038462,0.996402877698,0.0423461687449,0.0111298633591,0.00440193053906,0.00106786858224
63,1.32894961039,0.707815965017,0.8946,0.997299908767,8,1,"{'C': 8, 'degree': 1}",55,0.901737567406,0.996397478235,0.892021595681,0.998499849985,0.890024038462,0.997002398082,0.0593345384999,0.0225565225135,0.00511766908776,0.000883695347226
64,1.0761560599,0.524684985479,0.8946,0.997299908767,8,2,"{'C': 8, 'degree': 2}",55,0.901737567406,0.996397478235,0.892021595681,0.998499849985,0.890024038462,0.997002398082,0.0719694449496,0.0127285098198,0.00511766908776,0.000883695347226
65,1.05419476827,0.545293966929,0.8946,0.997299908767,8,3,"{'C': 8, 'degree': 3}",55,0.901737567406,0.996397478235,0.892021595681,0.998499849985,0.890024038462,0.997002398082,0.064763255108,0.0214925420977,0.00511766908776,0.000883695347226
66,1.01113200188,0.514664014181,0.8946,0.997299908767,8,4,"{'C': 8, 'degree': 4}",55,0.901737567406,0.996397478235,0.892021595681,0.998499849985,0.890024038462,0.997002398082,0.0751553220539,0.0125096070632,0.00511766908776,0.000883695347226
67,0.996795415878,0.515391985575,0.8946,0.997299908767,8,5,"{'C': 8, 'degree': 5}",55,0.901737567406,0.996397478235,0.892021595681,0.998499849985,0.890024038462,0.997002398082,0.0581819989409,0.0143132147643,0.00511766908776,0.000883695347226
68,1.01349623998,0.519710381826,0.8946,0.997299908767,8,6,"{'C': 8, 'degree': 6}",55,0.901737567406,0.996397478235,0.892021595681,0.998499849985,0.890024038462,0.997002398082,0.0522257995817,0.00380998037865,0.00511766908776,0.000883695347226
69,1.02528874079,0.519751946131,0.8946,0.997299908767,8,7,"{'C': 8, 'degree': 7}",55,0.901737567406,0.996397478235,0.892021595681,0.998499849985,0.890024038462,0.997002398082,0.0664136426229,0.00488059759325,0.00511766908776,0.000883695347226
70,1.11207429568,0.605581998825,0.8946,0.997299908767,8,8,"{'C': 8, 'degree': 8}",55,0.901737567406,0.996397478235,0.892021595681,0.998499849985,0.890024038462,0.997002398082,0.0891586162101,0.0774154375462,0.00511766908776,0.000883695347226
71,1.02451086044,0.495624780655,0.8946,0.997299908767,8,9,"{'C': 8, 'degree': 9}",55,0.901737567406,0.996397478235,0.892021595681,0.998499849985,0.890024038462,0.997002398082,0.226508946718,0.0449304958312,0.00511766908776,0.000883695347226
72,0.911733309428,0.478556076686,0.894,0.997899819058,9,1,"{'C': 9, 'degree': 1}",73,0.899340922708,0.996997898529,0.890821835633,0.998799879988,0.891826923077,0.997901678657,0.0344874070455,0.0149844017692,0.00380275547444,0.000735657025274
73,1.01119438807,0.523695309957,0.894,0.997899819058,9,2,"{'C': 9, 'degree': 2}",73,0.899340922708,0.996997898529,0.890821835633,0.998799879988,0.891826923077,0.997901678657,0.0616277883831,0.0311114475744,0.00380275547444,0.000735657025274
74,0.994648615519,0.505532026291,0.894,0.997899819058,9,3,"{'C': 9, 'degree': 3}",73,0.899340922708,0.996997898529,0.890821835633,0.998799879988,0.891826923077,0.997901678657,0.0305928268607,0.00898101008863,0.00380275547444,0.000735657025274
75,1.00237377485,0.524261951447,0.894,0.997899819058,9,4,"{'C': 9, 'degree': 4}",73,0.899340922708,0.996997898529,0.890821835633,0.998799879988,0.891826923077,0.997901678657,0.0538828442486,0.0220346994724,0.00380275547444,0.000735657025274
76,1.03336103757,0.506754636765,0.894,0.997899819058,9,5,"{'C': 9, 'degree': 5}",73,0.899340922708,0.996997898529,0.890821835633,0.998799879988,0.891826923077,0.997901678657,0.0252561171582,0.00771041176179,0.00380275547444,0.000735657025274
77,0.983068625132,0.503673235575,0.894,0.997899819058,9,6,"{'C': 9, 'degree': 6}",73,0.899340922708,0.996997898529,0.890821835633,0.998799879988,0.891826923077,0.997901678657,0.0386085842215,0.00929648621704,0.00380275547444,0.000735657025274
78,1.04154308637,0.556159973145,0.894,0.997899819058,9,7,"{'C': 9, 'degree': 7}",73,0.899340922708,0.996997898529,0.890821835633,0.998799879988,0.891826923077,0.997901678657,0.0451651555666,0.0279628303003,0.00380275547444,0.000735657025274
79,1.03284962972,0.538573741913,0.894,0.997899819058,9,8,"{'C': 9, 'degree': 8}",73,0.899340922708,0.996997898529,0.890821835633,0.998799879988,0.891826923077,0.997901678657,0.0472319739558,0.0158389902936,0.00380275547444,0.000735657025274
80,1.00836173693,0.537969668706,0.894,0.997899819058,9,9,"{'C': 9, 'degree': 9}",73,0.899340922708,0.996997898529,0.890821835633,0.998799879988,0.891826923077,0.997901678657,0.0705028032207,0.0215409073156,0.00380275547444,0.000735657025274
