,mean_fit_time,mean_score_time,mean_test_score,mean_train_score,param_C,param_degree,params,rank_test_score,split0_test_score,split0_train_score,split1_test_score,split1_train_score,split2_test_score,split2_train_score,std_fit_time,std_score_time,std_test_score,std_train_score
0,0.773817221324,0.46088774999,0.9136,0.981598752196,1,1,"{'C': 1, 'degree': 1}",19,0.931096464949,0.975983188232,0.902219556089,0.986798679868,0.907451923077,0.982014388489,0.0249608872612,0.0202208065319,0.0125675990908,0.00442517645443
1,0.776209672292,0.456028620402,0.936,1.0,1,2,"{'C': 1, 'degree': 2}",1,0.94907130018,1.0,0.929214157169,1.0,0.9296875,1.0,0.020656915596,0.0085633481294,0.0092545279602,0.0
2,0.769556363424,0.407778978348,0.9256,1.0,1,3,"{'C': 1, 'degree': 3}",10,0.940083882564,1.0,0.919016196761,1.0,0.917668269231,1.0,0.0207485059721,0.00751223929891,0.0102671543892,0.0
3,0.798579613368,0.410061359406,0.908,1.0,1,4,"{'C': 1, 'degree': 4}",20,0.924505692031,1.0,0.896820635873,1.0,0.902644230769,1.0,0.0184522539995,0.0203769945866,0.0119228188725,0.0
4,0.863218704859,0.406245708466,0.8908,1.0,1,5,"{'C': 1, 'degree': 5}",37,0.913121629718,1.0,0.872225554889,1.0,0.887019230769,1.0,0.0146233679478,0.0144234626069,0.0169145210683,0.0
5,0.929002285004,0.451954364777,0.869,1.0,1,6,"{'C': 1, 'degree': 6}",46,0.895745955662,1.0,0.844031193761,1.0,0.8671875,1.0,0.0263539758765,0.0676066143165,0.0211596589617,0.0
6,1.00461475054,0.43076467514,0.845,1.0,1,7,"{'C': 1, 'degree': 7}",55,0.877171959257,1.0,0.814037192561,1.0,0.84375,1.0,0.0249188169597,0.021617541372,0.0258000723187,0.0
7,1.09173432986,0.453497250875,0.819,1.0,1,8,"{'C': 1, 'degree': 8}",64,0.844218094667,1.0,0.790041991602,1.0,0.822716346154,1.0,0.0209551895469,0.0320458170413,0.022281275594,0.0
8,1.14804665248,0.482836723328,0.7988,1.0,1,9,"{'C': 1, 'degree': 9}",73,0.822648292391,1.0,0.77924415117,1.0,0.794471153846,1.0,0.03641733896,0.036387288242,0.0179884585582,0.0
9,0.761886358261,0.442058960597,0.9076,0.989599195228,2,1,"{'C': 2, 'degree': 1}",29,0.918514080288,0.984989492645,0.901619676065,0.994599459946,0.902644230769,0.989208633094,0.0248902035857,0.0203431304354,0.00773683167254,0.00393296088361
10,0.772871891658,0.457676092784,0.936,1.0,2,2,"{'C': 2, 'degree': 2}",1,0.94907130018,1.0,0.929214157169,1.0,0.9296875,1.0,0.0206622948141,0.0140453569945,0.0092545279602,0.0
11,0.764743645986,0.408017396927,0.9256,1.0,2,3,"{'C': 2, 'degree': 3}",10,0.940083882564,1.0,0.919016196761,1.0,0.917668269231,1.0,0.0190739400157,0.00605670283468,0.0102671543892,0.0
12,0.788746039073,0.395995934804,0.908,1.0,2,4,"{'C': 2, 'degree': 4}",20,0.924505692031,1.0,0.896820635873,1.0,0.902644230769,1.0,0.0192745888979,0.0101889583424,0.0119228188725,0.0
13,0.845459063848,0.406898578008,0.8908,1.0,2,5,"{'C': 2, 'degree': 5}",37,0.913121629718,1.0,0.872225554889,1.0,0.887019230769,1.0,0.0182014437201,0.0211283542578,0.0169145210683,0.0
14,0.912665923436,0.416517972946,0.869,1.0,2,6,"{'C': 2, 'degree': 6}",46,0.895745955662,1.0,0.844031193761,1.0,0.8671875,1.0,0.0231675143205,0.0160213170443,0.0211596589617,0.0
15,0.988738298416,0.429157654444,0.845,1.0,2,7,"{'C': 2, 'degree': 7}",55,0.877171959257,1.0,0.814037192561,1.0,0.84375,1.0,0.0208761082896,0.0248007192675,0.0258000723187,0.0
16,1.06912302971,0.454459269842,0.819,1.0,2,8,"{'C': 2, 'degree': 8}",64,0.844218094667,1.0,0.790041991602,1.0,0.822716346154,1.0,0.030307450565,0.0332886421774,0.022281275594,0.0
17,1.14206457138,0.47695406278,0.7988,1.0,2,9,"{'C': 2, 'degree': 9}",73,0.822648292391,1.0,0.77924415117,1.0,0.794471153846,1.0,0.0351806837894,0.030826847972,0.0179884585582,0.0
18,0.761856714884,0.438855965932,0.9056,0.992899436674,3,1,"{'C': 3, 'degree': 1}",30,0.910724985021,0.989492644851,0.900419916017,0.996699669967,0.905649038462,0.992505995204,0.0308753919076,0.0144521143714,0.00420885102197,0.00295537926467
19,0.768968979518,0.457039674123,0.936,1.0,3,2,"{'C': 3, 'degree': 2}",1,0.94907130018,1.0,0.929214157169,1.0,0.9296875,1.0,0.0220474967809,0.0136138228456,0.0092545279602,0.0
20,0.763671954473,0.404360373815,0.9256,1.0,3,3,"{'C': 3, 'degree': 3}",10,0.940083882564,1.0,0.919016196761,1.0,0.917668269231,1.0,0.0199180742997,0.00612115206946,0.0102671543892,0.0
21,0.78883767128,0.392992337545,0.908,1.0,3,4,"{'C': 3, 'degree': 4}",20,0.924505692031,1.0,0.896820635873,1.0,0.902644230769,1.0,0.0186451578273,0.00773706519053,0.0119228188725,0.0
22,0.845885356267,0.402511199315,0.8908,1.0,3,5,"{'C': 3, 'degree': 5}",37,0.913121629718,1.0,0.872225554889,1.0,0.887019230769,1.0,0.0189806113914,0.0169069333046,0.0169145210683,0.0
23,0.916134039561,0.413411299388,0.869,1.0,3,6,"{'C': 3, 'degree': 6}",46,0.895745955662,1.0,0.844031193761,1.0,0.8671875,1.0,0.0217947020135,0.0213740397354,0.0211596589617,0.0
24,0.986191590627,0.428876717885,0.845,1.0,3,7,"{'C': 3, 'degree': 7}",55,0.877171959257,1.0,0.814037192561,1.0,0.84375,1.0,0.0216173154678,0.0245982891572,0.0258000723187,0.0
25,1.06484206518,0.453801314036,0.819,1.0,3,8,"{'C': 3, 'degree': 8}",64,0.844218094667,1.0,0.790041991602,1.0,0.822716346154,1.0,0.0301566029158,0.0342815393745,0.022281275594,0.0
26,1.14590891202,0.477725028992,0.7988,1.0,3,9,"{'C': 3, 'degree': 9}",73,0.822648292391,1.0,0.77924415117,1.0,0.794471153846,1.0,0.0353339107216,0.0367335270894,0.0179884585582,0.0
27,0.770558913549,0.441408793132,0.9016,0.994699767487,4,1,"{'C': 4, 'degree': 1}",31,0.905931695626,0.992494746322,0.898020395921,0.997599759976,0.900841346154,0.994004796163,0.0294074939646,0.0192307086963,0.00327519052195,0.00214126597395
28,0.770799080531,0.45763762792,0.936,1.0,4,2,"{'C': 4, 'degree': 2}",1,0.94907130018,1.0,0.929214157169,1.0,0.9296875,1.0,0.0197825734646,0.0132881667405,0.0092545279602,0.0
29,0.76659933726,0.407018264135,0.9256,1.0,4,3,"{'C': 4, 'degree': 3}",10,0.940083882564,1.0,0.919016196761,1.0,0.917668269231,1.0,0.0194236032682,0.00470510969838,0.0102671543892,0.0
30,0.790300607681,0.397198120753,0.908,1.0,4,4,"{'C': 4, 'degree': 4}",20,0.924505692031,1.0,0.896820635873,1.0,0.902644230769,1.0,0.018875634994,0.00789204892372,0.0119228188725,0.0
31,0.842773358027,0.400280237198,0.8908,1.0,4,5,"{'C': 4, 'degree': 5}",37,0.913121629718,1.0,0.872225554889,1.0,0.887019230769,1.0,0.02388715979,0.0153577006141,0.0169145210683,0.0
32,0.912916024526,0.415407339732,0.869,1.0,4,6,"{'C': 4, 'degree': 6}",46,0.895745955662,1.0,0.844031193761,1.0,0.8671875,1.0,0.0233013324138,0.0190758500565,0.0211596589617,0.0
33,0.988808393478,0.427942673365,0.845,1.0,4,7,"{'C': 4, 'degree': 7}",55,0.877171959257,1.0,0.814037192561,1.0,0.84375,1.0,0.0200689486349,0.0197189903829,0.0258000723187,0.0
34,1.06579430898,0.452599287033,0.819,1.0,4,8,"{'C': 4, 'degree': 8}",64,0.844218094667,1.0,0.790041991602,1.0,0.822716346154,1.0,0.0316543669765,0.0300707861847,0.022281275594,0.0
35,1.14821100235,0.483950614929,0.7988,1.0,4,9,"{'C': 4, 'degree': 9}",73,0.822648292391,1.0,0.77924415117,1.0,0.794471153846,1.0,0.0385733245408,0.0379004334538,0.0179884585582,0.0
36,1.08133101463,0.508038679759,0.8994,0.995999808103,5,1,"{'C': 5, 'degree': 1}",32,0.905332534452,0.994296007205,0.896820635873,0.998199819982,0.896033653846,0.995503597122,0.271175502021,0.0559866031963,0.00421160470866,0.00163189206189
37,1.03875732422,0.768868684769,0.936,1.0,5,2,"{'C': 5, 'degree': 2}",1,0.94907130018,1.0,0.929214157169,1.0,0.9296875,1.0,0.212360149743,0.231924117146,0.0092545279602,0.0
38,1.47434727351,0.577177365621,0.9256,1.0,5,3,"{'C': 5, 'degree': 3}",10,0.940083882564,1.0,0.919016196761,1.0,0.917668269231,1.0,0.168007953947,0.148995592773,0.0102671543892,0.0
39,0.885455290476,0.44923265775,0.908,1.0,5,4,"{'C': 5, 'degree': 4}",20,0.924505692031,1.0,0.896820635873,1.0,0.902644230769,1.0,0.0107107927434,0.02992318892,0.0119228188725,0.0
40,1.03721189499,0.434015115102,0.8908,1.0,5,5,"{'C': 5, 'degree': 5}",37,0.913121629718,1.0,0.872225554889,1.0,0.887019230769,1.0,0.234842384847,0.0369002634903,0.0169145210683,0.0
41,1.09246730804,0.445461273193,0.869,1.0,5,6,"{'C': 5, 'degree': 6}",46,0.895745955662,1.0,0.844031193761,1.0,0.8671875,1.0,0.104657056199,0.038938149657,0.0211596589617,0.0
42,1.05311894417,0.476462761561,0.845,1.0,5,7,"{'C': 5, 'degree': 7}",55,0.877171959257,1.0,0.814037192561,1.0,0.84375,1.0,0.033149740316,0.0608832825485,0.0258000723187,0.0
43,1.17197457949,0.48163207372,0.819,1.0,5,8,"{'C': 5, 'degree': 8}",64,0.844218094667,1.0,0.790041991602,1.0,0.822716346154,1.0,0.112629306325,0.0430666931195,0.022281275594,0.0
44,1.25987005234,0.498661279678,0.7988,1.0,5,9,"{'C': 5, 'degree': 9}",73,0.822648292391,1.0,0.77924415117,1.0,0.794471153846,1.0,0.0556809962163,0.0399780174779,0.0179884585582,0.0
45,0.830219348272,0.453969955444,0.8958,0.996400028251,6,1,"{'C': 6, 'degree': 1}",33,0.900539245057,0.995196637646,0.894421115777,0.998499849985,0.892427884615,0.995503597122,0.0316998941755,0.022333795227,0.00345188637335,0.00149007707076
46,0.815063635508,0.478854020437,0.936,1.0,6,2,"{'C': 6, 'degree': 2}",1,0.94907130018,1.0,0.929214157169,1.0,0.9296875,1.0,0.0417638696642,0.0206694554036,0.0092545279602,0.0
47,0.806389649709,0.418823719025,0.9256,1.0,6,3,"{'C': 6, 'degree': 3}",10,0.940083882564,1.0,0.919016196761,1.0,0.917668269231,1.0,0.0199953664268,0.00604908726532,0.0102671543892,0.0
48,0.850244601568,0.432445685069,0.908,1.0,6,4,"{'C': 6, 'degree': 4}",20,0.924505692031,1.0,0.896820635873,1.0,0.902644230769,1.0,0.0230838145039,0.0281901945359,0.0119228188725,0.0
49,0.932908693949,0.421417951584,0.8908,1.0,6,5,"{'C': 6, 'degree': 5}",37,0.913121629718,1.0,0.872225554889,1.0,0.887019230769,1.0,0.0628747419384,0.0282974182981,0.0169145210683,0.0
50,1.02639269829,0.42805202802,0.869,1.0,6,6,"{'C': 6, 'degree': 6}",46,0.895745955662,1.0,0.844031193761,1.0,0.8671875,1.0,0.00506278560585,0.0246412458713,0.0211596589617,0.0
51,1.05431437492,0.444819370906,0.845,1.0,6,7,"{'C': 6, 'degree': 7}",55,0.877171959257,1.0,0.814037192561,1.0,0.84375,1.0,0.0228636202269,0.0262043008886,0.0258000723187,0.0
52,1.1496313413,0.473776737849,0.819,1.0,6,8,"{'C': 6, 'degree': 8}",64,0.844218094667,1.0,0.790041991602,1.0,0.822716346154,1.0,0.0332548643335,0.0356736105674,0.022281275594,0.0
53,1.26569930712,0.512447357178,0.7988,1.0,6,9,"{'C': 6, 'degree': 9}",73,0.822648292391,1.0,0.77924415117,1.0,0.794471153846,1.0,0.0720401186226,0.0436852502894,0.0179884585582,0.0
54,0.853404998779,0.454564332962,0.8946,0.99699999859,7,1,"{'C': 7, 'degree': 1}",34,0.900539245057,0.996097268088,0.893221355729,0.998499849985,0.890024038462,0.996402877698,0.0203094399361,0.00609531692917,0.00440193053906,0.00106786858224
55,0.821674664815,0.475274324417,0.936,1.0,7,2,"{'C': 7, 'degree': 2}",1,0.94907130018,1.0,0.929214157169,1.0,0.9296875,1.0,0.0271988870219,0.0125684205852,0.0092545279602,0.0
56,0.827875296275,0.417587359746,0.9256,1.0,7,3,"{'C': 7, 'degree': 3}",10,0.940083882564,1.0,0.919016196761,1.0,0.917668269231,1.0,0.0204624320648,0.00870297956325,0.0102671543892,0.0
57,0.822607278824,0.409955978394,0.908,1.0,7,4,"{'C': 7, 'degree': 4}",20,0.924505692031,1.0,0.896820635873,1.0,0.902644230769,1.0,0.0331675076187,0.0192899374951,0.0119228188725,0.0
58,0.866168340047,0.408638000488,0.8908,1.0,7,5,"{'C': 7, 'degree': 5}",37,0.913121629718,1.0,0.872225554889,1.0,0.887019230769,1.0,0.0180985012307,0.0150719861793,0.0169145210683,0.0
59,0.956858555476,0.427606026332,0.869,1.0,7,6,"{'C': 7, 'degree': 6}",46,0.895745955662,1.0,0.844031193761,1.0,0.8671875,1.0,0.0302998347322,0.0313496942053,0.0211596589617,0.0
60,1.01834964752,0.434221982956,0.845,1.0,7,7,"{'C': 7, 'degree': 7}",55,0.877171959257,1.0,0.814037192561,1.0,0.84375,1.0,0.0189341721862,0.0244729224081,0.0258000723187,0.0
61,1.10083603859,0.459087292353,0.819,1.0,7,8,"{'C': 7, 'degree': 8}",64,0.844218094667,1.0,0.790041991602,1.0,0.822716346154,1.0,0.018073885303,0.0315563031918,0.022281275594,0.0
62,1.46678209305,0.683822949727,0.7988,1.0,7,9,"{'C': 7, 'degree': 9}",73,0.822648292391,1.0,0.77924415117,1.0,0.794471153846,1.0,0.358833823585,0.25073460398,0.0179884585582,0.0
63,1.36043111483,0.55797791481,0.8946,0.997299908767,8,1,"{'C': 8, 'degree': 1}",34,0.901737567406,0.996397478235,0.892021595681,0.998499849985,0.890024038462,0.997002398082,0.20936962279,0.0553482558525,0.00511766908776,0.000883695347226
64,1.02333394686,0.707269350688,0.936,1.0,8,2,"{'C': 8, 'degree': 2}",1,0.94907130018,1.0,0.929214157169,1.0,0.9296875,1.0,0.136770916626,0.0759241070116,0.0092545279602,0.0
65,0.98174071312,0.507174332937,0.9256,1.0,8,3,"{'C': 8, 'degree': 3}",10,0.940083882564,1.0,0.919016196761,1.0,0.917668269231,1.0,0.239603422816,0.107719321405,0.0102671543892,0.0
66,0.984168688456,0.466783046722,0.908,1.0,8,4,"{'C': 8, 'degree': 4}",20,0.924505692031,1.0,0.896820635873,1.0,0.902644230769,1.0,0.0562833428165,0.00461736969474,0.0119228188725,0.0
67,1.14801335335,0.495550950368,0.8908,1.0,8,5,"{'C': 8, 'degree': 5}",37,0.913121629718,1.0,0.872225554889,1.0,0.887019230769,1.0,0.204966955254,0.0727320030376,0.0169145210683,0.0
68,1.09286459287,0.561007738113,0.869,1.0,8,6,"{'C': 8, 'degree': 6}",46,0.895745955662,1.0,0.844031193761,1.0,0.8671875,1.0,0.064809128923,0.0269725658142,0.0211596589617,0.0
69,1.06339033445,0.448445638021,0.845,1.0,8,7,"{'C': 8, 'degree': 7}",55,0.877171959257,1.0,0.814037192561,1.0,0.84375,1.0,0.0317069322802,0.0275969884008,0.0258000723187,0.0
70,1.25326307615,0.499593337377,0.819,1.0,8,8,"{'C': 8, 'degree': 8}",64,0.844218094667,1.0,0.790041991602,1.0,0.822716346154,1.0,0.0631997846726,0.00598248414219,0.022281275594,0.0
71,1.43636806806,0.590474923452,0.7988,1.0,8,9,"{'C': 8, 'degree': 9}",73,0.822648292391,1.0,0.77924415117,1.0,0.794471153846,1.0,0.148940036005,0.0574293940214,0.0179884585582,0.0
72,0.887377977371,0.439515034358,0.894,0.997899819058,9,1,"{'C': 9, 'degree': 1}",36,0.899340922708,0.996997898529,0.890821835633,0.998799879988,0.891826923077,0.997901678657,0.104517756855,0.0171648205205,0.00380275547444,0.000735657025274
73,0.845440626144,0.465833028158,0.936,1.0,9,2,"{'C': 9, 'degree': 2}",1,0.94907130018,1.0,0.929214157169,1.0,0.9296875,1.0,0.0322374773838,0.0121491694336,0.0092545279602,0.0
74,0.788179000219,0.411878347397,0.9256,1.0,9,3,"{'C': 9, 'degree': 3}",10,0.940083882564,1.0,0.919016196761,1.0,0.917668269231,1.0,0.02522466552,0.0114283306695,0.0102671543892,0.0
75,0.812661329905,0.402233282725,0.908,1.0,9,4,"{'C': 9, 'degree': 4}",20,0.924505692031,1.0,0.896820635873,1.0,0.902644230769,1.0,0.0182023003799,0.00190230671085,0.0119228188725,0.0
76,0.90948565801,0.406263271968,0.8908,1.0,9,5,"{'C': 9, 'degree': 5}",37,0.913121629718,1.0,0.872225554889,1.0,0.887019230769,1.0,0.0425190669857,0.0147234231763,0.0169145210683,0.0
77,0.973030010859,0.413642247518,0.869,1.0,9,6,"{'C': 9, 'degree': 6}",46,0.895745955662,1.0,0.844031193761,1.0,0.8671875,1.0,0.0785348200027,0.021519249059,0.0211596589617,0.0
78,1.23486860593,0.525011698405,0.845,1.0,9,7,"{'C': 9, 'degree': 7}",55,0.877171959257,1.0,0.814037192561,1.0,0.84375,1.0,0.314440676899,0.135751485376,0.0258000723187,0.0
79,1.16119893392,0.460623661677,0.819,1.0,9,8,"{'C': 9, 'degree': 8}",64,0.844218094667,1.0,0.790041991602,1.0,0.822716346154,1.0,0.093489482959,0.0326191765775,0.022281275594,0.0
80,1.19181760152,0.493230978648,0.7988,1.0,9,9,"{'C': 9, 'degree': 9}",73,0.822648292391,1.0,0.77924415117,1.0,0.794471153846,1.0,0.0488880762283,0.0414011807593,0.0179884585582,0.0
