,mean_fit_time,mean_score_time,mean_test_score,mean_train_score,param_C,param_degree,params,rank_test_score,split0_test_score,split0_train_score,split1_test_score,split1_train_score,split2_test_score,split2_train_score,std_fit_time,std_score_time,std_test_score,std_train_score
0,1.11357633273,0.544197003047,0.9136,0.981598752196,1,1,"{'C': 1, 'degree': 1}",1,0.931096464949,0.975983188232,0.902219556089,0.986798679868,0.907451923077,0.982014388489,0.167411096233,0.0230639293466,0.0125675990908,0.00442517645443
1,0.899804671605,0.514467636744,0.9136,0.981598752196,1,2,"{'C': 1, 'degree': 2}",1,0.931096464949,0.975983188232,0.902219556089,0.986798679868,0.907451923077,0.982014388489,0.0363819718477,0.0246747734044,0.0125675990908,0.00442517645443
2,0.903027613958,0.560257355372,0.9136,0.981598752196,1,3,"{'C': 1, 'degree': 3}",1,0.931096464949,0.975983188232,0.902219556089,0.986798679868,0.907451923077,0.982014388489,0.0197787616682,0.0622527734069,0.0125675990908,0.00442517645443
3,1.13735262553,0.672345956167,0.9136,0.981598752196,1,4,"{'C': 1, 'degree': 4}",1,0.931096464949,0.975983188232,0.902219556089,0.986798679868,0.907451923077,0.982014388489,0.166335888784,0.0906996723059,0.0125675990908,0.00442517645443
4,0.919514656067,0.521421035131,0.9136,0.981598752196,1,5,"{'C': 1, 'degree': 5}",1,0.931096464949,0.975983188232,0.902219556089,0.986798679868,0.907451923077,0.982014388489,0.0502743520078,0.0150514800846,0.0125675990908,0.00442517645443
5,0.958023627599,0.65186770757,0.9136,0.981598752196,1,6,"{'C': 1, 'degree': 6}",1,0.931096464949,0.975983188232,0.902219556089,0.986798679868,0.907451923077,0.982014388489,0.0628068096435,0.11160329724,0.0125675990908,0.00442517645443
6,1.68938231468,0.704871972402,0.9136,0.981598752196,1,7,"{'C': 1, 'degree': 7}",1,0.931096464949,0.975983188232,0.902219556089,0.986798679868,0.907451923077,0.982014388489,0.248650896627,0.112758797408,0.0125675990908,0.00442517645443
7,1.14534306526,0.616554657618,0.9136,0.981598752196,1,8,"{'C': 1, 'degree': 8}",1,0.931096464949,0.975983188232,0.902219556089,0.986798679868,0.907451923077,0.982014388489,0.071117054293,0.071342107851,0.0125675990908,0.00442517645443
8,0.897875706355,0.513465642929,0.9136,0.981598752196,1,9,"{'C': 1, 'degree': 9}",1,0.931096464949,0.975983188232,0.902219556089,0.986798679868,0.907451923077,0.982014388489,0.051297242307,0.0220097461222,0.0125675990908,0.00442517645443
9,0.944492657979,0.510846376419,0.9076,0.989599195228,2,1,"{'C': 2, 'degree': 1}",10,0.918514080288,0.984989492645,0.901619676065,0.994599459946,0.902644230769,0.989208633094,0.0536551059933,0.0184828028218,0.00773683167254,0.00393296088361
10,0.916210730871,0.586250940959,0.9076,0.989599195228,2,2,"{'C': 2, 'degree': 2}",10,0.918514080288,0.984989492645,0.901619676065,0.994599459946,0.902644230769,0.989208633094,0.0341194543193,0.103599041769,0.00773683167254,0.00393296088361
11,1.29806137085,0.713150342306,0.9076,0.989599195228,2,3,"{'C': 2, 'degree': 3}",10,0.918514080288,0.984989492645,0.901619676065,0.994599459946,0.902644230769,0.989208633094,0.00381713423274,0.0726759770458,0.00773683167254,0.00393296088361
12,1.04253768921,0.558494965235,0.9076,0.989599195228,2,4,"{'C': 2, 'degree': 4}",10,0.918514080288,0.984989492645,0.901619676065,0.994599459946,0.902644230769,0.989208633094,0.0560720887885,0.0734922117035,0.00773683167254,0.00393296088361
13,1.2670323054,0.738983392715,0.9076,0.989599195228,2,5,"{'C': 2, 'degree': 5}",10,0.918514080288,0.984989492645,0.901619676065,0.994599459946,0.902644230769,0.989208633094,0.22139164716,0.228692107297,0.00773683167254,0.00393296088361
14,1.07544700305,0.587179978689,0.9076,0.989599195228,2,6,"{'C': 2, 'degree': 6}",10,0.918514080288,0.984989492645,0.901619676065,0.994599459946,0.902644230769,0.989208633094,0.0470597063727,0.0748402033241,0.00773683167254,0.00393296088361
15,1.14900676409,0.627231915792,0.9076,0.989599195228,2,7,"{'C': 2, 'degree': 7}",10,0.918514080288,0.984989492645,0.901619676065,0.994599459946,0.902644230769,0.989208633094,0.106751049,0.0613148489717,0.00773683167254,0.00393296088361
16,1.25362070402,0.714710394541,0.9076,0.989599195228,2,8,"{'C': 2, 'degree': 8}",10,0.918514080288,0.984989492645,0.901619676065,0.994599459946,0.902644230769,0.989208633094,0.0306066902155,0.0392700456442,0.00773683167254,0.00393296088361
17,1.19857128461,0.639714002609,0.9076,0.989599195228,2,9,"{'C': 2, 'degree': 9}",10,0.918514080288,0.984989492645,0.901619676065,0.994599459946,0.902644230769,0.989208633094,0.142491847222,0.108542573495,0.00773683167254,0.00393296088361
18,0.907648007075,0.502292315165,0.9056,0.992899436674,3,1,"{'C': 3, 'degree': 1}",19,0.910724985021,0.989492644851,0.900419916017,0.996699669967,0.905649038462,0.992505995204,0.0436448903338,0.0255149152939,0.00420885102197,0.00295537926467
19,0.899906317393,0.499147017797,0.9056,0.992899436674,3,2,"{'C': 3, 'degree': 2}",19,0.910724985021,0.989492644851,0.900419916017,0.996699669967,0.905649038462,0.992505995204,0.0265199018768,0.00898186734656,0.00420885102197,0.00295537926467
20,1.12093400955,0.639020681381,0.9056,0.992899436674,3,3,"{'C': 3, 'degree': 3}",19,0.910724985021,0.989492644851,0.900419916017,0.996699669967,0.905649038462,0.992505995204,0.125977835549,0.0716715313702,0.00420885102197,0.00295537926467
21,1.24252223969,0.689707358678,0.9056,0.992899436674,3,4,"{'C': 3, 'degree': 4}",19,0.910724985021,0.989492644851,0.900419916017,0.996699669967,0.905649038462,0.992505995204,0.0506555900079,0.0256136125936,0.00420885102197,0.00295537926467
22,0.985248406728,0.728037277857,0.9056,0.992899436674,3,5,"{'C': 3, 'degree': 5}",19,0.910724985021,0.989492644851,0.900419916017,0.996699669967,0.905649038462,0.992505995204,0.0599417003856,0.184059676176,0.00420885102197,0.00295537926467
23,1.66552623113,0.78301914533,0.9056,0.992899436674,3,6,"{'C': 3, 'degree': 6}",19,0.910724985021,0.989492644851,0.900419916017,0.996699669967,0.905649038462,0.992505995204,0.18516886535,0.165725583854,0.00420885102197,0.00295537926467
24,1.00723497073,0.600114583969,0.9056,0.992899436674,3,7,"{'C': 3, 'degree': 7}",19,0.910724985021,0.989492644851,0.900419916017,0.996699669967,0.905649038462,0.992505995204,0.0598815896542,0.0802397616796,0.00420885102197,0.00295537926467
25,0.972702026367,0.485930363337,0.9056,0.992899436674,3,8,"{'C': 3, 'degree': 8}",19,0.910724985021,0.989492644851,0.900419916017,0.996699669967,0.905649038462,0.992505995204,0.0713390295342,0.00544457005002,0.00420885102197,0.00295537926467
26,0.919191360474,0.504645268122,0.9056,0.992899436674,3,9,"{'C': 3, 'degree': 9}",19,0.910724985021,0.989492644851,0.900419916017,0.996699669967,0.905649038462,0.992505995204,0.0550263082224,0.0191023218084,0.00420885102197,0.00295537926467
27,0.906131029129,0.507445732752,0.9016,0.994699767487,4,1,"{'C': 4, 'degree': 1}",28,0.905931695626,0.992494746322,0.898020395921,0.997599759976,0.900841346154,0.994004796163,0.0395077185885,0.0282959161857,0.00327519052195,0.00214126597395
28,1.01645501455,0.526115338008,0.9016,0.994699767487,4,2,"{'C': 4, 'degree': 2}",28,0.905931695626,0.992494746322,0.898020395921,0.997599759976,0.900841346154,0.994004796163,0.0290736457606,0.016934116261,0.00327519052195,0.00214126597395
29,0.936662991842,0.536823987961,0.9016,0.994699767487,4,3,"{'C': 4, 'degree': 3}",28,0.905931695626,0.992494746322,0.898020395921,0.997599759976,0.900841346154,0.994004796163,0.0833063344243,0.0846505632981,0.00327519052195,0.00214126597395
30,0.910829941432,0.487175067266,0.9016,0.994699767487,4,4,"{'C': 4, 'degree': 4}",28,0.905931695626,0.992494746322,0.898020395921,0.997599759976,0.900841346154,0.994004796163,0.0373659791707,0.0229697093681,0.00327519052195,0.00214126597395
31,0.896851301193,0.482071320216,0.9016,0.994699767487,4,5,"{'C': 4, 'degree': 5}",28,0.905931695626,0.992494746322,0.898020395921,0.997599759976,0.900841346154,0.994004796163,0.0355748464392,0.0175586092303,0.00327519052195,0.00214126597395
32,1.00538166364,0.572279612223,0.9016,0.994699767487,4,6,"{'C': 4, 'degree': 6}",28,0.905931695626,0.992494746322,0.898020395921,0.997599759976,0.900841346154,0.994004796163,0.0819814173568,0.0320695165805,0.00327519052195,0.00214126597395
33,0.892284631729,0.540872732798,0.9016,0.994699767487,4,7,"{'C': 4, 'degree': 7}",28,0.905931695626,0.992494746322,0.898020395921,0.997599759976,0.900841346154,0.994004796163,0.0492603137524,0.0695051119189,0.00327519052195,0.00214126597395
34,0.905047972997,0.475492636363,0.9016,0.994699767487,4,8,"{'C': 4, 'degree': 8}",28,0.905931695626,0.992494746322,0.898020395921,0.997599759976,0.900841346154,0.994004796163,0.0216498960953,0.0168200915876,0.00327519052195,0.00214126597395
35,0.979681889216,0.52583916982,0.9016,0.994699767487,4,9,"{'C': 4, 'degree': 9}",28,0.905931695626,0.992494746322,0.898020395921,0.997599759976,0.900841346154,0.994004796163,0.0455725672288,0.0330314403855,0.00327519052195,0.00214126597395
36,0.944880326589,0.531015316645,0.8994,0.995999808103,5,1,"{'C': 5, 'degree': 1}",37,0.905332534452,0.994296007205,0.896820635873,0.998199819982,0.896033653846,0.995503597122,0.0736853519893,0.0383174958699,0.00421160470866,0.00163189206189
37,1.44775366783,0.658967018127,0.8994,0.995999808103,5,2,"{'C': 5, 'degree': 2}",37,0.905332534452,0.994296007205,0.896820635873,0.998199819982,0.896033653846,0.995503597122,0.25029947029,0.0295506000702,0.00421160470866,0.00163189206189
38,1.19982806842,0.59871896108,0.8994,0.995999808103,5,3,"{'C': 5, 'degree': 3}",37,0.905332534452,0.994296007205,0.896820635873,0.998199819982,0.896033653846,0.995503597122,0.0542787298,0.0195432893228,0.00421160470866,0.00163189206189
39,1.1982263724,0.630108594894,0.8994,0.995999808103,5,4,"{'C': 5, 'degree': 4}",37,0.905332534452,0.994296007205,0.896820635873,0.998199819982,0.896033653846,0.995503597122,0.0822378541499,0.0601633284334,0.00421160470866,0.00163189206189
40,1.17973534266,0.606165250142,0.8994,0.995999808103,5,5,"{'C': 5, 'degree': 5}",37,0.905332534452,0.994296007205,0.896820635873,0.998199819982,0.896033653846,0.995503597122,0.0446549587971,0.0276136172463,0.00421160470866,0.00163189206189
41,1.18329334259,0.607880751292,0.8994,0.995999808103,5,6,"{'C': 5, 'degree': 6}",37,0.905332534452,0.994296007205,0.896820635873,0.998199819982,0.896033653846,0.995503597122,0.0495207186187,0.0157273895802,0.00421160470866,0.00163189206189
42,1.20599738757,0.625104347865,0.8994,0.995999808103,5,7,"{'C': 5, 'degree': 7}",37,0.905332534452,0.994296007205,0.896820635873,0.998199819982,0.896033653846,0.995503597122,0.0410063300318,0.0118692066439,0.00421160470866,0.00163189206189
43,1.42035396894,0.69938325882,0.8994,0.995999808103,5,8,"{'C': 5, 'degree': 8}",37,0.905332534452,0.994296007205,0.896820635873,0.998199819982,0.896033653846,0.995503597122,0.104637996763,0.0556242136348,0.00421160470866,0.00163189206189
44,1.25678491592,0.618225733439,0.8994,0.995999808103,5,9,"{'C': 5, 'degree': 9}",37,0.905332534452,0.994296007205,0.896820635873,0.998199819982,0.896033653846,0.995503597122,0.188211844151,0.028791881723,0.00421160470866,0.00163189206189
45,1.10124158859,0.574938615163,0.8958,0.996400028251,6,1,"{'C': 6, 'degree': 1}",46,0.900539245057,0.995196637646,0.894421115777,0.998499849985,0.892427884615,0.995503597122,0.0522571750984,0.0139116907914,0.00345188637335,0.00149007707076
46,1.11531567574,0.567719300588,0.8958,0.996400028251,6,2,"{'C': 6, 'degree': 2}",46,0.900539245057,0.995196637646,0.894421115777,0.998499849985,0.892427884615,0.995503597122,0.0349664848487,0.0301796666569,0.00345188637335,0.00149007707076
47,1.1463256677,0.591927051544,0.8958,0.996400028251,6,3,"{'C': 6, 'degree': 3}",46,0.900539245057,0.995196637646,0.894421115777,0.998499849985,0.892427884615,0.995503597122,0.067852803476,0.0107039456254,0.00345188637335,0.00149007707076
48,1.26162536939,0.637885332108,0.8958,0.996400028251,6,4,"{'C': 6, 'degree': 4}",46,0.900539245057,0.995196637646,0.894421115777,0.998499849985,0.892427884615,0.995503597122,0.0625455975755,0.0541834077413,0.00345188637335,0.00149007707076
49,1.21083140373,0.572742303212,0.8958,0.996400028251,6,5,"{'C': 6, 'degree': 5}",46,0.900539245057,0.995196637646,0.894421115777,0.998499849985,0.892427884615,0.995503597122,0.0342616482914,0.0462463696395,0.00345188637335,0.00149007707076
50,1.09170095126,0.660874764125,0.8958,0.996400028251,6,6,"{'C': 6, 'degree': 6}",46,0.900539245057,0.995196637646,0.894421115777,0.998499849985,0.892427884615,0.995503597122,0.307633149589,0.255106781028,0.00345188637335,0.00149007707076
51,0.934753576914,0.505917390188,0.8958,0.996400028251,6,7,"{'C': 6, 'degree': 7}",46,0.900539245057,0.995196637646,0.894421115777,0.998499849985,0.892427884615,0.995503597122,0.0812843656351,0.0271025899036,0.00345188637335,0.00149007707076
52,0.951505581538,0.551733652751,0.8958,0.996400028251,6,8,"{'C': 6, 'degree': 8}",46,0.900539245057,0.995196637646,0.894421115777,0.998499849985,0.892427884615,0.995503597122,0.00265398627001,0.0320335444296,0.00345188637335,0.00149007707076
53,0.931224028269,0.478360335032,0.8958,0.996400028251,6,9,"{'C': 6, 'degree': 9}",46,0.900539245057,0.995196637646,0.894421115777,0.998499849985,0.892427884615,0.995503597122,0.0234461548944,0.00302562495122,0.00345188637335,0.00149007707076
54,0.919368028641,0.491278012594,0.8946,0.99699999859,7,1,"{'C': 7, 'degree': 1}",55,0.900539245057,0.996097268088,0.893221355729,0.998499849985,0.890024038462,0.996402877698,0.0452061204786,0.0261463185359,0.00440193053906,0.00106786858224
55,0.918498675028,0.477988878886,0.8946,0.99699999859,7,2,"{'C': 7, 'degree': 2}",55,0.900539245057,0.996097268088,0.893221355729,0.998499849985,0.890024038462,0.996402877698,0.0207241772471,0.0100580159747,0.00440193053906,0.00106786858224
56,0.936185677846,0.504911740621,0.8946,0.99699999859,7,3,"{'C': 7, 'degree': 3}",55,0.900539245057,0.996097268088,0.893221355729,0.998499849985,0.890024038462,0.996402877698,0.0123234195256,0.00989630778315,0.00440193053906,0.00106786858224
57,0.971357345581,0.500634034475,0.8946,0.99699999859,7,4,"{'C': 7, 'degree': 4}",55,0.900539245057,0.996097268088,0.893221355729,0.998499849985,0.890024038462,0.996402877698,0.0381847516935,0.0113189252282,0.00440193053906,0.00106786858224
58,0.984726111094,0.51448059082,0.8946,0.99699999859,7,5,"{'C': 7, 'degree': 5}",55,0.900539245057,0.996097268088,0.893221355729,0.998499849985,0.890024038462,0.996402877698,0.0630467020969,0.0185010613298,0.00440193053906,0.00106786858224
59,0.890555699666,0.472755988439,0.8946,0.99699999859,7,6,"{'C': 7, 'degree': 6}",55,0.900539245057,0.996097268088,0.893221355729,0.998499849985,0.890024038462,0.996402877698,0.0328223739426,0.0123434786808,0.00440193053906,0.00106786858224
60,1.22141504288,0.584216674169,0.8946,0.99699999859,7,7,"{'C': 7, 'degree': 7}",55,0.900539245057,0.996097268088,0.893221355729,0.998499849985,0.890024038462,0.996402877698,0.133073123997,0.0786588863115,0.00440193053906,0.00106786858224
61,1.02770829201,0.564031759898,0.8946,0.99699999859,7,8,"{'C': 7, 'degree': 8}",55,0.900539245057,0.996097268088,0.893221355729,0.998499849985,0.890024038462,0.996402877698,0.0890061539573,0.0358909665938,0.00440193053906,0.00106786858224
62,1.06020371119,0.525647242864,0.8946,0.99699999859,7,9,"{'C': 7, 'degree': 9}",55,0.900539245057,0.996097268088,0.893221355729,0.998499849985,0.890024038462,0.996402877698,0.156559332696,0.0429666519182,0.00440193053906,0.00106786858224
63,0.906400044759,0.467913309733,0.8946,0.997299908767,8,1,"{'C': 8, 'degree': 1}",55,0.901737567406,0.996397478235,0.892021595681,0.998499849985,0.890024038462,0.997002398082,0.0402339541742,0.0103429879653,0.00511766908776,0.000883695347226
64,0.918358325958,0.479822079341,0.8946,0.997299908767,8,2,"{'C': 8, 'degree': 2}",55,0.901737567406,0.996397478235,0.892021595681,0.998499849985,0.890024038462,0.997002398082,0.0325387756494,0.0135760449509,0.00511766908776,0.000883695347226
65,0.989143292109,0.515502055486,0.8946,0.997299908767,8,3,"{'C': 8, 'degree': 3}",55,0.901737567406,0.996397478235,0.892021595681,0.998499849985,0.890024038462,0.997002398082,0.00661796895359,0.00854959645731,0.00511766908776,0.000883695347226
66,0.97704132398,0.51541630427,0.8946,0.997299908767,8,4,"{'C': 8, 'degree': 4}",55,0.901737567406,0.996397478235,0.892021595681,0.998499849985,0.890024038462,0.997002398082,0.0251191232097,0.0185591355663,0.00511766908776,0.000883695347226
67,0.979157606761,0.508314689,0.8946,0.997299908767,8,5,"{'C': 8, 'degree': 5}",55,0.901737567406,0.996397478235,0.892021595681,0.998499849985,0.890024038462,0.997002398082,0.00327028265835,0.019213303602,0.00511766908776,0.000883695347226
68,0.923251310984,0.470498323441,0.8946,0.997299908767,8,6,"{'C': 8, 'degree': 6}",55,0.901737567406,0.996397478235,0.892021595681,0.998499849985,0.890024038462,0.997002398082,0.0669269906964,0.0108465559552,0.00511766908776,0.000883695347226
69,1.01203052203,0.507452090581,0.8946,0.997299908767,8,7,"{'C': 8, 'degree': 7}",55,0.901737567406,0.996397478235,0.892021595681,0.998499849985,0.890024038462,0.997002398082,0.0828826628213,0.0138457534658,0.00511766908776,0.000883695347226
70,0.957999706268,0.497369686762,0.8946,0.997299908767,8,8,"{'C': 8, 'degree': 8}",55,0.901737567406,0.996397478235,0.892021595681,0.998499849985,0.890024038462,0.997002398082,0.0342014125578,0.0148567027467,0.00511766908776,0.000883695347226
71,0.980207045873,0.525145610174,0.8946,0.997299908767,8,9,"{'C': 8, 'degree': 9}",55,0.901737567406,0.996397478235,0.892021595681,0.998499849985,0.890024038462,0.997002398082,0.048685533227,0.0146108019308,0.00511766908776,0.000883695347226
72,1.03183833758,0.507792711258,0.894,0.997899819058,9,1,"{'C': 9, 'degree': 1}",73,0.899340922708,0.996997898529,0.890821835633,0.998799879988,0.891826923077,0.997901678657,0.0976048910953,0.0100855469457,0.00380275547444,0.000735657025274
73,1.02396273613,0.504753510157,0.894,0.997899819058,9,2,"{'C': 9, 'degree': 2}",73,0.899340922708,0.996997898529,0.890821835633,0.998799879988,0.891826923077,0.997901678657,0.0445085762925,0.0143982579268,0.00380275547444,0.000735657025274
74,1.00956233342,0.527908007304,0.894,0.997899819058,9,3,"{'C': 9, 'degree': 3}",73,0.899340922708,0.996997898529,0.890821835633,0.998799879988,0.891826923077,0.997901678657,0.0420607435347,0.0152083283044,0.00380275547444,0.000735657025274
75,0.944909969966,0.506189584732,0.894,0.997899819058,9,4,"{'C': 9, 'degree': 4}",73,0.899340922708,0.996997898529,0.890821835633,0.998799879988,0.891826923077,0.997901678657,0.0343750258061,0.0224369262165,0.00380275547444,0.000735657025274
76,0.963596979777,0.510363976161,0.894,0.997899819058,9,5,"{'C': 9, 'degree': 5}",73,0.899340922708,0.996997898529,0.890821835633,0.998799879988,0.891826923077,0.997901678657,0.0153122726008,0.0137870416293,0.00380275547444,0.000735657025274
77,1.01529828707,0.529002269109,0.894,0.997899819058,9,6,"{'C': 9, 'degree': 6}",73,0.899340922708,0.996997898529,0.890821835633,0.998799879988,0.891826923077,0.997901678657,0.0639423223487,0.0297233677037,0.00380275547444,0.000735657025274
78,1.02789298693,0.568377971649,0.894,0.997899819058,9,7,"{'C': 9, 'degree': 7}",73,0.899340922708,0.996997898529,0.890821835633,0.998799879988,0.891826923077,0.997901678657,0.0404283377446,0.047190143897,0.00380275547444,0.000735657025274
79,0.973499377569,0.508162339528,0.894,0.997899819058,9,8,"{'C': 9, 'degree': 8}",73,0.899340922708,0.996997898529,0.890821835633,0.998799879988,0.891826923077,0.997901678657,0.0563727399944,0.00957825637891,0.00380275547444,0.000735657025274
80,0.927670955658,0.489706675212,0.894,0.997899819058,9,9,"{'C': 9, 'degree': 9}",73,0.899340922708,0.996997898529,0.890821835633,0.998799879988,0.891826923077,0.997901678657,0.0455667310166,0.01451632757,0.00380275547444,0.000735657025274
