,mean_fit_time,mean_score_time,mean_test_score,mean_train_score,param_C,param_degree,params,rank_test_score,split0_test_score,split0_train_score,split1_test_score,split1_train_score,split2_test_score,split2_train_score,std_fit_time,std_score_time,std_test_score,std_train_score
0,0.903693358103,0.487569967906,0.9136,0.981598752196,1,1,"{'C': 1, 'degree': 1}",19,0.931096464949,0.975983188232,0.902219556089,0.986798679868,0.907451923077,0.982014388489,0.103468740921,0.0245583544038,0.0125675990908,0.00442517645443
1,1.08643539747,0.548935254415,0.936,1.0,1,2,"{'C': 1, 'degree': 2}",1,0.94907130018,1.0,0.929214157169,1.0,0.9296875,1.0,0.0501909639688,0.0735081770545,0.0092545279602,0.0
2,0.825278361638,0.430637915929,0.9256,1.0,1,3,"{'C': 1, 'degree': 3}",10,0.940083882564,1.0,0.919016196761,1.0,0.917668269231,1.0,0.0140719312586,0.00756361616577,0.0102671543892,0.0
3,0.988781611125,0.474103689194,0.908,1.0,1,4,"{'C': 1, 'degree': 4}",20,0.924505692031,1.0,0.896820635873,1.0,0.902644230769,1.0,0.19379484387,0.0790281878382,0.0119228188725,0.0
4,0.993944327037,0.42214568456,0.8908,1.0,1,5,"{'C': 1, 'degree': 5}",37,0.913121629718,1.0,0.872225554889,1.0,0.887019230769,1.0,0.0417955141612,0.0161476260344,0.0169145210683,0.0
5,1.01674763362,0.500862995783,0.869,1.0,1,6,"{'C': 1, 'degree': 6}",46,0.895745955662,1.0,0.844031193761,1.0,0.8671875,1.0,0.0175972473539,0.0370686158775,0.0211596589617,0.0
6,1.09480961164,0.464907010396,0.845,1.0,1,7,"{'C': 1, 'degree': 7}",55,0.877171959257,1.0,0.814037192561,1.0,0.84375,1.0,0.036750024123,0.0179934004785,0.0258000723187,0.0
7,1.16316970189,0.473951657613,0.819,1.0,1,8,"{'C': 1, 'degree': 8}",64,0.844218094667,1.0,0.790041991602,1.0,0.822716346154,1.0,0.0264497873622,0.0213592877879,0.022281275594,0.0
8,1.24362206459,0.494858980179,0.7988,1.0,1,9,"{'C': 1, 'degree': 9}",73,0.822648292391,1.0,0.77924415117,1.0,0.794471153846,1.0,0.0414438362239,0.0354366325145,0.0179884585582,0.0
9,0.82036558787,0.460634469986,0.9076,0.989599195228,2,1,"{'C': 2, 'degree': 1}",29,0.918514080288,0.984989492645,0.901619676065,0.994599459946,0.902644230769,0.989208633094,0.0295780437981,0.016105197806,0.00773683167254,0.00393296088361
10,0.832168658574,0.47993461291,0.936,1.0,2,2,"{'C': 2, 'degree': 2}",1,0.94907130018,1.0,0.929214157169,1.0,0.9296875,1.0,0.0218461234359,0.0163941406782,0.0092545279602,0.0
11,0.832679033279,0.433451334635,0.9256,1.0,2,3,"{'C': 2, 'degree': 3}",10,0.940083882564,1.0,0.919016196761,1.0,0.917668269231,1.0,0.0214352285879,0.00542637583349,0.0102671543892,0.0
12,0.904343366623,0.444015661875,0.908,1.0,2,4,"{'C': 2, 'degree': 4}",20,0.924505692031,1.0,0.896820635873,1.0,0.902644230769,1.0,0.0589549258869,0.0457117718254,0.0119228188725,0.0
13,0.919289668401,0.42572538058,0.8908,1.0,2,5,"{'C': 2, 'degree': 5}",37,0.913121629718,1.0,0.872225554889,1.0,0.887019230769,1.0,0.025347356522,0.0206128137942,0.0169145210683,0.0
14,1.07066130638,0.469766696294,0.869,1.0,2,6,"{'C': 2, 'degree': 6}",46,0.895745955662,1.0,0.844031193761,1.0,0.8671875,1.0,0.0990110076939,0.0628135309504,0.0211596589617,0.0
15,1.07985122999,0.453835010529,0.845,1.0,2,7,"{'C': 2, 'degree': 7}",55,0.877171959257,1.0,0.814037192561,1.0,0.84375,1.0,0.0188919969296,0.0201897881875,0.0258000723187,0.0
16,1.60667475065,0.706147591273,0.819,1.0,2,8,"{'C': 2, 'degree': 8}",64,0.844218094667,1.0,0.790041991602,1.0,0.822716346154,1.0,0.165663226355,0.162132834518,0.022281275594,0.0
17,1.87960807482,0.709960222244,0.7988,1.0,2,9,"{'C': 2, 'degree': 9}",73,0.822648292391,1.0,0.77924415117,1.0,0.794471153846,1.0,0.098346458233,0.108020891567,0.0179884585582,0.0
18,0.897191603978,0.512802759806,0.9056,0.992899436674,3,1,"{'C': 3, 'degree': 1}",30,0.910724985021,0.989492644851,0.900419916017,0.996699669967,0.905649038462,0.992505995204,0.0606915191783,0.00794226361604,0.00420885102197,0.00295537926467
19,1.19285972913,0.658925612768,0.936,1.0,3,2,"{'C': 3, 'degree': 2}",1,0.94907130018,1.0,0.929214157169,1.0,0.9296875,1.0,0.0250394068194,0.0100594140229,0.0092545279602,0.0
20,1.06322964032,0.564134597778,0.9256,1.0,3,3,"{'C': 3, 'degree': 3}",10,0.940083882564,1.0,0.919016196761,1.0,0.917668269231,1.0,0.148368849804,0.074488350725,0.0102671543892,0.0
21,1.17272162437,0.579897085826,0.908,1.0,3,4,"{'C': 3, 'degree': 4}",20,0.924505692031,1.0,0.896820635873,1.0,0.902644230769,1.0,0.0218523709975,0.0152177811582,0.0119228188725,0.0
22,1.25103068352,0.584427992503,0.8908,1.0,3,5,"{'C': 3, 'degree': 5}",37,0.913121629718,1.0,0.872225554889,1.0,0.887019230769,1.0,0.0267770867487,0.0223507830269,0.0169145210683,0.0
23,1.35087037086,0.610806306203,0.869,1.0,3,6,"{'C': 3, 'degree': 6}",46,0.895745955662,1.0,0.844031193761,1.0,0.8671875,1.0,0.0326242457847,0.0217560833381,0.0211596589617,0.0
24,1.5411084493,0.699074586233,0.845,1.0,3,7,"{'C': 3, 'degree': 7}",55,0.877171959257,1.0,0.814037192561,1.0,0.84375,1.0,0.0180626205623,0.0354350044093,0.0258000723187,0.0
25,1.53595995903,0.581092675527,0.819,1.0,3,8,"{'C': 3, 'degree': 8}",64,0.844218094667,1.0,0.790041991602,1.0,0.822716346154,1.0,0.212724812789,0.0603809763042,0.022281275594,0.0
26,1.28622992833,0.496817747752,0.7988,1.0,3,9,"{'C': 3, 'degree': 9}",73,0.822648292391,1.0,0.77924415117,1.0,0.794471153846,1.0,0.0236329471108,0.029494339686,0.0179884585582,0.0
27,0.84686199824,0.489548365275,0.9016,0.994699767487,4,1,"{'C': 4, 'degree': 1}",31,0.905931695626,0.992494746322,0.898020395921,0.997599759976,0.900841346154,0.994004796163,0.0274507498997,0.0418772078022,0.00327519052195,0.00214126597395
28,1.14455604553,0.599829276403,0.936,1.0,4,2,"{'C': 4, 'degree': 2}",1,0.94907130018,1.0,0.929214157169,1.0,0.9296875,1.0,0.0981329240964,0.0688382328786,0.0092545279602,0.0
29,0.995381991069,0.53217569987,0.9256,1.0,4,3,"{'C': 4, 'degree': 3}",10,0.940083882564,1.0,0.919016196761,1.0,0.917668269231,1.0,0.038505717385,0.0629245897775,0.0102671543892,0.0
30,0.910907665888,0.420804659526,0.908,1.0,4,4,"{'C': 4, 'degree': 4}",20,0.924505692031,1.0,0.896820635873,1.0,0.902644230769,1.0,0.0170149795058,0.00166009331575,0.0119228188725,0.0
31,1.12467861176,0.454178015391,0.8908,1.0,4,5,"{'C': 4, 'degree': 5}",37,0.913121629718,1.0,0.872225554889,1.0,0.887019230769,1.0,0.0330332048739,0.0489870956635,0.0169145210683,0.0
32,1.45161700249,0.581377267838,0.869,1.0,4,6,"{'C': 4, 'degree': 6}",46,0.895745955662,1.0,0.844031193761,1.0,0.8671875,1.0,0.0366164528064,0.0674232718382,0.0211596589617,0.0
33,1.27978801727,0.551237265269,0.845,1.0,4,7,"{'C': 4, 'degree': 7}",55,0.877171959257,1.0,0.814037192561,1.0,0.84375,1.0,0.0443614008667,0.0582830349958,0.0258000723187,0.0
34,1.33872175217,0.58003226916,0.819,1.0,4,8,"{'C': 4, 'degree': 8}",64,0.844218094667,1.0,0.790041991602,1.0,0.822716346154,1.0,0.139372648457,0.102735212636,0.022281275594,0.0
35,1.48415064812,0.585462252299,0.7988,1.0,4,9,"{'C': 4, 'degree': 9}",73,0.822648292391,1.0,0.77924415117,1.0,0.794471153846,1.0,0.117076559965,0.0473329540249,0.0179884585582,0.0
36,0.870394865672,0.472063064575,0.8994,0.995999808103,5,1,"{'C': 5, 'degree': 1}",32,0.905332534452,0.994296007205,0.896820635873,0.998199819982,0.896033653846,0.995503597122,0.0371730729901,0.0203922290533,0.00421160470866,0.00163189206189
37,0.994313398997,0.546210686366,0.936,1.0,5,2,"{'C': 5, 'degree': 2}",1,0.94907130018,1.0,0.929214157169,1.0,0.9296875,1.0,0.125532754226,0.0373798430133,0.0092545279602,0.0
38,1.06875864665,0.52748298645,0.9256,1.0,5,3,"{'C': 5, 'degree': 3}",10,0.940083882564,1.0,0.919016196761,1.0,0.917668269231,1.0,0.123336694625,0.0664933676312,0.0102671543892,0.0
39,0.97016509374,0.443852265676,0.908,1.0,5,4,"{'C': 5, 'degree': 4}",20,0.924505692031,1.0,0.896820635873,1.0,0.902644230769,1.0,0.075396680137,0.0113103724639,0.0119228188725,0.0
40,0.948038339615,0.452640692393,0.8908,1.0,5,5,"{'C': 5, 'degree': 5}",37,0.913121629718,1.0,0.872225554889,1.0,0.887019230769,1.0,0.020566856125,0.0421346270707,0.0169145210683,0.0
41,1.09437831243,0.446826060613,0.869,1.0,5,6,"{'C': 5, 'degree': 6}",46,0.895745955662,1.0,0.844031193761,1.0,0.8671875,1.0,0.115294726326,0.0222975930087,0.0211596589617,0.0
42,1.33168029785,0.584356069565,0.845,1.0,5,7,"{'C': 5, 'degree': 7}",55,0.877171959257,1.0,0.814037192561,1.0,0.84375,1.0,0.269736681615,0.0728517415726,0.0258000723187,0.0
43,1.75934092204,0.734593073527,0.819,1.0,5,8,"{'C': 5, 'degree': 8}",64,0.844218094667,1.0,0.790041991602,1.0,0.822716346154,1.0,0.0697344983573,0.0809979148977,0.022281275594,0.0
44,1.4436360995,0.56405989329,0.7988,1.0,5,9,"{'C': 5, 'degree': 9}",73,0.822648292391,1.0,0.77924415117,1.0,0.794471153846,1.0,0.165945293991,0.0711740357011,0.0179884585582,0.0
45,1.09298642476,0.614812612534,0.8958,0.996400028251,6,1,"{'C': 6, 'degree': 1}",33,0.900539245057,0.995196637646,0.894421115777,0.998499849985,0.892427884615,0.995503597122,0.0863429310466,0.0846292982925,0.00345188637335,0.00149007707076
46,0.861368338267,0.493285020192,0.936,1.0,6,2,"{'C': 6, 'degree': 2}",1,0.94907130018,1.0,0.929214157169,1.0,0.9296875,1.0,0.049300175442,0.0256273481644,0.0092545279602,0.0
47,0.847334623337,0.430312315623,0.9256,1.0,6,3,"{'C': 6, 'degree': 3}",10,0.940083882564,1.0,0.919016196761,1.0,0.917668269231,1.0,0.0187203114197,0.00586417445604,0.0102671543892,0.0
48,0.863717397054,0.438640594482,0.908,1.0,6,4,"{'C': 6, 'degree': 4}",20,0.924505692031,1.0,0.896820635873,1.0,0.902644230769,1.0,0.00963131143016,0.0403783471081,0.0119228188725,0.0
49,1.0267701149,0.44464635849,0.8908,1.0,6,5,"{'C': 6, 'degree': 5}",37,0.913121629718,1.0,0.872225554889,1.0,0.887019230769,1.0,0.155765280219,0.0347198450386,0.0169145210683,0.0
50,1.01634867986,0.46653008461,0.869,1.0,6,6,"{'C': 6, 'degree': 6}",46,0.895745955662,1.0,0.844031193761,1.0,0.8671875,1.0,0.0273797906881,0.0349476185572,0.0211596589617,0.0
51,1.19994672139,0.471657991409,0.845,1.0,6,7,"{'C': 6, 'degree': 7}",55,0.877171959257,1.0,0.814037192561,1.0,0.84375,1.0,0.0627287455554,0.00543464713503,0.0258000723187,0.0
52,1.28416109085,0.51927391688,0.819,1.0,6,8,"{'C': 6, 'degree': 8}",64,0.844218094667,1.0,0.790041991602,1.0,0.822716346154,1.0,0.154238058423,0.061493624012,0.022281275594,0.0
53,1.52489423752,0.562518437703,0.7988,1.0,6,9,"{'C': 6, 'degree': 9}",73,0.822648292391,1.0,0.77924415117,1.0,0.794471153846,1.0,0.11598023033,0.0629576526249,0.0179884585582,0.0
54,1.02104202906,0.506787061691,0.8946,0.99699999859,7,1,"{'C': 7, 'degree': 1}",34,0.900539245057,0.996097268088,0.893221355729,0.998499849985,0.890024038462,0.996402877698,0.136424319612,0.0604242889762,0.00440193053906,0.00106786858224
55,0.952926953634,0.53697347641,0.936,1.0,7,2,"{'C': 7, 'degree': 2}",1,0.94907130018,1.0,0.929214157169,1.0,0.9296875,1.0,0.0173727095377,0.047002946984,0.0092545279602,0.0
56,0.943836053212,0.456904649734,0.9256,1.0,7,3,"{'C': 7, 'degree': 3}",10,0.940083882564,1.0,0.919016196761,1.0,0.917668269231,1.0,0.0519792902341,0.0302113406443,0.0102671543892,0.0
57,0.980534633001,0.474460283915,0.908,1.0,7,4,"{'C': 7, 'degree': 4}",20,0.924505692031,1.0,0.896820635873,1.0,0.902644230769,1.0,0.116499831242,0.0768452796284,0.0119228188725,0.0
58,1.09879477819,0.435537576675,0.8908,1.0,7,5,"{'C': 7, 'degree': 5}",37,0.913121629718,1.0,0.872225554889,1.0,0.887019230769,1.0,0.106081747834,0.00957522568203,0.0169145210683,0.0
59,1.09032797813,0.464339653651,0.869,1.0,7,6,"{'C': 7, 'degree': 6}",46,0.895745955662,1.0,0.844031193761,1.0,0.8671875,1.0,0.123266391995,0.0450499086492,0.0211596589617,0.0
60,1.3471159935,0.515351057053,0.845,1.0,7,7,"{'C': 7, 'degree': 7}",55,0.877171959257,1.0,0.814037192561,1.0,0.84375,1.0,0.0472088903161,0.00887659885579,0.0258000723187,0.0
61,1.41936937968,0.56719827652,0.819,1.0,7,8,"{'C': 7, 'degree': 8}",64,0.844218094667,1.0,0.790041991602,1.0,0.822716346154,1.0,0.119605504424,0.0271149280796,0.022281275594,0.0
62,1.38096300761,0.52001730601,0.7988,1.0,7,9,"{'C': 7, 'degree': 9}",73,0.822648292391,1.0,0.77924415117,1.0,0.794471153846,1.0,0.132167358614,0.0536212189455,0.0179884585582,0.0
63,0.860838572184,0.459072351456,0.8946,0.997299908767,8,1,"{'C': 8, 'degree': 1}",34,0.901737567406,0.996397478235,0.892021595681,0.998499849985,0.890024038462,0.997002398082,0.0349680088178,0.00506150303839,0.00511766908776,0.000883695347226
64,0.850591739019,0.494434595108,0.936,1.0,8,2,"{'C': 8, 'degree': 2}",1,0.94907130018,1.0,0.929214157169,1.0,0.9296875,1.0,0.0158803499348,0.0151139019404,0.0092545279602,0.0
65,0.983967701594,0.521380027135,0.9256,1.0,8,3,"{'C': 8, 'degree': 3}",10,0.940083882564,1.0,0.919016196761,1.0,0.917668269231,1.0,0.108445050387,0.0121548476126,0.0102671543892,0.0
66,0.950427452723,0.4713742733,0.908,1.0,8,4,"{'C': 8, 'degree': 4}",20,0.924505692031,1.0,0.896820635873,1.0,0.902644230769,1.0,0.0927220051356,0.0472133766396,0.0119228188725,0.0
67,1.06327001254,0.502092599869,0.8908,1.0,8,5,"{'C': 8, 'degree': 5}",37,0.913121629718,1.0,0.872225554889,1.0,0.887019230769,1.0,0.0593404060737,0.0227228773325,0.0169145210683,0.0
68,1.30528402328,0.551813364029,0.869,1.0,8,6,"{'C': 8, 'degree': 6}",46,0.895745955662,1.0,0.844031193761,1.0,0.8671875,1.0,0.276531035349,0.0413573060954,0.0211596589617,0.0
69,1.10154167811,0.496080716451,0.845,1.0,8,7,"{'C': 8, 'degree': 7}",55,0.877171959257,1.0,0.814037192561,1.0,0.84375,1.0,0.0166865169387,0.0470927454198,0.0258000723187,0.0
70,1.65180961291,0.710927009583,0.819,1.0,8,8,"{'C': 8, 'degree': 8}",64,0.844218094667,1.0,0.790041991602,1.0,0.822716346154,1.0,0.19807928597,0.21963688849,0.022281275594,0.0
71,1.49102361997,0.588618675868,0.7988,1.0,8,9,"{'C': 8, 'degree': 9}",73,0.822648292391,1.0,0.77924415117,1.0,0.794471153846,1.0,0.139922217093,0.043345084458,0.0179884585582,0.0
72,0.880068778992,0.50306224823,0.894,0.997899819058,9,1,"{'C': 9, 'degree': 1}",36,0.899340922708,0.996997898529,0.890821835633,0.998799879988,0.891826923077,0.997901678657,0.0522054009144,0.0429180558889,0.00380275547444,0.000735657025274
73,0.946513970693,0.500432650248,0.936,1.0,9,2,"{'C': 9, 'degree': 2}",1,0.94907130018,1.0,0.929214157169,1.0,0.9296875,1.0,0.0554235374311,0.00706134013716,0.0092545279602,0.0
74,1.00311295191,0.550570011139,0.9256,1.0,9,3,"{'C': 9, 'degree': 3}",10,0.940083882564,1.0,0.919016196761,1.0,0.917668269231,1.0,0.107728454698,0.0398730602388,0.0102671543892,0.0
75,1.22196102142,0.594403664271,0.908,1.0,9,4,"{'C': 9, 'degree': 4}",20,0.924505692031,1.0,0.896820635873,1.0,0.902644230769,1.0,0.0362257551746,0.0555370481021,0.0119228188725,0.0
76,1.09301193555,0.450908184052,0.8908,1.0,9,5,"{'C': 9, 'degree': 5}",37,0.913121629718,1.0,0.872225554889,1.0,0.887019230769,1.0,0.113770433743,0.0157597793651,0.0169145210683,0.0
77,1.05842192968,0.448619604111,0.869,1.0,9,6,"{'C': 9, 'degree': 6}",46,0.895745955662,1.0,0.844031193761,1.0,0.8671875,1.0,0.0245579982997,0.0256364007232,0.0211596589617,0.0
78,1.2709356149,0.489217996597,0.845,1.0,9,7,"{'C': 9, 'degree': 7}",55,0.877171959257,1.0,0.814037192561,1.0,0.84375,1.0,0.0900132602177,0.0330664626316,0.0258000723187,0.0
79,1.25778396924,0.503724336624,0.819,1.0,9,8,"{'C': 9, 'degree': 8}",64,0.844218094667,1.0,0.790041991602,1.0,0.822716346154,1.0,0.055742352154,0.0191521765577,0.022281275594,0.0
80,1.65692973137,0.708291292191,0.7988,1.0,9,9,"{'C': 9, 'degree': 9}",73,0.822648292391,1.0,0.77924415117,1.0,0.794471153846,1.0,0.350298409935,0.135857889246,0.0179884585582,0.0
