<svg xmlns="http://www.w3.org/2000/svg" viewBox="0 0 32 32" width="32" height="32">
  <defs id="defs3051">
    <style type="text/css" id="current-color-scheme">
      .ColorScheme-Text {
        color:#232629;
      }
      </style>
  </defs>
 <path style="fill:currentColor;fill-opacity:1;stroke:none" 
       d="m4 4v24h24l-1-1h-22v-13h5l3-3h14v16l1 1v-21h-10l-3-3z"
     class="ColorScheme-Text"
     />
</svg>
