<a href="index.html"><COLOUR2>AyyiGtk</font></a>/Contact
========================================================

&nbsp;

You can post to the [Linux Audio Developers list](https://lists.linuxaudio.org/listinfo/linux-audio-dev), or email <b>tim@ayyi.org</b>



