<svg xmlns="http://www.w3.org/2000/svg" viewBox="0 0 128 128" xmlns:xlink="http://www.w3.org/1999/xlink">
  <defs>
    <style>
      ellipse {
        fill:#ff9010;
        stroke-width:0;
      }
      .bg {
        fill:#00ff00;
      }
    </style>
  </defs>
  <ellipse
     cx="64"
     cy="64"
     rx="64"
     ry="64"
  />
  <g transform="scale(0.64)">
  <path
     d="M 69.05822 105.5912 C 65.27922 83.21501 66.63447 67.74697 66.14457 50.91606 C 69.81187 45.37749 73.79665 40.06321 82.96531 43.46877 C 87.87289 49.43218 88.94493 83.28872 89.17351 86.49512 C 89.22612 81.20702 84.37378 45.65708 87.97317 41.59662 C 93.79692 35.53323 99.48232 32.11923 108.1627 41.65387 C 110.184 43.87943 111.1913 83.28071 111.322 86.60124 C 111.5752 82.36585 108.614 53.09378 113.3242 49.52284 C 119.1003 45.46127 127.6349 46.76281 131.2812 53.85766 C 135.922 62.48348 134.167 80.37682 133.7259 89.02842 C 133.4817 82.65151 135.6178 67.47382 135.9428 62.51895 C 136.4836 57.69614 150.4376 70.11323 152.4487 76.46792 C 155.9182 88.1406 153.2101 110.1698 151.2373 118.9886 C 148.9816 130.4909 139.4582 144.7485 137.518 160.724 C 116.2702 160.4369 91.93629 161.2021 73.35671 161.1852 C 62.18315 131.8635 44.88267 120.1915 42.41605 102.0571 C 40.58716 85.61953 42.38934 95.96451 42.12285 92.12603 C 41.71486 86.56695 52.83853 78.77535 64.64358 90.57047 C 66.69608 101.1094 64.94527 98.94781 69.05822 105.5912 z "
     style="fill:none;fill-rule:evenodd;stroke:#000000;stroke-width:15.98314;stroke-linejoin:round;"
     />
  </g>
</svg>
