<?xml version="1.0" encoding="UTF-8" standalone="no"?>
<!DOCTYPE svg PUBLIC "-//W3C//DTD SVG 20010904//EN"
"http://www.w3.org/TR/2001/REC-SVG-20010904/DTD/svg10.dtd">
<!-- Created with Sodipodi ("http://www.sodipodi.com/") -->
<svg
   xmlns="http://www.w3.org/2000/svg"
   xmlns:xlink="http://www.w3.org/1999/xlink"
   xmlns:sodipodi="http://sodipodi.sourceforge.net/DTD/sodipodi-0.dtd"
   version="1.0"
   x="0"
   y="0"
   width="200"
   height="200"
   id="svg153">
  <defs
     id="defs155">
    <linearGradient
       id="linearGradient158">
      <stop
         style="stop-color:#000000;stop-opacity:1;"
         offset="0"
         id="stop159" />
      <stop
         style="stop-color:#ffffff;stop-opacity:1;"
         offset="1"
         id="stop160" />
    </linearGradient>
    <linearGradient
       id="linearGradient161"
       xlink:href="#linearGradient158" />
  </defs>
</svg>
