<svg xmlns="http://www.w3.org/2000/svg" viewBox="0 0 128 128" xmlns:xlink="http://www.w3.org/1999/xlink">
  <defs>
    <style>
      ellipse {
        fill:#ff9010;
        stroke-width:0;
      }
      .bg {
        fill:#00ff00;
      }
    </style>
  </defs>
  <ellipse
     cx="64"
     cy="64"
     rx="64"
     ry="64"
  />
  <g transform="scale(0.64)">
  <path
     d="M 64.9954 138.4148 L 139.0267 64.91211 "
     style="fill:none;stroke:#000000;stroke-width:25.48883;stroke-linecap:round;"
     />
  <path
     d="M 138.8069 138.6127 L 65.09676 64.71417 "
     style="fill:none;stroke:#000000;stroke-width:25.5443;stroke-linecap:round;"
     />
  </g>
</svg>
