<?xml version="1.0" encoding="UTF-8" standalone="no"?>
<!DOCTYPE svg PUBLIC "-//W3C//DTD SVG 20010904//EN"
"http://www.w3.org/TR/2001/REC-SVG-20010904/DTD/svg10.dtd">
<svg
   xmlns="http://www.w3.org/2000/svg"
   xmlns:xlink="http://www.w3.org/1999/xlink"
   xmlns:sodipodi="http://sodipodi.sourceforge.net/DTD/sodipodi-0.dtd"
   version="1.0"
   x="0"
   y="0"
   width="128"
   height="128"
>
  <ellipse
     cx="64"
     cy="64"
     rx="64"
     ry="64"
     style="fill:#ff9010;stroke-width:0;"
     />
  <g transform="scale(0.64)">
  <path
     d="M 64.9954 138.4148 L 139.0267 64.91211 "
     style="fill:none;fill-rule:evenodd;stroke:#000000;stroke-width:25.48883;stroke-linecap:round;"
     id="path164" />
  <path
     d="M 138.8069 138.6127 L 65.09676 64.71417 "
     style="fill:none;fill-rule:evenodd;stroke:#000000;stroke-width:25.5443;stroke-linecap:round;"
     id="path611" />
  </g>
</svg>
