898382 254043 525
916897 3639 525
845905 686603 525
66949 776020 509
266416 286034 407
141333 288654 443
592932 729436 509
262734 937034 525
46072 967582 525
273617 199010 443
487986 708615 509
215820 584719 470
896614 970272 507
390267 579903 470
656282 614244 509
64367 346547 443
712305 583664 509
629407 594101 509
888665 776945 525
209773 655779 509
487464 14821 449
755871 999355 525
591065 769769 509
676293 886503 525
296282 826626 509
482065 112680 449
341180 67486 443
569456 529227 452
308598 938666 525
60859 71598 335
265871 717865 509
441087 291561 449
488884 220594 449
743231 702302 504
483301 349598 449
350891 774422 509
495420 921181 525
668972 333432 509
825184 375666 509
814160 55249 509
355240 823786 509
804862 562467 509
781167 182655 509
174025 956905 525
673219 265705 509
110910 688901 509
239803 189532 443
448618 907459 525
375394 193672 443
748514 730826 424
312457 61955 443
209253 69407 383
241762 495797 449
539212 308435 470
370798 886136 525
957394 937787 507
148617 927559 525
92848 803459 509
915256 756216 525
35887 975434 525
755577 818658 468
993848 526400 525
70163 628763 509
384896 205793 443
251856 49077 443
487590 220677 449
265066 213379 443
829714 272404 509
248232 243433 350
211701 771353 509
953652 497319 525
431505 638555 509
145110 501419 449
761009 994971 525
711694 367966 509
822808 49376 509
850034 482839 525
867405 791875 525
520888 388242 470
132459 105604 354
358165 984478 525
603520 520729 452
431274 477754 444
616529 904477 525
428561 61607 449
966484 982020 458
948648 822091 525
376354 774826 509
180142 518395 470
856132 934241 476
495148 556561 470
558144 217744 470
549793 53217 470
512217 559273 452
712348 766030 424
831825 82179 509
595949 834445 509
481030 259085 449
298422 859585 525
312882 460775 449
107957 326451 443
679028 829711 504
135176 71789 354
653911 290782 509
897428 393153 525
488759 185520 449
962227 409182 525
88046 914213 525
216361 38345 383
113772 412092 449
1730 483125 449
985886 198669 525
94011 432248 449
398866 87971 443
623457 531579 452
97354 445500 449
257040 257123 257
601032 186877 470
925275 54638 525
993767 936091 507
100580 525053 470
295423 881495 525
52272 769788 509
269652 822755 509
245820 685506 509
716029 964625 525
482046 601608 470
115102 448113 449
144022 56135 375
993737 614727 525
964939 189414 525
228043 878372 525
470036 330635 449
983842 799956 525
216759 519576 470
305739 949585 525
663737 803705 504
687979 580192 509
285607 776686 509
4792 156611 383
820546 603177 509
726802 124881 509
267498 295211 407
82409 303061 443
383386 359812 423
72831 821690 509
239262 109764 443
246049 637214 509
508540 300918 449
713916 100841 509
597222 14490 470
905273 122404 525
585227 866985 525
341342 244579 407
149048 207568 383
521201 143816 470
652647 97457 509
467275 786399 509
722598 661938 504
452784 220719 449
82908 584701 470
122922 594975 470
122948 560570 470
299530 763823 509
188104 713462 509
616843 846982 525
900140 201116 525
754567 30210 509
582827 230577 470
59018 993268 525
577301 13729 470
319717 323754 371
87472 773791 509
3445 751070 509
310113 35945 443
56725 390373 443
58877 205330 383
299165 866175 525
704796 297920 509
711741 188632 509
187294 917695 525
855562 583178 525
718884 311829 509
733272 957639 525
795471 72924 509
172354 339270 443
77990 77360 245
884716 932643 476
915458 192534 525
919250 286914 525
135983 877322 525
552798 580234 421
862299 460587 525
93017 278722 443
330402 776186 509
782526 656812 504
802941 71662 509
110514 667697 509
826464 90086 509
457139 663728 509
531658 597205 452
497378 477655 426
718188 149924 509
650297 707209 504
587219 509093 470
563852 983930 525
617453 637991 509
592278 112801 470
235864 897709 525
870208 770818 525
268698 420213 449
297944 302449 371
344430 124265 443
940489 701710 525
958503 761015 525
956279 581211 525
634609 861635 525
420222 879737 525
113625 238630 443
504466 519434 470
975005 795587 525
527454 278580 470
814607 736815 468
911807 119212 525
512335 487633 470
47260 966319 525
449013 276016 449
731077 507080 509
755050 349123 509
326259 900987 525
290191 658941 509
904303 436309 525
543860 979371 525
372321 190074 443
938633 28278 525
382842 985483 525
901574 134418 525
367424 750713 509
823926 963871 525
373893 694470 509
971446 685329 525
447189 568361 470
739951 977213 525
17343 455843 449
748394 882566 525
306762 420232 449
171245 902401 525
322716 241690 407
319989 667844 509
203020 859467 525
563763 16483 470
302969 206445 443
324798 288986 384
490432 579946 470
380543 593607 470
456078 925457 525
319378 1301 443
381801 797270 509
779071 797663 468
311935 610676 470
