{
    "debug": true,
    "server": {
      "address": ":9090"
    },
    "context":{
      "timeout":2
    },
    "database": {
        "host": "localhost",
        "port": "3306",
        "user": "root",
        "pass": "root",
        "name": "stickers"
    }
  
  }