{
  "type": "object",
  "properties": {
    "title": {
      "type": "string"
    },
    "created_at": {
      "type": "string"
    },
    "body": {
      "type": [
        "string",
        "null"
      ]
    },
    "id": {
      "type": "integer"
    },
    "number": {
      "type": "integer"
    },
    "state": {
      "type": "string"
    },
    "html_url": {
      "type": "string"
    },
    "merged": {
      "type": "boolean"
    },
    "merged_at": {
      "type": [
        "date",
        "null"
      ]
    },
    "closed_at": {
      "type": [
        "date",
        "null"
      ]
    },
    "updated_at": {
      "type": "date"
    },
    "assignee": {
      "type": "object",
      "required": [
        "id",
        "login",
        "url"
      ],
      "properties": {
        "id": {
          "type": "integer"
        },
        "login": {
          "type": "string"
        },
        "url": {
          "type": "string"
        }
      },
      "additionalProperties": false
    },
    "author": {
      "type": "object",
      "required": [
        "id",
        "login",
        "url"
      ],
      "properties": {
        "id": {
          "type": "integer"
        },
        "login": {
          "type": "string"
        },
        "url": {
          "type": "string"
        }
      },
      "additionalProperties": false
    },
    "head": {
      "type": "object",
      "required": [
        "label",
        "ref",
        "repo"
      ],
      "properties": {
        "label": {
          "type": "string"
        },
        "ref": {
          "type": "string"
        },
        "repo": {
          "oneOf": [
            {
              "type": "null"
            },
            {
              "$ref": "repository.json"
            }
          ]
        }
      },
      "additionalProperties": false
    },
    "base": {
      "type": "object",
      "required": [
        "label",
        "ref",
        "repo"
      ],
      "properties": {
        "label": {
          "type": "string"
        },
        "ref": {
          "type": "string"
        },
        "repo": {
          "oneOf": [
            {
              "type": "null"
            },
            {
              "$ref": "repository.json"
            }
          ]
        }
      },
      "additionalProperties": false
    },
    "additionalProperties": false
  }
}