Library\Bee\artifacts\mvdfrm\Unity.VisualScripting.Core.Editor.ref.dll_EDC8690F57C5BDFD.mvfrm
Library\Bee\artifacts\mvdfrm\Unity.VisualScripting.Core.ref.dll_D75DF4EA1AFE54F4.mvfrm
Library\Bee\artifacts\mvdfrm\Unity.VisualScripting.Flow.Editor.ref.dll_6AF951BE66A4493E.mvfrm
Library\Bee\artifacts\mvdfrm\Unity.VisualScripting.Flow.ref.dll_1E6ED5409D07C9A3.mvfrm
Library\Bee\artifacts\mvdfrm\Unity.VisualScripting.State.ref.dll_D91762B7076BE462.mvfrm
Library\Bee\artifacts\mvdfrm\UnityEditor.TestRunner.ref.dll_193EC4CE382CBFB3.mvfrm
Library\Bee\artifacts\mvdfrm\UnityEditor.UI.ref.dll_4C98D3F7040CD4F5.mvfrm
Library\Bee\artifacts\mvdfrm\UnityEngine.TestRunner.ref.dll_E55D0F7C63F01D9E.mvfrm
Library\Bee\artifacts\mvdfrm\UnityEngine.UI.ref.dll_08FEAA520A2EFD60.mvfrm
Library\Bee\artifacts\mvdfrm\UnityEditor.Graphs.dll_E6AB47C76EF66043.mvfrm
Library\Bee\artifacts\mvdfrm\UnityEditor.CoreModule.dll_620B7AA55EC42711.mvfrm
Library\Bee\artifacts\mvdfrm\UnityEditor.DeviceSimulatorModule.dll_F29DD65439ABEA80.mvfrm
Library\Bee\artifacts\mvdfrm\UnityEditor.DiagnosticsModule.dll_8BB3AB9D6F5D7CCE.mvfrm
Library\Bee\artifacts\mvdfrm\UnityEditor.dll_B73C6F9BAB7075B4.mvfrm
Library\Bee\artifacts\mvdfrm\UnityEditor.EditorToolbarModule.dll_AAA196E42AB3C850.mvfrm
Library\Bee\artifacts\mvdfrm\UnityEditor.GraphViewModule.dll_5474F571074812E5.mvfrm
Library\Bee\artifacts\mvdfrm\UnityEditor.PresetsUIModule.dll_0FDB2E5309A06AEA.mvfrm
Library\Bee\artifacts\mvdfrm\UnityEditor.QuickSearchModule.dll_16C32CAAC8347927.mvfrm
Library\Bee\artifacts\mvdfrm\UnityEditor.SceneTemplateModule.dll_CE4107A229A07288.mvfrm
Library\Bee\artifacts\mvdfrm\UnityEditor.SceneViewModule.dll_9324D878FC6ADFF3.mvfrm
Library\Bee\artifacts\mvdfrm\UnityEditor.TextCoreFontEngineModule.dll_038BF97F5859F16F.mvfrm
Library\Bee\artifacts\mvdfrm\UnityEditor.TextCoreTextEngineModule.dll_4B742FF0E7DDAA8D.mvfrm
Library\Bee\artifacts\mvdfrm\UnityEditor.UIBuilderModule.dll_A8FDA28D7A008C19.mvfrm
Library\Bee\artifacts\mvdfrm\UnityEditor.UIElementsModule.dll_FA747AECA46136AD.mvfrm
Library\Bee\artifacts\mvdfrm\UnityEditor.UIElementsSamplesModule.dll_9977D7E883965490.mvfrm
Library\Bee\artifacts\mvdfrm\UnityEditor.UnityConnectModule.dll_61A2ACEDBE735E47.mvfrm
Library\Bee\artifacts\mvdfrm\UnityEngine.AccessibilityModule.dll_00E673392A169A25.mvfrm
Library\Bee\artifacts\mvdfrm\UnityEngine.AIModule.dll_BFA325627B403D45.mvfrm
Library\Bee\artifacts\mvdfrm\UnityEngine.AndroidJNIModule.dll_78BD63BFED80A583.mvfrm
Library\Bee\artifacts\mvdfrm\UnityEngine.AnimationModule.dll_22FA7199E1A4E78B.mvfrm
Library\Bee\artifacts\mvdfrm\UnityEngine.ARModule.dll_7915EA65D85D9C0E.mvfrm
Library\Bee\artifacts\mvdfrm\UnityEngine.AssetBundleModule.dll_5AAC5F9C2A9B2E19.mvfrm
Library\Bee\artifacts\mvdfrm\UnityEngine.AudioModule.dll_17DD406C96F4EDBD.mvfrm
Library\Bee\artifacts\mvdfrm\UnityEngine.ClothModule.dll_7EC59D677111CCA1.mvfrm
Library\Bee\artifacts\mvdfrm\UnityEngine.ClusterInputModule.dll_E13F22036FFB310D.mvfrm
Library\Bee\artifacts\mvdfrm\UnityEngine.ClusterRendererModule.dll_F84A98C5A966F804.mvfrm
Library\Bee\artifacts\mvdfrm\UnityEngine.ContentLoadModule.dll_F3C2B8DCF91DD606.mvfrm
Library\Bee\artifacts\mvdfrm\UnityEngine.CoreModule.dll_852C4DF806C9923C.mvfrm
Library\Bee\artifacts\mvdfrm\UnityEngine.CrashReportingModule.dll_6488684BF9DFE354.mvfrm
Library\Bee\artifacts\mvdfrm\UnityEngine.DirectorModule.dll_2C7986047A988F59.mvfrm
Library\Bee\artifacts\mvdfrm\UnityEngine.dll_E9E0B67409E40299.mvfrm
Library\Bee\artifacts\mvdfrm\UnityEngine.DSPGraphModule.dll_31CAE76DECF9607A.mvfrm
Library\Bee\artifacts\mvdfrm\UnityEngine.GameCenterModule.dll_A30AADDAB3C19674.mvfrm
Library\Bee\artifacts\mvdfrm\UnityEngine.GIModule.dll_57DF6E7016EF255F.mvfrm
Library\Bee\artifacts\mvdfrm\UnityEngine.GridModule.dll_629D69E61F1E2833.mvfrm
Library\Bee\artifacts\mvdfrm\UnityEngine.HotReloadModule.dll_A4432F9FBCD8030D.mvfrm
Library\Bee\artifacts\mvdfrm\UnityEngine.ImageConversionModule.dll_643C96762B8BAFF8.mvfrm
Library\Bee\artifacts\mvdfrm\UnityEngine.IMGUIModule.dll_503CDFD35D26819E.mvfrm
Library\Bee\artifacts\mvdfrm\UnityEngine.InputLegacyModule.dll_EBF17ABAC28CE40A.mvfrm
Library\Bee\artifacts\mvdfrm\UnityEngine.InputModule.dll_7E53081D0D2D1261.mvfrm
Library\Bee\artifacts\mvdfrm\UnityEngine.JSONSerializeModule.dll_60FDFC752951FAAF.mvfrm
Library\Bee\artifacts\mvdfrm\UnityEngine.LocalizationModule.dll_1F8BEC5607772406.mvfrm
Library\Bee\artifacts\mvdfrm\UnityEngine.NVIDIAModule.dll_9FAE3D30D817A628.mvfrm
Library\Bee\artifacts\mvdfrm\UnityEngine.ParticleSystemModule.dll_B79AB19867F16EE2.mvfrm
Library\Bee\artifacts\mvdfrm\UnityEngine.PerformanceReportingModule.dll_F25C922D2B0A62FB.mvfrm
Library\Bee\artifacts\mvdfrm\UnityEngine.Physics2DModule.dll_6FA0618A82A1DF20.mvfrm
Library\Bee\artifacts\mvdfrm\UnityEngine.PhysicsModule.dll_EC4F0B84BF7B622E.mvfrm
Library\Bee\artifacts\mvdfrm\UnityEngine.ProfilerModule.dll_5EBFBF3B13F21666.mvfrm
Library\Bee\artifacts\mvdfrm\UnityEngine.PropertiesModule.dll_D045ED1926ACFAB0.mvfrm
Library\Bee\artifacts\mvdfrm\UnityEngine.RuntimeInitializeOnLoadManagerInitializerModule.dll_FF62A91813E58FE9.mvfrm
Library\Bee\artifacts\mvdfrm\UnityEngine.ScreenCaptureModule.dll_7AE5A9FA3DBE2711.mvfrm
Library\Bee\artifacts\mvdfrm\UnityEngine.SharedInternalsModule.dll_E84DD54BA2B9AB48.mvfrm
Library\Bee\artifacts\mvdfrm\UnityEngine.SpriteMaskModule.dll_8C37206AD5312BEE.mvfrm
Library\Bee\artifacts\mvdfrm\UnityEngine.SpriteShapeModule.dll_740D8CF6E03D6623.mvfrm
Library\Bee\artifacts\mvdfrm\UnityEngine.StreamingModule.dll_D78F5EEA312C9EC9.mvfrm
Library\Bee\artifacts\mvdfrm\UnityEngine.SubstanceModule.dll_B43A73337C7F9CD7.mvfrm
Library\Bee\artifacts\mvdfrm\UnityEngine.SubsystemsModule.dll_F6E486CCA3791401.mvfrm
Library\Bee\artifacts\mvdfrm\UnityEngine.TerrainModule.dll_069586F39539AB1C.mvfrm
Library\Bee\artifacts\mvdfrm\UnityEngine.TerrainPhysicsModule.dll_B8155A6B8134696F.mvfrm
Library\Bee\artifacts\mvdfrm\UnityEngine.TextCoreFontEngineModule.dll_81EB74D26B57B03A.mvfrm
Library\Bee\artifacts\mvdfrm\UnityEngine.TextCoreTextEngineModule.dll_C9D3AB43FADB6958.mvfrm
Library\Bee\artifacts\mvdfrm\UnityEngine.TextRenderingModule.dll_A4251C04F4F5A706.mvfrm
Library\Bee\artifacts\mvdfrm\UnityEngine.TilemapModule.dll_A591EE74ACF68C25.mvfrm
Library\Bee\artifacts\mvdfrm\UnityEngine.TLSModule.dll_2FD4B485A3447782.mvfrm
Library\Bee\artifacts\mvdfrm\UnityEngine.UIElementsModule.dll_FB22E834A6A54FF8.mvfrm
Library\Bee\artifacts\mvdfrm\UnityEngine.UIModule.dll_BB16C38FD78742F1.mvfrm
Library\Bee\artifacts\mvdfrm\UnityEngine.UmbraModule.dll_92B1EC85241B9930.mvfrm
Library\Bee\artifacts\mvdfrm\UnityEngine.UnityAnalyticsCommonModule.dll_8D9B4F7144F30159.mvfrm
Library\Bee\artifacts\mvdfrm\UnityEngine.UnityAnalyticsModule.dll_D73A22621418C0DE.mvfrm
Library\Bee\artifacts\mvdfrm\UnityEngine.UnityConnectModule.dll_4F0230FCB8FB5EF2.mvfrm
Library\Bee\artifacts\mvdfrm\UnityEngine.UnityCurlModule.dll_561712CB51B8D978.mvfrm
Library\Bee\artifacts\mvdfrm\UnityEngine.UnityTestProtocolModule.dll_553A8DDADD91A9E6.mvfrm
Library\Bee\artifacts\mvdfrm\UnityEngine.UnityWebRequestAssetBundleModule.dll_3B613568DBE75A2F.mvfrm
Library\Bee\artifacts\mvdfrm\UnityEngine.UnityWebRequestAudioModule.dll_6A58E60BB1752D93.mvfrm
Library\Bee\artifacts\mvdfrm\UnityEngine.UnityWebRequestModule.dll_75DB9E2036804A77.mvfrm
Library\Bee\artifacts\mvdfrm\UnityEngine.UnityWebRequestTextureModule.dll_EBA3AF71C13083C8.mvfrm
Library\Bee\artifacts\mvdfrm\UnityEngine.UnityWebRequestWWWModule.dll_9495F09FEA9B25C4.mvfrm
Library\Bee\artifacts\mvdfrm\UnityEngine.VehiclesModule.dll_A43C7F83F4C25EF4.mvfrm
Library\Bee\artifacts\mvdfrm\UnityEngine.VFXModule.dll_B0B34CF479B1E0EF.mvfrm
Library\Bee\artifacts\mvdfrm\UnityEngine.VideoModule.dll_3CE6C4D759870962.mvfrm
Library\Bee\artifacts\mvdfrm\UnityEngine.VirtualTexturingModule.dll_30902C674977A9DA.mvfrm
Library\Bee\artifacts\mvdfrm\UnityEngine.VRModule.dll_0DE8EA157941C869.mvfrm
Library\Bee\artifacts\mvdfrm\UnityEngine.WindModule.dll_FB7B2920980010A5.mvfrm
Library\Bee\artifacts\mvdfrm\UnityEngine.XRModule.dll_40A7AD1A027C15C7.mvfrm
Library\Bee\artifacts\mvdfrm\UnityEditor.WindowsStandalone.Extensions.dll_489504107412C49F.mvfrm
Library\Bee\artifacts\mvdfrm\Unity.Plastic.Antlr3.Runtime.dll_06567403B026473B.mvfrm
Library\Bee\artifacts\mvdfrm\Unity.Plastic.Newtonsoft.Json.dll_2AAE32905E8C08CA.mvfrm
Library\Bee\artifacts\mvdfrm\Unity.VisualScripting.IonicZip.dll_BE5647D59BA90757.mvfrm
Library\Bee\artifacts\mvdfrm\Unity.VisualScripting.YamlDotNet.dll_73B4528AAC4BDD55.mvfrm
Library\Bee\artifacts\mvdfrm\Unity.VisualScripting.TextureAssets.dll_0AD27BDE6D193B4D.mvfrm
Library\Bee\artifacts\mvdfrm\Unity.VisualScripting.Antlr3.Runtime.dll_2521796BDD14ED74.mvfrm