<svg xmlns="http://www.w3.org/2000/svg" width="8.567" height="17.135" viewBox="0 0 8.567 17.135">
    <path fill="#f5e6e9" d="M13.5 9l8.567 8.567-8.567 8.568z" transform="translate(-13.5 -9)"/>
</svg>
