{
  "name": "jdbc-accountentries ",
  "config": {
    "poll.interval.ms": "500",
    "batch.max.rows": "2000",
    "connector.class": "io.confluent.connect.jdbc.JdbcSourceConnector",
    "tasks.max": "1",
    "connection.url": "jdbc:mariadb://dbserver:3306/connect?user=root&password=verysecret",
    "mode": "timestamp",
    "query": "SELECT `identifier`, `modified`, `account`, `currency`, `amount`, `balanceAfterTransaction`, `transactionType`, `description`, `counterpartyAccount`, `counterpartyName` FROM `accountentries`",
    "timestamp.column.name": "modified",
    "topic.prefix": "payments-accountentry",
    "transforms": "Cast,InsertField,ValueToKey,RenameKeyFields,RenameValueFields,SetSchemaMetadataKey,SetSchemaMetadataValue",
    "transforms.Cast.type": "org.apache.kafka.connect.transforms.Cast$Value",
    "transforms.Cast.spec": "identifier:string,amount:string,balanceAfterTransaction:string",
    "transforms.InsertField.type": "org.apache.kafka.connect.transforms.InsertField$Value",
    "transforms.InsertField.static.field": "source!",
    "transforms.InsertField.static.value": "Kafka Connect Workshop JDCC Account Entry Connector",
    "transforms.ValueToKey.type": "org.apache.kafka.connect.transforms.ValueToKey",
    "transforms.ValueToKey.fields": "account",
    "transforms.RenameKeyFields.type": "org.apache.kafka.connect.transforms.ReplaceField$Key",
    "transforms.RenameKeyFields.renames": "account:iban",
    "transforms.RenameValueFields.type": "org.apache.kafka.connect.transforms.ReplaceField$Value",
    "transforms.RenameValueFields.renames": "accountid:accountId,modified:timestamp,identifier:key,transactionType:creditDebitIndicator",
    "transforms.SetSchemaMetadataKey.type": "org.apache.kafka.connect.transforms.SetSchemaMetadata$Key",
    "transforms.SetSchemaMetadataKey.schema.name": "io.axual.payments.AccountId",
    "transforms.SetSchemaMetadataKey.schema.version": 1,
    "transforms.SetSchemaMetadataValue.type": "org.apache.kafka.connect.transforms.SetSchemaMetadata$Value",
    "transforms.SetSchemaMetadataValue.schema.name": "io.axual.payments.AccountEntryEvent",
    "transforms.SetSchemaMetadataValue.schema.version": 1,
    "key.converter": "io.confluent.connect.avro.AvroConverter",
    "key.converter.schema.registry.url": "http://schema_registry:8081",
    "value.converter": "io.confluent.connect.avro.AvroConverter",
    "value.converter.schema.registry.url": "http://schema_registry:8081"
  }
}
