TransactionId,OrderId,AccountId,CounterPartyId,Amount,Balance Before,Balance After
100001,1,RABO0,ABNA2,70.00,-80.00,-10.00
100002,1,ABNA2,RABO0,-70.00,-76.00,-146.00
100003,2,RABO2,ABNA0,-14.00,-53.00,-67.00
100004,2,ABNA0,RABO2,14.00,84.00,98.00
100005,3,RABO9,ABNA3,-73.00,66.00,-7.00
100006,3,ABNA3,RABO9,73.00,80.00,153.00
100007,4,RABO1,ABNA1,71.00,46.00,117.00
100008,4,ABNA1,RABO1,-71.00,-59.00,-130.00
100009,5,RABO9,ABNA0,-40.00,51.00,11.00
100010,5,ABNA0,RABO9,40.00,-52.00,-12.00
100011,6,RABO2,ABNA8,-24.00,-7.00,-31.00
100012,6,ABNA8,RABO2,24.00,-11.00,13.00
100013,7,RABO0,ABNA2,-92.00,54.00,-38.00
100014,7,ABNA2,RABO0,92.00,84.00,176.00
100015,8,RABO0,ABNA8,-82.00,-80.00,-162.00
100016,8,ABNA8,RABO0,82.00,-84.00,-2.00
100017,9,RABO0,ABNA4,65.00,48.00,113.00
100018,9,ABNA4,RABO0,-65.00,-77.00,-142.00
100019,10,RABO4,ABNA6,-35.00,-23.00,-58.00
100020,10,ABNA6,RABO4,35.00,78.00,113.00
100021,11,RABO2,ABNA8,-48.00,82.00,34.00
100022,11,ABNA8,RABO2,48.00,47.00,95.00
100023,12,RABO2,ABNA0,-91.00,-33.00,-124.00
100024,12,ABNA0,RABO2,91.00,21.00,112.00
100025,13,RABO5,ABNA4,2.00,-45.00,-43.00
100026,13,ABNA4,RABO5,-2.00,52.00,50.00
100027,14,RABO5,ABNA8,68.00,40.00,108.00
100028,14,ABNA8,RABO5,-68.00,68.00,0.00
100029,15,RABO8,ABNA1,-69.00,-14.00,-83.00
100030,15,ABNA1,RABO8,69.00,88.00,157.00