AxtriaSalesIQTM__Account__c,AxtriaSalesIQTM__Position__c,AxtriaSalesIQTM__Account_Alignment_Type__c,AxtriaSalesIQTM__IsShared__c,AxtriaSalesIQTM__SharedWith__c,AxtriaSalesIQTM__Metric1__c,AxtriaSalesIQTM__Affiliation_Based_Alignment__c,AxtriaSalesIQTM__Team_Instance__c,AxtriaSalesIQTM__Effective_Start_Date__c,AxtriaSalesIQTM__Effective_End_Date__c,AxtriaSalesIQTM__Segment_1__c,Id
0011r00001tpauzAAA,a2B1r00000Aj3R9EAJ,Implicit,,,,False,a2X1r000005GatfEAC,2019-05-01 00:00:00,2019-05-01 00:00:00,,a251l000000OHhuAAG
0011r00001tpauzAAA,a2B1r00000Aj3R9EAJ,Implicit,,,,False,a2X1r000005GatfEAC,2019-05-01 00:00:00,2019-05-01 00:00:00,,a251l000000OHhuAAG
0011r00001tpbtJAAQ,a2B1r00000Aj3R9EAJ,Implicit,,,,False,a2X1r000005GatfEAC,2019-05-01 00:00:00,2019-05-01 00:00:00,,a251l000000OHgkAAG
0011r00001tpbtJAAQ,a2B1r00000Aj3R9EAJ,Implicit,,,,False,a2X1r000005GatfEAC,2019-05-01 00:00:00,2019-05-01 00:00:00,,a251l000000OHgkAAG
0011r00001tpdSiAAI,a2B1r00000Aj3R9EAJ,Implicit,,,,False,a2X1r000005GatfEAC,2019-05-01 00:00:00,2019-05-01 00:00:00,,a251l000000OI4LAAW
0011r00001tpdSiAAI,a2B1r00000Aj3R9EAJ,Implicit,,,,False,a2X1r000005GatfEAC,2019-05-01 00:00:00,2019-05-01 00:00:00,,a251l000000OI4LAAW
0011r00001tpdTBAAY,a2B1r00000Aj3R9EAJ,Implicit,,,,False,a2X1r000005GatfEAC,2019-05-01 00:00:00,2019-05-01 00:00:00,,a251l000000OHelAAG
0011r00001tpdTBAAY,a2B1r00000Aj3R9EAJ,Implicit,,,,False,a2X1r000005GatfEAC,2019-05-01 00:00:00,2019-05-01 00:00:00,,a251l000000OHelAAG
0011r00001tphOKAAY,a2B1r00000Aj3R9EAJ,Implicit,,,,False,a2X1r000005GatfEAC,2019-05-01 00:00:00,2019-05-01 00:00:00,,a251l000000OHhHAAW
0011r00001tphOKAAY,a2B1r00000Aj3R9EAJ,Implicit,,,,False,a2X1r000005GatfEAC,2019-05-01 00:00:00,2019-05-01 00:00:00,,a251l000000OHhHAAW
0011r00001tpi4KAAQ,a2B1r00000Aj3R9EAJ,Implicit,,,,False,a2X1r000005GatfEAC,2019-05-01 00:00:00,2019-05-01 00:00:00,,a251l000000OIBhAAO
0011r00001tpi4KAAQ,a2B1r00000Aj3R9EAJ,Implicit,,,,False,a2X1r000005GatfEAC,2019-05-01 00:00:00,2019-05-01 00:00:00,,a251l000000OIBhAAO
0011r00001tpjoFAAQ,a2B1r00000Aj3R9EAJ,Implicit,,,,False,a2X1r000005GatfEAC,2019-05-01 00:00:00,2019-05-01 00:00:00,,a251l000000OHeoAAG
0011r00001tpjoFAAQ,a2B1r00000Aj3R9EAJ,Implicit,,,,False,a2X1r000005GatfEAC,2019-05-01 00:00:00,2019-05-01 00:00:00,,a251l000000OHeoAAG
0011r00001tpkqpAAA,a2B1r00000Aj3R9EAJ,Implicit,,,,False,a2X1r000005GatfEAC,2019-05-01 00:00:00,2019-05-01 00:00:00,,a251l000000OHdlAAG
0011r00001tpkqpAAA,a2B1r00000Aj3R9EAJ,Implicit,,,,False,a2X1r000005GatfEAC,2019-05-01 00:00:00,2019-05-01 00:00:00,,a251l000000OHdlAAG
0011r00001tpmEXAAY,a2B1r00000Aj3R9EAJ,Implicit,,,,False,a2X1r000005GatfEAC,2019-05-01 00:00:00,2019-05-01 00:00:00,,a251l000000OHnFAAW
0011r00001tpmEXAAY,a2B1r00000Aj3R9EAJ,Implicit,,,,False,a2X1r000005GatfEAC,2019-05-01 00:00:00,2019-05-01 00:00:00,,a251l000000OHnFAAW
0011r00001tpR56AAE,a2B1r00000Aj3R9EAJ,Implicit,,,,False,a2X1r000005GatfEAC,2019-05-01 00:00:00,2019-05-01 00:00:00,,a251l000000OI1yAAG
0011r00001tpR56AAE,a2B1r00000Aj3R9EAJ,Implicit,,,,False,a2X1r000005GatfEAC,2019-05-01 00:00:00,2019-05-01 00:00:00,,a251l000000OI1yAAG
0011r00001tpRruAAE,a2B1r00000Aj3R9EAJ,Implicit,,,,False,a2X1r000005GatfEAC,2019-05-01 00:00:00,2019-05-01 00:00:00,,a251l000000OHNUAA4
0011r00001tpRruAAE,a2B1r00000Aj3R9EAJ,Implicit,,,,False,a2X1r000005GatfEAC,2019-05-01 00:00:00,2019-05-01 00:00:00,,a251l000000OHNUAA4
0011r00001tprt0AAA,a2B1r00000Aj3R9EAJ,Implicit,,,,False,a2X1r000005GatfEAC,2019-05-01 00:00:00,2019-05-01 00:00:00,,a251l000000OHHJAA4
0011r00001tprt0AAA,a2B1r00000Aj3R9EAJ,Implicit,,,,False,a2X1r000005GatfEAC,2019-05-01 00:00:00,2019-05-01 00:00:00,,a251l000000OHHJAA4
0011r00001tpSV7AAM,a2B1r00000Aj3R9EAJ,Implicit,,,,False,a2X1r000005GatfEAC,2019-05-01 00:00:00,2019-05-01 00:00:00,,a251l000000OHoNAAW
0011r00001tpSV7AAM,a2B1r00000Aj3R9EAJ,Implicit,,,,False,a2X1r000005GatfEAC,2019-05-01 00:00:00,2019-05-01 00:00:00,,a251l000000OHoNAAW
0011r00001tpuaHAAQ,a2B1r00000Aj3R9EAJ,Implicit,,,,False,a2X1r000005GatfEAC,2019-05-01 00:00:00,2019-05-01 00:00:00,,a251l000000OHcaAAG
0011r00001tpuaHAAQ,a2B1r00000Aj3R9EAJ,Implicit,,,,False,a2X1r000005GatfEAC,2019-05-01 00:00:00,2019-05-01 00:00:00,,a251l000000OHcaAAG
0011r00001tpv9IAAQ,a2B1r00000Aj3R9EAJ,Implicit,,,,False,a2X1r000005GatfEAC,2019-05-01 00:00:00,2019-05-01 00:00:00,,a251l000000OI6IAAW
0011r00001tpv9IAAQ,a2B1r00000Aj3R9EAJ,Implicit,,,,False,a2X1r000005GatfEAC,2019-05-01 00:00:00,2019-05-01 00:00:00,,a251l000000OI6IAAW
0011r00001tpWrUAAU,a2B1r00000Aj3R9EAJ,Implicit,,,,False,a2X1r000005GatfEAC,2019-05-01 00:00:00,2019-05-01 00:00:00,,a251l000000OHd6AAG
0011r00001tpWrUAAU,a2B1r00000Aj3R9EAJ,Implicit,,,,False,a2X1r000005GatfEAC,2019-05-01 00:00:00,2019-05-01 00:00:00,,a251l000000OHd6AAG
0011r00001tpZ6xAAE,a2B1r00000Aj3R9EAJ,Implicit,,,,False,a2X1r000005GatfEAC,2019-05-01 00:00:00,2019-05-01 00:00:00,,a251l000000OHeOAAW
0011r00001tpZ6xAAE,a2B1r00000Aj3R9EAJ,Implicit,,,,False,a2X1r000005GatfEAC,2019-05-01 00:00:00,2019-05-01 00:00:00,,a251l000000OHeOAAW
0011r00001tpzDAAAY,a2B1r00000Aj3R9EAJ,Implicit,,,,False,a2X1r000005GatfEAC,2019-05-01 00:00:00,2019-05-01 00:00:00,,a251l000000OHEMAA4
0011r00001tpzDAAAY,a2B1r00000Aj3R9EAJ,Implicit,,,,False,a2X1r000005GatfEAC,2019-05-01 00:00:00,2019-05-01 00:00:00,,a251l000000OHEMAA4
0011r00001tq4yzAAA,a2B1r00000Aj3R9EAJ,Implicit,,,,False,a2X1r000005GatfEAC,2019-05-01 00:00:00,2019-05-01 00:00:00,,a251l000000OHZQAA4
0011r00001tq4yzAAA,a2B1r00000Aj3R9EAJ,Implicit,,,,False,a2X1r000005GatfEAC,2019-05-01 00:00:00,2019-05-01 00:00:00,,a251l000000OHZQAA4
0011r00001tq5GHAAY,a2B1r00000Aj3R9EAJ,Implicit,,,,False,a2X1r000005GatfEAC,2019-05-01 00:00:00,2019-05-01 00:00:00,,a251l000000OI3iAAG
0011r00001tq5GHAAY,a2B1r00000Aj3R9EAJ,Implicit,,,,False,a2X1r000005GatfEAC,2019-05-01 00:00:00,2019-05-01 00:00:00,,a251l000000OI3iAAG
0011r00001tq8vyAAA,a2B1r00000Aj3R9EAJ,Implicit,,,,False,a2X1r000005GatfEAC,2019-05-01 00:00:00,2019-05-01 00:00:00,,a251l000000OHiBAAW
0011r00001tq8vyAAA,a2B1r00000Aj3R9EAJ,Implicit,,,,False,a2X1r000005GatfEAC,2019-05-01 00:00:00,2019-05-01 00:00:00,,a251l000000OHiBAAW
0011r00001tq9HfAAI,a2B1r00000Aj3R9EAJ,Implicit,,,,False,a2X1r000005GatfEAC,2019-05-01 00:00:00,2019-05-01 00:00:00,,a251l000000OHwbAAG
0011r00001tq9HfAAI,a2B1r00000Aj3R9EAJ,Implicit,,,,False,a2X1r000005GatfEAC,2019-05-01 00:00:00,2019-05-01 00:00:00,,a251l000000OHwbAAG
0011r00001tqCFRAA2,a2B1r00000Aj3R9EAJ,Implicit,,,,False,a2X1r000005GatfEAC,2019-05-01 00:00:00,2019-05-01 00:00:00,,a251l000000OI4PAAW
0011r00001tqCFRAA2,a2B1r00000Aj3R9EAJ,Implicit,,,,False,a2X1r000005GatfEAC,2019-05-01 00:00:00,2019-05-01 00:00:00,,a251l000000OI4PAAW
