"sf__Id","sf__Error",AxtriaSalesIQTM__Account_Alignment_Type__c,AxtriaSalesIQTM__Account__c,AxtriaSalesIQTM__Affiliation_Based_Alignment__c,AxtriaSalesIQTM__Effective_End_Date__c,AxtriaSalesIQTM__Effective_Start_Date__c,AxtriaSalesIQTM__IsShared__c,AxtriaSalesIQTM__Metric1__c,AxtriaSalesIQTM__Position__c,AxtriaSalesIQTM__Segment_1__c,AxtriaSalesIQTM__SharedWith__c,AxtriaSalesIQTM__Team_Instance__c,Id
"","INVALID_CROSS_REFERENCE_KEY:invalid cross reference id:--","Implicit","0011r000020vQdBAAU","false","2019-04-27","2019-04-20","","","a2B1r00000BdBdIEAV","","","a2X1r000005JmB7EAK","a251r000007YnsjAAC"
"","INVALID_CROSS_REFERENCE_KEY:invalid cross reference id:--","Implicit","0011r00001zuCf5AAE","false","2019-04-27","2019-04-20","","","a2B1r00000BdBdJEAV","","","a2X1r000005JmB7EAK","a251r000007YnsqAAC"
"","INVALID_CROSS_REFERENCE_KEY:invalid cross reference id:--","Implicit","0011r00001zuCf5AAE","false","2019-04-27","2019-04-20","","","a2B1r00000BdBdIEAV","","","a2X1r000005JmB7EAK","a251r000007YntiAAC"
"","INVALID_CROSS_REFERENCE_KEY:invalid cross reference id:--","Implicit","0011r000020vQdBAAU","false","2019-04-27","2019-04-20","","","a2B1r00000BdBdJEAV","","","a2X1r000005JmB7EAK","a251r000007YntoAAC"
