"sf__Id","sf__Error",Id
"","INVALID_CROSS_REFERENCE_KEY:invalid cross reference id:--","a251r0000071sLgAAI"
"","INVALID_CROSS_REFERENCE_KEY:invalid cross reference id:--","a251r0000071sLlAAI"
"","INVALID_CROSS_REFERENCE_KEY:invalid cross reference id:--","a251r0000071sMbAAI"
"","INVALID_CROSS_REFERENCE_KEY:invalid cross reference id:--","a251r0000071sOBAAY"
"","INVALID_CROSS_REFERENCE_KEY:invalid cross reference id:--","a251r0000071sOGAAY"
"","INVALID_CROSS_REFERENCE_KEY:invalid cross reference id:--","a251r0000071sONAAY"
"","INVALID_CROSS_REFERENCE_KEY:invalid cross reference id:--","a251r0000071sOOAAY"
"","INVALID_CROSS_REFERENCE_KEY:invalid cross reference id:--","a251r0000071sObAAI"
"","INVALID_CROSS_REFERENCE_KEY:invalid cross reference id:--","a251r0000071sQsAAI"
"","INVALID_CROSS_REFERENCE_KEY:invalid cross reference id:--","a251r0000071sRIAAY"
"","INVALID_CROSS_REFERENCE_KEY:invalid cross reference id:--","a251r0000071sRjAAI"
"","INVALID_CROSS_REFERENCE_KEY:invalid cross reference id:--","a251r0000071sRwAAI"
"","INVALID_CROSS_REFERENCE_KEY:invalid cross reference id:--","a251r0000071sS3AAI"
"","INVALID_CROSS_REFERENCE_KEY:invalid cross reference id:--","a251r0000071sS6AAI"
"","INVALID_CROSS_REFERENCE_KEY:invalid cross reference id:--","a251r0000071sSBAAY"
"","INVALID_CROSS_REFERENCE_KEY:invalid cross reference id:--","a251r0000071sSDAAY"
"","INVALID_CROSS_REFERENCE_KEY:invalid cross reference id:--","a251r0000071sToAAI"
"","INVALID_CROSS_REFERENCE_KEY:invalid cross reference id:--","a251r0000071sV4AAI"
"","INVALID_CROSS_REFERENCE_KEY:invalid cross reference id:--","a251r0000071sV5AAI"
"","INVALID_CROSS_REFERENCE_KEY:invalid cross reference id:--","a251r0000071sVDAAY"
"","INVALID_CROSS_REFERENCE_KEY:invalid cross reference id:--","a251r0000071sVhAAI"
"","INVALID_CROSS_REFERENCE_KEY:invalid cross reference id:--","a251r0000071sW1AAI"
"","INVALID_CROSS_REFERENCE_KEY:invalid cross reference id:--","a251r0000071sWKAAY"
"","INVALID_CROSS_REFERENCE_KEY:invalid cross reference id:--","a251r0000071sWLAAY"
"","INVALID_CROSS_REFERENCE_KEY:invalid cross reference id:--","a251r0000071sWnAAI"
"","INVALID_CROSS_REFERENCE_KEY:invalid cross reference id:--","a251r0000071sX2AAI"
"","INVALID_CROSS_REFERENCE_KEY:invalid cross reference id:--","a251r0000071sX5AAI"
"","INVALID_CROSS_REFERENCE_KEY:invalid cross reference id:--","a251r0000071sXpAAI"
"","INVALID_CROSS_REFERENCE_KEY:invalid cross reference id:--","a251r0000071sXrAAI"
"","INVALID_CROSS_REFERENCE_KEY:invalid cross reference id:--","a251r0000071sXtAAI"
"","INVALID_CROSS_REFERENCE_KEY:invalid cross reference id:--","a251r0000071sYNAAY"
"","INVALID_CROSS_REFERENCE_KEY:invalid cross reference id:--","a251r0000071sYOAAY"
"","INVALID_CROSS_REFERENCE_KEY:invalid cross reference id:--","a251r0000071tIIAAY"
"","INVALID_CROSS_REFERENCE_KEY:invalid cross reference id:--","a251r0000071tToAAI"
"","INVALID_CROSS_REFERENCE_KEY:invalid cross reference id:--","a251r0000071tWfAAI"
"","INVALID_CROSS_REFERENCE_KEY:invalid cross reference id:--","a251r0000071tYDAAY"
"","INVALID_CROSS_REFERENCE_KEY:invalid cross reference id:--","a251r0000071tZdAAI"
"","INVALID_CROSS_REFERENCE_KEY:invalid cross reference id:--","a251r0000071tccAAA"
"","INVALID_CROSS_REFERENCE_KEY:invalid cross reference id:--","a251r0000071tfnAAA"
"","INVALID_CROSS_REFERENCE_KEY:invalid cross reference id:--","a251r0000071tkCAAQ"
"","INVALID_CROSS_REFERENCE_KEY:invalid cross reference id:--","a251r0000071tm8AAA"
"","INVALID_CROSS_REFERENCE_KEY:invalid cross reference id:--","a251r0000071trpAAA"
"","INVALID_CROSS_REFERENCE_KEY:invalid cross reference id:--","a251r0000071tsiAAA"
"","INVALID_CROSS_REFERENCE_KEY:invalid cross reference id:--","a251r0000071tsuAAA"
"","INVALID_CROSS_REFERENCE_KEY:invalid cross reference id:--","a251r0000071tuUAAQ"
"","INVALID_CROSS_REFERENCE_KEY:invalid cross reference id:--","a251r0000071u1xAAA"
"","INVALID_CROSS_REFERENCE_KEY:invalid cross reference id:--","a251r0000071u36AAA"
"","INVALID_CROSS_REFERENCE_KEY:invalid cross reference id:--","a251r0000071vigAAA"
"","INVALID_CROSS_REFERENCE_KEY:invalid cross reference id:--","a251r0000071u7EAAQ"
"","INVALID_CROSS_REFERENCE_KEY:invalid cross reference id:--","a251r0000071u7MAAQ"
"","INVALID_CROSS_REFERENCE_KEY:invalid cross reference id:--","a251r0000071uflAAA"
"","INVALID_CROSS_REFERENCE_KEY:invalid cross reference id:--","a251r0000071uspAAA"
"","INVALID_CROSS_REFERENCE_KEY:invalid cross reference id:--","a251r0000071usrAAA"
"","INVALID_CROSS_REFERENCE_KEY:invalid cross reference id:--","a251r0000071uxNAAQ"
"","INVALID_CROSS_REFERENCE_KEY:invalid cross reference id:--","a251r0000071uxnAAA"
"","INVALID_CROSS_REFERENCE_KEY:invalid cross reference id:--","a251r0000071uyyAAA"
"","INVALID_CROSS_REFERENCE_KEY:invalid cross reference id:--","a251r0000071uziAAA"
"","INVALID_CROSS_REFERENCE_KEY:invalid cross reference id:--","a251r0000071uzmAAA"
"","INVALID_CROSS_REFERENCE_KEY:invalid cross reference id:--","a251r0000071uzrAAA"
"","INVALID_CROSS_REFERENCE_KEY:invalid cross reference id:--","a251r0000071v03AAA"
"","INVALID_CROSS_REFERENCE_KEY:invalid cross reference id:--","a251r0000071v0BAAQ"
"","INVALID_CROSS_REFERENCE_KEY:invalid cross reference id:--","a251r0000071v1zAAA"
"","INVALID_CROSS_REFERENCE_KEY:invalid cross reference id:--","a251r0000071v2VAAQ"
"","INVALID_CROSS_REFERENCE_KEY:invalid cross reference id:--","a251r0000071v3IAAQ"
"","INVALID_CROSS_REFERENCE_KEY:invalid cross reference id:--","a251r0000071v3MAAQ"
"","INVALID_CROSS_REFERENCE_KEY:invalid cross reference id:--","a251r0000071v3NAAQ"
"","INVALID_CROSS_REFERENCE_KEY:invalid cross reference id:--","a251r0000071v3RAAQ"
"","INVALID_CROSS_REFERENCE_KEY:invalid cross reference id:--","a251r0000071v3ZAAQ"
"","INVALID_CROSS_REFERENCE_KEY:invalid cross reference id:--","a251r0000071v3pAAA"
"","INVALID_CROSS_REFERENCE_KEY:invalid cross reference id:--","a251r0000071v3sAAA"
"","INVALID_CROSS_REFERENCE_KEY:invalid cross reference id:--","a251r0000071v4AAAQ"
"","INVALID_CROSS_REFERENCE_KEY:invalid cross reference id:--","a251r0000071v6nAAA"
"","INVALID_CROSS_REFERENCE_KEY:invalid cross reference id:--","a251r0000071v6sAAA"
"","INVALID_CROSS_REFERENCE_KEY:invalid cross reference id:--","a251r0000071v6zAAA"
"","INVALID_CROSS_REFERENCE_KEY:invalid cross reference id:--","a251r0000071v8cAAA"
"","INVALID_CROSS_REFERENCE_KEY:invalid cross reference id:--","a251r0000071v8dAAA"
"","INVALID_CROSS_REFERENCE_KEY:invalid cross reference id:--","a251r0000071v8eAAA"
"","INVALID_CROSS_REFERENCE_KEY:invalid cross reference id:--","a251r0000071v8iAAA"
"","INVALID_CROSS_REFERENCE_KEY:invalid cross reference id:--","a251r0000071v9kAAA"
"","INVALID_CROSS_REFERENCE_KEY:invalid cross reference id:--","a251r0000071vATAAY"
"","INVALID_CROSS_REFERENCE_KEY:invalid cross reference id:--","a251r0000071vAVAAY"
"","INVALID_CROSS_REFERENCE_KEY:invalid cross reference id:--","a251r0000071vAiAAI"
"","INVALID_CROSS_REFERENCE_KEY:invalid cross reference id:--","a251r0000071vAlAAI"
"","INVALID_CROSS_REFERENCE_KEY:invalid cross reference id:--","a251r0000071vC8AAI"
"","INVALID_CROSS_REFERENCE_KEY:invalid cross reference id:--","a251r0000071vCHAAY"
"","INVALID_CROSS_REFERENCE_KEY:invalid cross reference id:--","a251r0000071vCKAAY"
"","INVALID_CROSS_REFERENCE_KEY:invalid cross reference id:--","a251r0000071vCVAAY"
"","INVALID_CROSS_REFERENCE_KEY:invalid cross reference id:--","a251r0000071vDVAAY"
"","INVALID_CROSS_REFERENCE_KEY:invalid cross reference id:--","a251r0000071vDZAAY"
"","INVALID_CROSS_REFERENCE_KEY:invalid cross reference id:--","a251r0000071vDcAAI"
"","INVALID_CROSS_REFERENCE_KEY:invalid cross reference id:--","a251r0000071vEIAAY"
"","INVALID_CROSS_REFERENCE_KEY:invalid cross reference id:--","a251r0000071vELAAY"
"","INVALID_CROSS_REFERENCE_KEY:invalid cross reference id:--","a251r0000071vGKAAY"
"","INVALID_CROSS_REFERENCE_KEY:invalid cross reference id:--","a251r0000071vGMAAY"
"","INVALID_CROSS_REFERENCE_KEY:invalid cross reference id:--","a251r0000071vHZAAY"
"","INVALID_CROSS_REFERENCE_KEY:invalid cross reference id:--","a251r0000071vHnAAI"
"","INVALID_CROSS_REFERENCE_KEY:invalid cross reference id:--","a251r0000071vIpAAI"
"","INVALID_CROSS_REFERENCE_KEY:invalid cross reference id:--","a251r0000071vIqAAI"
"","INVALID_CROSS_REFERENCE_KEY:invalid cross reference id:--","a251r0000071vKEAAY"
"","INVALID_CROSS_REFERENCE_KEY:invalid cross reference id:--","a251r0000071vKJAAY"
"","INVALID_CROSS_REFERENCE_KEY:invalid cross reference id:--","a251r0000071vKLAAY"
"","INVALID_CROSS_REFERENCE_KEY:invalid cross reference id:--","a251r0000071vKPAAY"
"","INVALID_CROSS_REFERENCE_KEY:invalid cross reference id:--","a251r0000071vKUAAY"
"","INVALID_CROSS_REFERENCE_KEY:invalid cross reference id:--","a251r0000071vKaAAI"
"","INVALID_CROSS_REFERENCE_KEY:invalid cross reference id:--","a251r0000071vKhAAI"
"","INVALID_CROSS_REFERENCE_KEY:invalid cross reference id:--","a251r0000071vMgAAI"
"","INVALID_CROSS_REFERENCE_KEY:invalid cross reference id:--","a251r0000071vMmAAI"
"","INVALID_CROSS_REFERENCE_KEY:invalid cross reference id:--","a251r0000071vMwAAI"
"","INVALID_CROSS_REFERENCE_KEY:invalid cross reference id:--","a251r0000071vOJAAY"
"","INVALID_CROSS_REFERENCE_KEY:invalid cross reference id:--","a251r0000071vOMAAY"
"","INVALID_CROSS_REFERENCE_KEY:invalid cross reference id:--","a251r0000071vOmAAI"
"","INVALID_CROSS_REFERENCE_KEY:invalid cross reference id:--","a251r0000071vOpAAI"
"","INVALID_CROSS_REFERENCE_KEY:invalid cross reference id:--","a251r0000071vOtAAI"
"","INVALID_CROSS_REFERENCE_KEY:invalid cross reference id:--","a251r0000071vOvAAI"
"","INVALID_CROSS_REFERENCE_KEY:invalid cross reference id:--","a251r0000071vP0AAI"
"","INVALID_CROSS_REFERENCE_KEY:invalid cross reference id:--","a251r0000071vP1AAI"
"","INVALID_CROSS_REFERENCE_KEY:invalid cross reference id:--","a251r0000071vP8AAI"
"","INVALID_CROSS_REFERENCE_KEY:invalid cross reference id:--","a251r0000071vRgAAI"
"","INVALID_CROSS_REFERENCE_KEY:invalid cross reference id:--","a251r0000071vSZAAY"
"","INVALID_CROSS_REFERENCE_KEY:invalid cross reference id:--","a251r0000071vUMAAY"
"","INVALID_CROSS_REFERENCE_KEY:invalid cross reference id:--","a251r0000071vVHAAY"
"","INVALID_CROSS_REFERENCE_KEY:invalid cross reference id:--","a251r0000071vVNAAY"
"","INVALID_CROSS_REFERENCE_KEY:invalid cross reference id:--","a251r0000071vVOAAY"
"","INVALID_CROSS_REFERENCE_KEY:invalid cross reference id:--","a251r0000071vVSAAY"
"","INVALID_CROSS_REFERENCE_KEY:invalid cross reference id:--","a251r0000071vVdAAI"
"","INVALID_CROSS_REFERENCE_KEY:invalid cross reference id:--","a251r0000071vVfAAI"
"","INVALID_CROSS_REFERENCE_KEY:invalid cross reference id:--","a251r0000071vVoAAI"
"","INVALID_CROSS_REFERENCE_KEY:invalid cross reference id:--","a251r0000071vW1AAI"
"","INVALID_CROSS_REFERENCE_KEY:invalid cross reference id:--","a251r0000071vWNAAY"
"","INVALID_CROSS_REFERENCE_KEY:invalid cross reference id:--","a251r0000071vWOAAY"
"","INVALID_CROSS_REFERENCE_KEY:invalid cross reference id:--","a251r0000071vWdAAI"
"","INVALID_CROSS_REFERENCE_KEY:invalid cross reference id:--","a251r0000071vWgAAI"
"","INVALID_CROSS_REFERENCE_KEY:invalid cross reference id:--","a251r0000071vXlAAI"
"","INVALID_CROSS_REFERENCE_KEY:invalid cross reference id:--","a251r0000071vYVAAY"
"","INVALID_CROSS_REFERENCE_KEY:invalid cross reference id:--","a251r0000071vYkAAI"
"","INVALID_CROSS_REFERENCE_KEY:invalid cross reference id:--","a251r0000071vYrAAI"
"","INVALID_CROSS_REFERENCE_KEY:invalid cross reference id:--","a251r0000071vZDAAY"
"","INVALID_CROSS_REFERENCE_KEY:invalid cross reference id:--","a251r0000071vaQAAQ"
"","INVALID_CROSS_REFERENCE_KEY:invalid cross reference id:--","a251r0000071vaVAAQ"
"","INVALID_CROSS_REFERENCE_KEY:invalid cross reference id:--","a251r0000071vabAAA"
"","INVALID_CROSS_REFERENCE_KEY:invalid cross reference id:--","a251r0000071vadAAA"
"","INVALID_CROSS_REFERENCE_KEY:invalid cross reference id:--","a251r0000071vaeAAA"
"","INVALID_CROSS_REFERENCE_KEY:invalid cross reference id:--","a251r0000071vafAAA"
"","INVALID_CROSS_REFERENCE_KEY:invalid cross reference id:--","a251r0000071vahAAA"
"","INVALID_CROSS_REFERENCE_KEY:invalid cross reference id:--","a251r0000071vajAAA"
"","INVALID_CROSS_REFERENCE_KEY:invalid cross reference id:--","a251r0000071vawAAA"
"","INVALID_CROSS_REFERENCE_KEY:invalid cross reference id:--","a251r0000071vbkAAA"
"","INVALID_CROSS_REFERENCE_KEY:invalid cross reference id:--","a251r0000071vbpAAA"
"","INVALID_CROSS_REFERENCE_KEY:invalid cross reference id:--","a251r0000071vbzAAA"
"","INVALID_CROSS_REFERENCE_KEY:invalid cross reference id:--","a251r0000071veIAAQ"
"","INVALID_CROSS_REFERENCE_KEY:invalid cross reference id:--","a251r0000071veJAAQ"
"","INVALID_CROSS_REFERENCE_KEY:invalid cross reference id:--","a251r0000071veMAAQ"
"","INVALID_CROSS_REFERENCE_KEY:invalid cross reference id:--","a251r0000071veOAAQ"
"","INVALID_CROSS_REFERENCE_KEY:invalid cross reference id:--","a251r0000071veQAAQ"
"","INVALID_CROSS_REFERENCE_KEY:invalid cross reference id:--","a251r0000071veYAAQ"
"","INVALID_CROSS_REFERENCE_KEY:invalid cross reference id:--","a251r0000071vebAAA"
"","INVALID_CROSS_REFERENCE_KEY:invalid cross reference id:--","a251r0000071vecAAA"
"","INVALID_CROSS_REFERENCE_KEY:invalid cross reference id:--","a251r0000071vehAAA"
"","INVALID_CROSS_REFERENCE_KEY:invalid cross reference id:--","a251r0000071vemAAA"
"","INVALID_CROSS_REFERENCE_KEY:invalid cross reference id:--","a251r0000071vf1AAA"
"","INVALID_CROSS_REFERENCE_KEY:invalid cross reference id:--","a251r0000071vfZAAQ"
"","INVALID_CROSS_REFERENCE_KEY:invalid cross reference id:--","a251r0000071vfgAAA"
"","INVALID_CROSS_REFERENCE_KEY:invalid cross reference id:--","a251r0000071vg2AAA"
"","INVALID_CROSS_REFERENCE_KEY:invalid cross reference id:--","a251r0000071vg4AAA"
"","INVALID_CROSS_REFERENCE_KEY:invalid cross reference id:--","a251r0000071vg9AAA"
"","INVALID_CROSS_REFERENCE_KEY:invalid cross reference id:--","a251r0000071vgCAAQ"
"","INVALID_CROSS_REFERENCE_KEY:invalid cross reference id:--","a251r0000071vi8AAA"
"","INVALID_CROSS_REFERENCE_KEY:invalid cross reference id:--","a251r0000071viAAAQ"
"","INVALID_CROSS_REFERENCE_KEY:invalid cross reference id:--","a251r0000071viBAAQ"
"","INVALID_CROSS_REFERENCE_KEY:invalid cross reference id:--","a251r0000071viLAAQ"
"","INVALID_CROSS_REFERENCE_KEY:invalid cross reference id:--","a251r0000071viOAAQ"
"","INVALID_CROSS_REFERENCE_KEY:invalid cross reference id:--","a251r0000071viSAAQ"
"","INVALID_CROSS_REFERENCE_KEY:invalid cross reference id:--","a251r0000071vieAAA"
"","INVALID_CROSS_REFERENCE_KEY:invalid cross reference id:--","a251r0000071vifAAA"
"","INVALID_CROSS_REFERENCE_KEY:invalid cross reference id:--","a251r0000071vinAAA"
"","INVALID_CROSS_REFERENCE_KEY:invalid cross reference id:--","a251r0000071vipAAA"
"","INVALID_CROSS_REFERENCE_KEY:invalid cross reference id:--","a251r0000071viwAAA"
"","INVALID_CROSS_REFERENCE_KEY:invalid cross reference id:--","a251r0000071vjKAAQ"
"","INVALID_CROSS_REFERENCE_KEY:invalid cross reference id:--","a251r0000071vjVAAQ"
"","INVALID_CROSS_REFERENCE_KEY:invalid cross reference id:--","a251r0000071vjjAAA"
"","INVALID_CROSS_REFERENCE_KEY:invalid cross reference id:--","a251r0000071vjoAAA"
"","INVALID_CROSS_REFERENCE_KEY:invalid cross reference id:--","a251r0000071vk9AAA"
"","INVALID_CROSS_REFERENCE_KEY:invalid cross reference id:--","a251r0000071vkVAAQ"
"","INVALID_CROSS_REFERENCE_KEY:invalid cross reference id:--","a251r0000071vl1AAA"
"","INVALID_CROSS_REFERENCE_KEY:invalid cross reference id:--","a251r0000071vlCAAQ"
"","INVALID_CROSS_REFERENCE_KEY:invalid cross reference id:--","a251r0000071vlGAAQ"
"","INVALID_CROSS_REFERENCE_KEY:invalid cross reference id:--","a251r0000071vlRAAQ"
"","INVALID_CROSS_REFERENCE_KEY:invalid cross reference id:--","a251r0000071vlSAAQ"
"","INVALID_CROSS_REFERENCE_KEY:invalid cross reference id:--","a251r0000071vm3AAA"
"","INVALID_CROSS_REFERENCE_KEY:invalid cross reference id:--","a251r0000071w0IAAQ"
"","INVALID_CROSS_REFERENCE_KEY:invalid cross reference id:--","a251r0000071voQAAQ"
"","INVALID_CROSS_REFERENCE_KEY:invalid cross reference id:--","a251r0000071vocAAA"
"","INVALID_CROSS_REFERENCE_KEY:invalid cross reference id:--","a251r0000071votAAA"
"","INVALID_CROSS_REFERENCE_KEY:invalid cross reference id:--","a251r0000071vp1AAA"
"","INVALID_CROSS_REFERENCE_KEY:invalid cross reference id:--","a251r0000071vp2AAA"
"","INVALID_CROSS_REFERENCE_KEY:invalid cross reference id:--","a251r0000071vp3AAA"
"","INVALID_CROSS_REFERENCE_KEY:invalid cross reference id:--","a251r0000071vp4AAA"
"","INVALID_CROSS_REFERENCE_KEY:invalid cross reference id:--","a251r0000071vpCAAQ"
"","INVALID_CROSS_REFERENCE_KEY:invalid cross reference id:--","a251r0000071vpKAAQ"
"","INVALID_CROSS_REFERENCE_KEY:invalid cross reference id:--","a251r0000071vpNAAQ"
"","INVALID_CROSS_REFERENCE_KEY:invalid cross reference id:--","a251r0000071vpQAAQ"
"","INVALID_CROSS_REFERENCE_KEY:invalid cross reference id:--","a251r0000071vsEAAQ"
"","INVALID_CROSS_REFERENCE_KEY:invalid cross reference id:--","a251r0000071vsFAAQ"
"","INVALID_CROSS_REFERENCE_KEY:invalid cross reference id:--","a251r0000071vsGAAQ"
"","INVALID_CROSS_REFERENCE_KEY:invalid cross reference id:--","a251r0000071vsJAAQ"
"","INVALID_CROSS_REFERENCE_KEY:invalid cross reference id:--","a251r0000071vt1AAA"
"","INVALID_CROSS_REFERENCE_KEY:invalid cross reference id:--","a251r0000071vt4AAA"
"","INVALID_CROSS_REFERENCE_KEY:invalid cross reference id:--","a251r0000071vtPAAQ"
"","INVALID_CROSS_REFERENCE_KEY:invalid cross reference id:--","a251r0000071vtYAAQ"
"","INVALID_CROSS_REFERENCE_KEY:invalid cross reference id:--","a251r0000071vv1AAA"
"","INVALID_CROSS_REFERENCE_KEY:invalid cross reference id:--","a251r0000071vwBAAQ"
"","INVALID_CROSS_REFERENCE_KEY:invalid cross reference id:--","a251r0000071vwHAAQ"
"","INVALID_CROSS_REFERENCE_KEY:invalid cross reference id:--","a251r0000071vwXAAQ"
"","INVALID_CROSS_REFERENCE_KEY:invalid cross reference id:--","a251r0000071vweAAA"
"","INVALID_CROSS_REFERENCE_KEY:invalid cross reference id:--","a251r0000071vwkAAA"
"","INVALID_CROSS_REFERENCE_KEY:invalid cross reference id:--","a251r0000071vx3AAA"
"","INVALID_CROSS_REFERENCE_KEY:invalid cross reference id:--","a251r0000071vx6AAA"
"","INVALID_CROSS_REFERENCE_KEY:invalid cross reference id:--","a251r0000071vxEAAQ"
"","INVALID_CROSS_REFERENCE_KEY:invalid cross reference id:--","a251r0000071vzFAAQ"
"","INVALID_CROSS_REFERENCE_KEY:invalid cross reference id:--","a251r0000071vzHAAQ"
"","INVALID_CROSS_REFERENCE_KEY:invalid cross reference id:--","a251r0000071vzrAAA"
"","INVALID_CROSS_REFERENCE_KEY:invalid cross reference id:--","a251r0000071w02AAA"
"","INVALID_CROSS_REFERENCE_KEY:invalid cross reference id:--","a251r0000071w08AAA"
"","INVALID_CROSS_REFERENCE_KEY:invalid cross reference id:--","a251r0000071w0WAAQ"
"","INVALID_CROSS_REFERENCE_KEY:invalid cross reference id:--","a251r0000071w48AAA"
"","INVALID_CROSS_REFERENCE_KEY:invalid cross reference id:--","a251r0000071w2GAAQ"
"","INVALID_CROSS_REFERENCE_KEY:invalid cross reference id:--","a251r0000071w49AAA"
"","INVALID_CROSS_REFERENCE_KEY:invalid cross reference id:--","a251r0000071w2rAAA"
"","INVALID_CROSS_REFERENCE_KEY:invalid cross reference id:--","a251r0000071w3hAAA"
"","INVALID_CROSS_REFERENCE_KEY:invalid cross reference id:--","a251r0000071w3jAAA"
"","INVALID_CROSS_REFERENCE_KEY:invalid cross reference id:--","a251r0000071w3mAAA"
"","INVALID_CROSS_REFERENCE_KEY:invalid cross reference id:--","a251r0000071w3nAAA"
"","INVALID_CROSS_REFERENCE_KEY:invalid cross reference id:--","a251r0000071w4CAAQ"
"","INVALID_CROSS_REFERENCE_KEY:invalid cross reference id:--","a251r0000071w7CAAQ"
"","INVALID_CROSS_REFERENCE_KEY:invalid cross reference id:--","a251r0000071w7JAAQ"
"","INVALID_CROSS_REFERENCE_KEY:invalid cross reference id:--","a251r0000071w7KAAQ"
"","INVALID_CROSS_REFERENCE_KEY:invalid cross reference id:--","a251r0000071w7iAAA"
"","INVALID_CROSS_REFERENCE_KEY:invalid cross reference id:--","a251r0000071w7kAAA"
"","INVALID_CROSS_REFERENCE_KEY:invalid cross reference id:--","a251r0000071w7mAAA"
"","INVALID_CROSS_REFERENCE_KEY:invalid cross reference id:--","a251r0000071w7uAAA"
"","INVALID_CROSS_REFERENCE_KEY:invalid cross reference id:--","a251r0000071w80AAA"
"","INVALID_CROSS_REFERENCE_KEY:invalid cross reference id:--","a251r0000071w8LAAQ"
"","INVALID_CROSS_REFERENCE_KEY:invalid cross reference id:--","a251r0000071w9TAAQ"
"","INVALID_CROSS_REFERENCE_KEY:invalid cross reference id:--","a251r0000071w9YAAQ"
"","INVALID_CROSS_REFERENCE_KEY:invalid cross reference id:--","a251r0000071w9xAAA"
"","INVALID_CROSS_REFERENCE_KEY:invalid cross reference id:--","a251r0000071wEbAAI"
"","INVALID_CROSS_REFERENCE_KEY:invalid cross reference id:--","a251r0000071wAhAAI"
"","INVALID_CROSS_REFERENCE_KEY:invalid cross reference id:--","a251r0000071wAlAAI"
"","INVALID_CROSS_REFERENCE_KEY:invalid cross reference id:--","a251r0000071wAmAAI"
"","INVALID_CROSS_REFERENCE_KEY:invalid cross reference id:--","a251r0000071wIsAAI"
"","INVALID_CROSS_REFERENCE_KEY:invalid cross reference id:--","a251r0000071wB0AAI"
"","INVALID_CROSS_REFERENCE_KEY:invalid cross reference id:--","a251r0000071wBCAAY"
"","INVALID_CROSS_REFERENCE_KEY:invalid cross reference id:--","a251r0000071wBJAAY"
"","INVALID_CROSS_REFERENCE_KEY:invalid cross reference id:--","a251r0000071wBgAAI"
"","INVALID_CROSS_REFERENCE_KEY:invalid cross reference id:--","a251r0000071wBqAAI"
"","INVALID_CROSS_REFERENCE_KEY:invalid cross reference id:--","a251r0000071wBtAAI"
"","INVALID_CROSS_REFERENCE_KEY:invalid cross reference id:--","a251r0000071wBwAAI"
"","INVALID_CROSS_REFERENCE_KEY:invalid cross reference id:--","a251r0000071wBxAAI"
"","INVALID_CROSS_REFERENCE_KEY:invalid cross reference id:--","a251r0000071wByAAI"
"","INVALID_CROSS_REFERENCE_KEY:invalid cross reference id:--","a251r0000071wC2AAI"
"","INVALID_CROSS_REFERENCE_KEY:invalid cross reference id:--","a251r0000071wCrAAI"
"","INVALID_CROSS_REFERENCE_KEY:invalid cross reference id:--","a251r0000071wCsAAI"
"","INVALID_CROSS_REFERENCE_KEY:invalid cross reference id:--","a251r0000071wCtAAI"
"","INVALID_CROSS_REFERENCE_KEY:invalid cross reference id:--","a251r0000071wEQAAY"
"","INVALID_CROSS_REFERENCE_KEY:invalid cross reference id:--","a251r0000071wEVAAY"
"","INVALID_CROSS_REFERENCE_KEY:invalid cross reference id:--","a251r0000071wEXAAY"
"","INVALID_CROSS_REFERENCE_KEY:invalid cross reference id:--","a251r0000071wEaAAI"
"","INVALID_CROSS_REFERENCE_KEY:invalid cross reference id:--","a251r0000071wEgAAI"
"","INVALID_CROSS_REFERENCE_KEY:invalid cross reference id:--","a251r0000071wEhAAI"
"","INVALID_CROSS_REFERENCE_KEY:invalid cross reference id:--","a251r0000071wExAAI"
"","INVALID_CROSS_REFERENCE_KEY:invalid cross reference id:--","a251r0000071wF2AAI"
"","INVALID_CROSS_REFERENCE_KEY:invalid cross reference id:--","a251r0000071wF5AAI"
"","INVALID_CROSS_REFERENCE_KEY:invalid cross reference id:--","a251r0000071wF7AAI"
"","INVALID_CROSS_REFERENCE_KEY:invalid cross reference id:--","a251r0000071wF8AAI"
"","INVALID_CROSS_REFERENCE_KEY:invalid cross reference id:--","a251r0000071wF9AAI"
"","INVALID_CROSS_REFERENCE_KEY:invalid cross reference id:--","a251r0000071wFIAAY"
"","INVALID_CROSS_REFERENCE_KEY:invalid cross reference id:--","a251r0000071wFKAAY"
"","INVALID_CROSS_REFERENCE_KEY:invalid cross reference id:--","a251r0000071wFSAAY"
"","INVALID_CROSS_REFERENCE_KEY:invalid cross reference id:--","a251r0000071wFUAAY"
"","INVALID_CROSS_REFERENCE_KEY:invalid cross reference id:--","a251r0000071wFVAAY"
"","INVALID_CROSS_REFERENCE_KEY:invalid cross reference id:--","a251r0000071wFYAAY"
"","INVALID_CROSS_REFERENCE_KEY:invalid cross reference id:--","a251r0000071wFdAAI"
"","INVALID_CROSS_REFERENCE_KEY:invalid cross reference id:--","a251r0000071wI0AAI"
"","INVALID_CROSS_REFERENCE_KEY:invalid cross reference id:--","a251r0000071wIQAAY"
"","INVALID_CROSS_REFERENCE_KEY:invalid cross reference id:--","a251r0000071wIUAAY"
"","INVALID_CROSS_REFERENCE_KEY:invalid cross reference id:--","a251r0000071wIVAAY"
"","INVALID_CROSS_REFERENCE_KEY:invalid cross reference id:--","a251r0000071wIfAAI"
"","INVALID_CROSS_REFERENCE_KEY:invalid cross reference id:--","a251r0000071wJ0AAI"
"","INVALID_CROSS_REFERENCE_KEY:invalid cross reference id:--","a251r0000071wJ1AAI"
"","INVALID_CROSS_REFERENCE_KEY:invalid cross reference id:--","a251r0000071wJ2AAI"
"","INVALID_CROSS_REFERENCE_KEY:invalid cross reference id:--","a251r0000071wJpAAI"
"","INVALID_CROSS_REFERENCE_KEY:invalid cross reference id:--","a251r0000071wJqAAI"
"","INVALID_CROSS_REFERENCE_KEY:invalid cross reference id:--","a251r0000071wKDAAY"
"","INVALID_CROSS_REFERENCE_KEY:invalid cross reference id:--","a251r0000071wLMAAY"
"","INVALID_CROSS_REFERENCE_KEY:invalid cross reference id:--","a251r0000071wLQAAY"
"","INVALID_CROSS_REFERENCE_KEY:invalid cross reference id:--","a251r0000071wLUAAY"
"","INVALID_CROSS_REFERENCE_KEY:invalid cross reference id:--","a251r0000071wMZAAY"
"","INVALID_CROSS_REFERENCE_KEY:invalid cross reference id:--","a251r0000071wMaAAI"
"","INVALID_CROSS_REFERENCE_KEY:invalid cross reference id:--","a251r0000071wMvAAI"
"","INVALID_CROSS_REFERENCE_KEY:invalid cross reference id:--","a251r0000071wN7AAI"
"","INVALID_CROSS_REFERENCE_KEY:invalid cross reference id:--","a251r0000071wOvAAI"
"","INVALID_CROSS_REFERENCE_KEY:invalid cross reference id:--","a251r0000071wOwAAI"
"","INVALID_CROSS_REFERENCE_KEY:invalid cross reference id:--","a251r0000071wOxAAI"
"","INVALID_CROSS_REFERENCE_KEY:invalid cross reference id:--","a251r0000071wP2AAI"
"","INVALID_CROSS_REFERENCE_KEY:invalid cross reference id:--","a251r0000071wPDAAY"
"","INVALID_CROSS_REFERENCE_KEY:invalid cross reference id:--","a251r0000071wPEAAY"
"","INVALID_CROSS_REFERENCE_KEY:invalid cross reference id:--","a251r0000071wPOAAY"
"","INVALID_CROSS_REFERENCE_KEY:invalid cross reference id:--","a251r0000071wPTAAY"
"","INVALID_CROSS_REFERENCE_KEY:invalid cross reference id:--","a251r0000071wPgAAI"
"","INVALID_CROSS_REFERENCE_KEY:invalid cross reference id:--","a251r0000071wPiAAI"
"","INVALID_CROSS_REFERENCE_KEY:invalid cross reference id:--","a251r0000071wPoAAI"
"","INVALID_CROSS_REFERENCE_KEY:invalid cross reference id:--","a251r0000071wPqAAI"
"","INVALID_CROSS_REFERENCE_KEY:invalid cross reference id:--","a251r0000071wQ5AAI"
"","INVALID_CROSS_REFERENCE_KEY:invalid cross reference id:--","a251r0000071wQ6AAI"
"","INVALID_CROSS_REFERENCE_KEY:invalid cross reference id:--","a251r0000071wTMAAY"
"","INVALID_CROSS_REFERENCE_KEY:invalid cross reference id:--","a251r0000071wTgAAI"
"","INVALID_CROSS_REFERENCE_KEY:invalid cross reference id:--","a251r0000071wU4AAI"
"","INVALID_CROSS_REFERENCE_KEY:invalid cross reference id:--","a251r0000071wU7AAI"
"","INVALID_CROSS_REFERENCE_KEY:invalid cross reference id:--","a251r0000071wUEAAY"
"","INVALID_CROSS_REFERENCE_KEY:invalid cross reference id:--","a251r0000071wVBAAY"
"","INVALID_CROSS_REFERENCE_KEY:invalid cross reference id:--","a251r0000071wWOAAY"
"","INVALID_CROSS_REFERENCE_KEY:invalid cross reference id:--","a251r0000071wWVAAY"
"","INVALID_CROSS_REFERENCE_KEY:invalid cross reference id:--","a251r0000071wWqAAI"
"","INVALID_CROSS_REFERENCE_KEY:invalid cross reference id:--","a251r0000071wWtAAI"
"","INVALID_CROSS_REFERENCE_KEY:invalid cross reference id:--","a251r0000071wWuAAI"
"","INVALID_CROSS_REFERENCE_KEY:invalid cross reference id:--","a251r0000071wX7AAI"
"","INVALID_CROSS_REFERENCE_KEY:invalid cross reference id:--","a251r0000071wXEAAY"
"","INVALID_CROSS_REFERENCE_KEY:invalid cross reference id:--","a251r0000071wXFAAY"
"","INVALID_CROSS_REFERENCE_KEY:invalid cross reference id:--","a251r0000071wXNAAY"
"","INVALID_CROSS_REFERENCE_KEY:invalid cross reference id:--","a251r0000071wXbAAI"
"","INVALID_CROSS_REFERENCE_KEY:invalid cross reference id:--","a251r0000071wXgAAI"
"","INVALID_CROSS_REFERENCE_KEY:invalid cross reference id:--","a251r0000071wXhAAI"
"","INVALID_CROSS_REFERENCE_KEY:invalid cross reference id:--","a251r0000071wXmAAI"
"","INVALID_CROSS_REFERENCE_KEY:invalid cross reference id:--","a251r0000071wY5AAI"
"","INVALID_CROSS_REFERENCE_KEY:invalid cross reference id:--","a251r0000071wYAAAY"
"","INVALID_CROSS_REFERENCE_KEY:invalid cross reference id:--","a251r0000071wYCAAY"
"","INVALID_CROSS_REFERENCE_KEY:invalid cross reference id:--","a251r0000071wZaAAI"
"","INVALID_CROSS_REFERENCE_KEY:invalid cross reference id:--","a251r0000071wa5AAA"
"","INVALID_CROSS_REFERENCE_KEY:invalid cross reference id:--","a251r0000071waYAAQ"
"","INVALID_CROSS_REFERENCE_KEY:invalid cross reference id:--","a251r0000071wabAAA"
"","INVALID_CROSS_REFERENCE_KEY:invalid cross reference id:--","a251r0000071warAAA"
"","INVALID_CROSS_REFERENCE_KEY:invalid cross reference id:--","a251r0000071wb3AAA"
"","INVALID_CROSS_REFERENCE_KEY:invalid cross reference id:--","a251r0000071wbJAAQ"
"","INVALID_CROSS_REFERENCE_KEY:invalid cross reference id:--","a251r0000071wbNAAQ"
"","INVALID_CROSS_REFERENCE_KEY:invalid cross reference id:--","a251r0000071wbQAAQ"
"","INVALID_CROSS_REFERENCE_KEY:invalid cross reference id:--","a251r0000071wbRAAQ"
"","INVALID_CROSS_REFERENCE_KEY:invalid cross reference id:--","a251r0000071wbYAAQ"
"","INVALID_CROSS_REFERENCE_KEY:invalid cross reference id:--","a251r0000071wbdAAA"
"","INVALID_CROSS_REFERENCE_KEY:invalid cross reference id:--","a251r0000071wbmAAA"
"","INVALID_CROSS_REFERENCE_KEY:invalid cross reference id:--","a251r0000071wbqAAA"
"","INVALID_CROSS_REFERENCE_KEY:invalid cross reference id:--","a251r0000071wbvAAA"
"","INVALID_CROSS_REFERENCE_KEY:invalid cross reference id:--","a251r0000071wc4AAA"
"","INVALID_CROSS_REFERENCE_KEY:invalid cross reference id:--","a251r0000071wc6AAA"
"","INVALID_CROSS_REFERENCE_KEY:invalid cross reference id:--","a251r0000071wciAAA"
"","INVALID_CROSS_REFERENCE_KEY:invalid cross reference id:--","a251r0000071wctAAA"
"","INVALID_CROSS_REFERENCE_KEY:invalid cross reference id:--","a251r0000071wdZAAQ"
"","INVALID_CROSS_REFERENCE_KEY:invalid cross reference id:--","a251r0000071wdiAAA"
"","INVALID_CROSS_REFERENCE_KEY:invalid cross reference id:--","a251r0000071weGAAQ"
"","INVALID_CROSS_REFERENCE_KEY:invalid cross reference id:--","a251r0000071weRAAQ"
"","INVALID_CROSS_REFERENCE_KEY:invalid cross reference id:--","a251r0000071weUAAQ"
"","INVALID_CROSS_REFERENCE_KEY:invalid cross reference id:--","a251r0000071weZAAQ"
"","INVALID_CROSS_REFERENCE_KEY:invalid cross reference id:--","a251r0000071wepAAA"
"","INVALID_CROSS_REFERENCE_KEY:invalid cross reference id:--","a251r0000071weqAAA"
"","INVALID_CROSS_REFERENCE_KEY:invalid cross reference id:--","a251r0000071weuAAA"
"","INVALID_CROSS_REFERENCE_KEY:invalid cross reference id:--","a251r0000071wewAAA"
"","INVALID_CROSS_REFERENCE_KEY:invalid cross reference id:--","a251r0000071wexAAA"
"","INVALID_CROSS_REFERENCE_KEY:invalid cross reference id:--","a251r0000071wfIAAQ"
"","INVALID_CROSS_REFERENCE_KEY:invalid cross reference id:--","a251r0000071wg2AAA"
"","INVALID_CROSS_REFERENCE_KEY:invalid cross reference id:--","a251r0000071wgPAAQ"
"","INVALID_CROSS_REFERENCE_KEY:invalid cross reference id:--","a251r0000071wgfAAA"
"","INVALID_CROSS_REFERENCE_KEY:invalid cross reference id:--","a251r0000071wggAAA"
"","INVALID_CROSS_REFERENCE_KEY:invalid cross reference id:--","a251r0000071wgnAAA"
"","INVALID_CROSS_REFERENCE_KEY:invalid cross reference id:--","a251r0000071wiEAAQ"
"","INVALID_CROSS_REFERENCE_KEY:invalid cross reference id:--","a251r0000071wiGAAQ"
"","INVALID_CROSS_REFERENCE_KEY:invalid cross reference id:--","a251r0000071wiLAAQ"
"","INVALID_CROSS_REFERENCE_KEY:invalid cross reference id:--","a251r0000071wiUAAQ"
"","INVALID_CROSS_REFERENCE_KEY:invalid cross reference id:--","a251r0000071wiuAAA"
"","INVALID_CROSS_REFERENCE_KEY:invalid cross reference id:--","a251r0000071wiyAAA"
"","INVALID_CROSS_REFERENCE_KEY:invalid cross reference id:--","a251r0000071wj9AAA"
"","INVALID_CROSS_REFERENCE_KEY:invalid cross reference id:--","a251r0000071wjSAAQ"
"","INVALID_CROSS_REFERENCE_KEY:invalid cross reference id:--","a251r0000071wjYAAQ"
"","INVALID_CROSS_REFERENCE_KEY:invalid cross reference id:--","a251r0000071wjaAAA"
"","INVALID_CROSS_REFERENCE_KEY:invalid cross reference id:--","a251r0000071wjcAAA"
"","INVALID_CROSS_REFERENCE_KEY:invalid cross reference id:--","a251r0000071wjfAAA"
"","INVALID_CROSS_REFERENCE_KEY:invalid cross reference id:--","a251r0000071wjoAAA"
"","INVALID_CROSS_REFERENCE_KEY:invalid cross reference id:--","a251r0000071wlUAAQ"
"","INVALID_CROSS_REFERENCE_KEY:invalid cross reference id:--","a251r0000071wllAAA"
"","INVALID_CROSS_REFERENCE_KEY:invalid cross reference id:--","a251r0000071wm6AAA"
"","INVALID_CROSS_REFERENCE_KEY:invalid cross reference id:--","a251r0000071wmEAAQ"
"","INVALID_CROSS_REFERENCE_KEY:invalid cross reference id:--","a251r0000071wmFAAQ"
"","INVALID_CROSS_REFERENCE_KEY:invalid cross reference id:--","a251r0000071wmHAAQ"
"","INVALID_CROSS_REFERENCE_KEY:invalid cross reference id:--","a251r0000071wmMAAQ"
"","INVALID_CROSS_REFERENCE_KEY:invalid cross reference id:--","a251r0000071wmOAAQ"
"","INVALID_CROSS_REFERENCE_KEY:invalid cross reference id:--","a251r0000071wmQAAQ"
"","INVALID_CROSS_REFERENCE_KEY:invalid cross reference id:--","a251r0000071wmUAAQ"
"","INVALID_CROSS_REFERENCE_KEY:invalid cross reference id:--","a251r0000071wmVAAQ"
"","INVALID_CROSS_REFERENCE_KEY:invalid cross reference id:--","a251r0000071wmYAAQ"
"","INVALID_CROSS_REFERENCE_KEY:invalid cross reference id:--","a251r0000071wmbAAA"
"","INVALID_CROSS_REFERENCE_KEY:invalid cross reference id:--","a251r0000071wmjAAA"
"","INVALID_CROSS_REFERENCE_KEY:invalid cross reference id:--","a251r0000071wmrAAA"
"","INVALID_CROSS_REFERENCE_KEY:invalid cross reference id:--","a251r0000071wmtAAA"
"","INVALID_CROSS_REFERENCE_KEY:invalid cross reference id:--","a251r0000071wmuAAA"
"","INVALID_CROSS_REFERENCE_KEY:invalid cross reference id:--","a251r0000071wn5AAA"
"","INVALID_CROSS_REFERENCE_KEY:invalid cross reference id:--","a251r0000071wn7AAA"
"","INVALID_CROSS_REFERENCE_KEY:invalid cross reference id:--","a251r0000071wn9AAA"
"","INVALID_CROSS_REFERENCE_KEY:invalid cross reference id:--","a251r0000071wnCAAQ"
"","INVALID_CROSS_REFERENCE_KEY:invalid cross reference id:--","a251r0000071wnGAAQ"
"","INVALID_CROSS_REFERENCE_KEY:invalid cross reference id:--","a251r0000071wngAAA"
"","INVALID_CROSS_REFERENCE_KEY:invalid cross reference id:--","a251r0000071wp0AAA"
"","INVALID_CROSS_REFERENCE_KEY:invalid cross reference id:--","a251r0000071wp7AAA"
"","INVALID_CROSS_REFERENCE_KEY:invalid cross reference id:--","a251r0000071wpGAAQ"
"","INVALID_CROSS_REFERENCE_KEY:invalid cross reference id:--","a251r0000071wptAAA"
"","INVALID_CROSS_REFERENCE_KEY:invalid cross reference id:--","a251r0000071wqVAAQ"
"","INVALID_CROSS_REFERENCE_KEY:invalid cross reference id:--","a251r0000071wqcAAA"
"","INVALID_CROSS_REFERENCE_KEY:invalid cross reference id:--","a251r0000071wqmAAA"
"","INVALID_CROSS_REFERENCE_KEY:invalid cross reference id:--","a251r0000071wrGAAQ"
"","INVALID_CROSS_REFERENCE_KEY:invalid cross reference id:--","a251r0000071wrVAAQ"
"","INVALID_CROSS_REFERENCE_KEY:invalid cross reference id:--","a251r0000071wrZAAQ"
"","INVALID_CROSS_REFERENCE_KEY:invalid cross reference id:--","a251r0000071wrdAAA"
"","INVALID_CROSS_REFERENCE_KEY:invalid cross reference id:--","a251r0000071wrhAAA"
"","INVALID_CROSS_REFERENCE_KEY:invalid cross reference id:--","a251r0000071wruAAA"
"","INVALID_CROSS_REFERENCE_KEY:invalid cross reference id:--","a251r0000071wsOAAQ"
"","INVALID_CROSS_REFERENCE_KEY:invalid cross reference id:--","a251r0000071wsTAAQ"
"","INVALID_CROSS_REFERENCE_KEY:invalid cross reference id:--","a251r0000071wseAAA"
"","INVALID_CROSS_REFERENCE_KEY:invalid cross reference id:--","a251r0000071wsjAAA"
"","INVALID_CROSS_REFERENCE_KEY:invalid cross reference id:--","a251r0000071wt8AAA"
"","INVALID_CROSS_REFERENCE_KEY:invalid cross reference id:--","a251r0000071wuEAAQ"
"","INVALID_CROSS_REFERENCE_KEY:invalid cross reference id:--","a251r0000071wvVAAQ"
"","INVALID_CROSS_REFERENCE_KEY:invalid cross reference id:--","a251r0000071wvlAAA"
"","INVALID_CROSS_REFERENCE_KEY:invalid cross reference id:--","a251r0000071wvoAAA"
"","INVALID_CROSS_REFERENCE_KEY:invalid cross reference id:--","a251r0000071wvpAAA"
"","INVALID_CROSS_REFERENCE_KEY:invalid cross reference id:--","a251r0000071wvsAAA"
"","INVALID_CROSS_REFERENCE_KEY:invalid cross reference id:--","a251r0000071wvvAAA"
"","INVALID_CROSS_REFERENCE_KEY:invalid cross reference id:--","a251r0000071ww2AAA"
"","INVALID_CROSS_REFERENCE_KEY:invalid cross reference id:--","a251r0000071ww6AAA"
"","INVALID_CROSS_REFERENCE_KEY:invalid cross reference id:--","a251r0000071ww7AAA"
"","INVALID_CROSS_REFERENCE_KEY:invalid cross reference id:--","a251r0000071wwOAAQ"
"","INVALID_CROSS_REFERENCE_KEY:invalid cross reference id:--","a251r0000071wwPAAQ"
"","INVALID_CROSS_REFERENCE_KEY:invalid cross reference id:--","a251r0000071wwkAAA"
"","INVALID_CROSS_REFERENCE_KEY:invalid cross reference id:--","a251r0000071wwqAAA"
"","INVALID_CROSS_REFERENCE_KEY:invalid cross reference id:--","a251r0000071wxaAAA"
"","INVALID_CROSS_REFERENCE_KEY:invalid cross reference id:--","a251r0000071wxiAAA"
"","INVALID_CROSS_REFERENCE_KEY:invalid cross reference id:--","a251r0000071wysAAA"
"","INVALID_CROSS_REFERENCE_KEY:invalid cross reference id:--","a251r0000071wywAAA"
"","INVALID_CROSS_REFERENCE_KEY:invalid cross reference id:--","a251r0000071wz0AAA"
"","INVALID_CROSS_REFERENCE_KEY:invalid cross reference id:--","a251r0000071wz1AAA"
"","INVALID_CROSS_REFERENCE_KEY:invalid cross reference id:--","a251r0000071wz5AAA"
"","INVALID_CROSS_REFERENCE_KEY:invalid cross reference id:--","a251r0000071wzLAAQ"
"","INVALID_CROSS_REFERENCE_KEY:invalid cross reference id:--","a251r0000071wzOAAQ"
"","INVALID_CROSS_REFERENCE_KEY:invalid cross reference id:--","a251r0000071wzYAAQ"
"","INVALID_CROSS_REFERENCE_KEY:invalid cross reference id:--","a251r0000071wzbAAA"
"","INVALID_CROSS_REFERENCE_KEY:invalid cross reference id:--","a251r0000071wzpAAA"
"","INVALID_CROSS_REFERENCE_KEY:invalid cross reference id:--","a251r0000071wzsAAA"
"","INVALID_CROSS_REFERENCE_KEY:invalid cross reference id:--","a251r0000071x0KAAQ"
"","INVALID_CROSS_REFERENCE_KEY:invalid cross reference id:--","a251r0000071x0MAAQ"
"","INVALID_CROSS_REFERENCE_KEY:invalid cross reference id:--","a251r0000071x0VAAQ"
"","INVALID_CROSS_REFERENCE_KEY:invalid cross reference id:--","a251r0000071x0ZAAQ"
"","INVALID_CROSS_REFERENCE_KEY:invalid cross reference id:--","a251r0000071x0bAAA"
"","INVALID_CROSS_REFERENCE_KEY:invalid cross reference id:--","a251r0000071x0dAAA"
"","INVALID_CROSS_REFERENCE_KEY:invalid cross reference id:--","a251r0000071x0oAAA"
"","INVALID_CROSS_REFERENCE_KEY:invalid cross reference id:--","a251r0000071x0pAAA"
"","INVALID_CROSS_REFERENCE_KEY:invalid cross reference id:--","a251r0000071x0sAAA"
"","INVALID_CROSS_REFERENCE_KEY:invalid cross reference id:--","a251r0000071x0vAAA"
"","INVALID_CROSS_REFERENCE_KEY:invalid cross reference id:--","a251r0000071x0xAAA"
"","INVALID_CROSS_REFERENCE_KEY:invalid cross reference id:--","a251r0000071x11AAA"
"","INVALID_CROSS_REFERENCE_KEY:invalid cross reference id:--","a251r0000071x13AAA"
"","INVALID_CROSS_REFERENCE_KEY:invalid cross reference id:--","a251r0000071x1AAAQ"
"","INVALID_CROSS_REFERENCE_KEY:invalid cross reference id:--","a251r0000071x1EAAQ"
"","INVALID_CROSS_REFERENCE_KEY:invalid cross reference id:--","a251r0000071x1eAAA"
"","INVALID_CROSS_REFERENCE_KEY:invalid cross reference id:--","a251r0000071x1kAAA"
"","INVALID_CROSS_REFERENCE_KEY:invalid cross reference id:--","a251r0000071x1mAAA"
"","INVALID_CROSS_REFERENCE_KEY:invalid cross reference id:--","a251r0000071x3FAAQ"
"","INVALID_CROSS_REFERENCE_KEY:invalid cross reference id:--","a251r0000071x3LAAQ"
"","INVALID_CROSS_REFERENCE_KEY:invalid cross reference id:--","a251r0000071x3MAAQ"
"","INVALID_CROSS_REFERENCE_KEY:invalid cross reference id:--","a251r0000071x3NAAQ"
"","INVALID_CROSS_REFERENCE_KEY:invalid cross reference id:--","a251r0000071x3PAAQ"
"","INVALID_CROSS_REFERENCE_KEY:invalid cross reference id:--","a251r0000071x3QAAQ"
"","INVALID_CROSS_REFERENCE_KEY:invalid cross reference id:--","a251r0000071x3UAAQ"
"","INVALID_CROSS_REFERENCE_KEY:invalid cross reference id:--","a251r0000071x3cAAA"
"","INVALID_CROSS_REFERENCE_KEY:invalid cross reference id:--","a251r0000071x3iAAA"
"","INVALID_CROSS_REFERENCE_KEY:invalid cross reference id:--","a251r0000071x3qAAA"
"","INVALID_CROSS_REFERENCE_KEY:invalid cross reference id:--","a251r0000071x3zAAA"
"","INVALID_CROSS_REFERENCE_KEY:invalid cross reference id:--","a251r0000071x42AAA"
"","INVALID_CROSS_REFERENCE_KEY:invalid cross reference id:--","a251r0000071x47AAA"
"","INVALID_CROSS_REFERENCE_KEY:invalid cross reference id:--","a251r0000071x4BAAQ"
"","INVALID_CROSS_REFERENCE_KEY:invalid cross reference id:--","a251r0000071x4CAAQ"
"","INVALID_CROSS_REFERENCE_KEY:invalid cross reference id:--","a251r0000071x4LAAQ"
"","INVALID_CROSS_REFERENCE_KEY:invalid cross reference id:--","a251r0000071x4NAAQ"
"","INVALID_CROSS_REFERENCE_KEY:invalid cross reference id:--","a251r0000071x4PAAQ"
"","INVALID_CROSS_REFERENCE_KEY:invalid cross reference id:--","a251r0000071x4SAAQ"
"","INVALID_CROSS_REFERENCE_KEY:invalid cross reference id:--","a251r0000071x4nAAA"
"","INVALID_CROSS_REFERENCE_KEY:invalid cross reference id:--","a251r0000071x4pAAA"
"","INVALID_CROSS_REFERENCE_KEY:invalid cross reference id:--","a251r0000071x4qAAA"
"","INVALID_CROSS_REFERENCE_KEY:invalid cross reference id:--","a251r0000071x4sAAA"
"","INVALID_CROSS_REFERENCE_KEY:invalid cross reference id:--","a251r0000071x4yAAA"
"","INVALID_CROSS_REFERENCE_KEY:invalid cross reference id:--","a251r0000071x50AAA"
"","INVALID_CROSS_REFERENCE_KEY:invalid cross reference id:--","a251r0000071x54AAA"
"","INVALID_CROSS_REFERENCE_KEY:invalid cross reference id:--","a251r0000071x5vAAA"
"","INVALID_CROSS_REFERENCE_KEY:invalid cross reference id:--","a251r0000071x5wAAA"
"","INVALID_CROSS_REFERENCE_KEY:invalid cross reference id:--","a251r0000071x6aAAA"
"","INVALID_CROSS_REFERENCE_KEY:invalid cross reference id:--","a251r0000071x6dAAA"
"","INVALID_CROSS_REFERENCE_KEY:invalid cross reference id:--","a251r0000071x6fAAA"
"","INVALID_CROSS_REFERENCE_KEY:invalid cross reference id:--","a251r0000071x6lAAA"
"","INVALID_CROSS_REFERENCE_KEY:invalid cross reference id:--","a251r0000071x7YAAQ"
"","INVALID_CROSS_REFERENCE_KEY:invalid cross reference id:--","a251r0000071x7aAAA"
"","INVALID_CROSS_REFERENCE_KEY:invalid cross reference id:--","a251r0000071x7bAAA"
"","INVALID_CROSS_REFERENCE_KEY:invalid cross reference id:--","a251r0000071x7zAAA"
"","INVALID_CROSS_REFERENCE_KEY:invalid cross reference id:--","a251r0000071x83AAA"
"","INVALID_CROSS_REFERENCE_KEY:invalid cross reference id:--","a251r0000071x86AAA"
"","INVALID_CROSS_REFERENCE_KEY:invalid cross reference id:--","a251r0000071x88AAA"
"","INVALID_CROSS_REFERENCE_KEY:invalid cross reference id:--","a251r0000071x8BAAQ"
"","INVALID_CROSS_REFERENCE_KEY:invalid cross reference id:--","a251r0000071x8IAAQ"
"","INVALID_CROSS_REFERENCE_KEY:invalid cross reference id:--","a251r0000071x8PAAQ"
"","INVALID_CROSS_REFERENCE_KEY:invalid cross reference id:--","a251r0000071x8SAAQ"
"","INVALID_CROSS_REFERENCE_KEY:invalid cross reference id:--","a251r0000071x8cAAA"
"","INVALID_CROSS_REFERENCE_KEY:invalid cross reference id:--","a251r0000071x8jAAA"
"","INVALID_CROSS_REFERENCE_KEY:invalid cross reference id:--","a251r0000071x8kAAA"
"","INVALID_CROSS_REFERENCE_KEY:invalid cross reference id:--","a251r0000071x8tAAA"
"","INVALID_CROSS_REFERENCE_KEY:invalid cross reference id:--","a251r0000071x8yAAA"
"","INVALID_CROSS_REFERENCE_KEY:invalid cross reference id:--","a251r0000071x8zAAA"
"","INVALID_CROSS_REFERENCE_KEY:invalid cross reference id:--","a251r0000071x90AAA"
"","INVALID_CROSS_REFERENCE_KEY:invalid cross reference id:--","a251r0000071x93AAA"
"","INVALID_CROSS_REFERENCE_KEY:invalid cross reference id:--","a251r0000071x95AAA"
"","INVALID_CROSS_REFERENCE_KEY:invalid cross reference id:--","a251r0000071x96AAA"
"","INVALID_CROSS_REFERENCE_KEY:invalid cross reference id:--","a251r0000071x9JAAQ"
"","INVALID_CROSS_REFERENCE_KEY:invalid cross reference id:--","a251r0000071x9LAAQ"
"","INVALID_CROSS_REFERENCE_KEY:invalid cross reference id:--","a251r0000071x9QAAQ"
"","INVALID_CROSS_REFERENCE_KEY:invalid cross reference id:--","a251r0000071x9YAAQ"
"","INVALID_CROSS_REFERENCE_KEY:invalid cross reference id:--","a251r0000071xAQAAY"
"","INVALID_CROSS_REFERENCE_KEY:invalid cross reference id:--","a251r0000071xARAAY"
"","INVALID_CROSS_REFERENCE_KEY:invalid cross reference id:--","a251r0000071xAVAAY"
"","INVALID_CROSS_REFERENCE_KEY:invalid cross reference id:--","a251r0000071xAYAAY"
"","INVALID_CROSS_REFERENCE_KEY:invalid cross reference id:--","a251r0000071xBMAAY"
"","INVALID_CROSS_REFERENCE_KEY:invalid cross reference id:--","a251r0000071xBxAAI"
"","INVALID_CROSS_REFERENCE_KEY:invalid cross reference id:--","a251r0000071xByAAI"
"","INVALID_CROSS_REFERENCE_KEY:invalid cross reference id:--","a251r0000071xC8AAI"
"","INVALID_CROSS_REFERENCE_KEY:invalid cross reference id:--","a251r0000071xCLAAY"
"","INVALID_CROSS_REFERENCE_KEY:invalid cross reference id:--","a251r0000071xCNAAY"
"","INVALID_CROSS_REFERENCE_KEY:invalid cross reference id:--","a251r0000071xCSAAY"
"","INVALID_CROSS_REFERENCE_KEY:invalid cross reference id:--","a251r0000071xChAAI"
"","INVALID_CROSS_REFERENCE_KEY:invalid cross reference id:--","a251r0000071xCvAAI"
"","INVALID_CROSS_REFERENCE_KEY:invalid cross reference id:--","a251r0000071xD3AAI"
"","INVALID_CROSS_REFERENCE_KEY:invalid cross reference id:--","a251r0000071xDlAAI"
"","INVALID_CROSS_REFERENCE_KEY:invalid cross reference id:--","a251r0000071xDwAAI"
"","INVALID_CROSS_REFERENCE_KEY:invalid cross reference id:--","a251r0000071xE9AAI"
"","INVALID_CROSS_REFERENCE_KEY:invalid cross reference id:--","a251r0000071xEJAAY"
"","INVALID_CROSS_REFERENCE_KEY:invalid cross reference id:--","a251r0000071xFEAAY"
"","INVALID_CROSS_REFERENCE_KEY:invalid cross reference id:--","a251r0000071xGnAAI"
"","INVALID_CROSS_REFERENCE_KEY:invalid cross reference id:--","a251r0000071xHBAAY"
"","INVALID_CROSS_REFERENCE_KEY:invalid cross reference id:--","a251r0000071xI0AAI"
"","INVALID_CROSS_REFERENCE_KEY:invalid cross reference id:--","a251r0000071xI8AAI"
"","INVALID_CROSS_REFERENCE_KEY:invalid cross reference id:--","a251r0000071xIBAAY"
"","INVALID_CROSS_REFERENCE_KEY:invalid cross reference id:--","a251r0000071xIHAAY"
"","INVALID_CROSS_REFERENCE_KEY:invalid cross reference id:--","a251r0000071xIJAAY"
"","INVALID_CROSS_REFERENCE_KEY:invalid cross reference id:--","a251r0000071xILAAY"
"","INVALID_CROSS_REFERENCE_KEY:invalid cross reference id:--","a251r0000071xIZAAY"
"","INVALID_CROSS_REFERENCE_KEY:invalid cross reference id:--","a251r0000071xIrAAI"
"","INVALID_CROSS_REFERENCE_KEY:invalid cross reference id:--","a251r0000071xJ5AAI"
"","INVALID_CROSS_REFERENCE_KEY:invalid cross reference id:--","a251r0000071xKUAAY"
"","INVALID_CROSS_REFERENCE_KEY:invalid cross reference id:--","a251r0000071xKZAAY"
"","INVALID_CROSS_REFERENCE_KEY:invalid cross reference id:--","a251r0000071xL0AAI"
"","INVALID_CROSS_REFERENCE_KEY:invalid cross reference id:--","a251r0000071xLEAAY"
"","INVALID_CROSS_REFERENCE_KEY:invalid cross reference id:--","a251r0000071xNNAAY"
"","INVALID_CROSS_REFERENCE_KEY:invalid cross reference id:--","a251r0000071xNlAAI"
"","INVALID_CROSS_REFERENCE_KEY:invalid cross reference id:--","a251r0000071xONAAY"
"","INVALID_CROSS_REFERENCE_KEY:invalid cross reference id:--","a251r0000071xORAAY"
"","INVALID_CROSS_REFERENCE_KEY:invalid cross reference id:--","a251r0000071xOtAAI"
"","INVALID_CROSS_REFERENCE_KEY:invalid cross reference id:--","a251r0000071xPKAAY"
"","INVALID_CROSS_REFERENCE_KEY:invalid cross reference id:--","a251r0000071xPcAAI"
"","INVALID_CROSS_REFERENCE_KEY:invalid cross reference id:--","a251r0000071xQUAAY"
"","INVALID_CROSS_REFERENCE_KEY:invalid cross reference id:--","a251r0000071xQWAAY"
"","INVALID_CROSS_REFERENCE_KEY:invalid cross reference id:--","a251r0000071xQYAAY"
"","INVALID_CROSS_REFERENCE_KEY:invalid cross reference id:--","a251r0000071xRCAAY"
"","INVALID_CROSS_REFERENCE_KEY:invalid cross reference id:--","a251r0000071xTNAAY"
"","INVALID_CROSS_REFERENCE_KEY:invalid cross reference id:--","a251r0000071xTVAAY"
"","INVALID_CROSS_REFERENCE_KEY:invalid cross reference id:--","a251r0000071xTaAAI"
"","INVALID_CROSS_REFERENCE_KEY:invalid cross reference id:--","a251r0000071xTfAAI"
"","INVALID_CROSS_REFERENCE_KEY:invalid cross reference id:--","a251r0000071xTpAAI"
"","INVALID_CROSS_REFERENCE_KEY:invalid cross reference id:--","a251r0000071xTuAAI"
"","INVALID_CROSS_REFERENCE_KEY:invalid cross reference id:--","a251r0000071xUlAAI"
"","INVALID_CROSS_REFERENCE_KEY:invalid cross reference id:--","a251r0000071xUoAAI"
"","INVALID_CROSS_REFERENCE_KEY:invalid cross reference id:--","a251r0000071xUqAAI"
"","INVALID_CROSS_REFERENCE_KEY:invalid cross reference id:--","a251r0000071xUwAAI"
"","INVALID_CROSS_REFERENCE_KEY:invalid cross reference id:--","a251r0000071xVHAAY"
"","INVALID_CROSS_REFERENCE_KEY:invalid cross reference id:--","a251r0000071xVPAAY"
"","INVALID_CROSS_REFERENCE_KEY:invalid cross reference id:--","a251r0000071xVRAAY"
"","INVALID_CROSS_REFERENCE_KEY:invalid cross reference id:--","a251r0000071xX2AAI"
"","INVALID_CROSS_REFERENCE_KEY:invalid cross reference id:--","a251r0000071xa3AAA"
"","INVALID_CROSS_REFERENCE_KEY:invalid cross reference id:--","a251r0000071xaXAAQ"
"","INVALID_CROSS_REFERENCE_KEY:invalid cross reference id:--","a251r0000071xacAAA"
"","INVALID_CROSS_REFERENCE_KEY:invalid cross reference id:--","a251r0000071xaeAAA"
"","INVALID_CROSS_REFERENCE_KEY:invalid cross reference id:--","a251r0000071xazAAA"
"","INVALID_CROSS_REFERENCE_KEY:invalid cross reference id:--","a251r0000071xb6AAA"
"","INVALID_CROSS_REFERENCE_KEY:invalid cross reference id:--","a251r0000071xb9AAA"
"","INVALID_CROSS_REFERENCE_KEY:invalid cross reference id:--","a251r0000071xbAAAQ"
"","INVALID_CROSS_REFERENCE_KEY:invalid cross reference id:--","a251r0000071xbPAAQ"
"","INVALID_CROSS_REFERENCE_KEY:invalid cross reference id:--","a251r0000071xbWAAQ"
"","INVALID_CROSS_REFERENCE_KEY:invalid cross reference id:--","a251r0000071xbaAAA"
"","INVALID_CROSS_REFERENCE_KEY:invalid cross reference id:--","a251r0000071xbbAAA"
"","INVALID_CROSS_REFERENCE_KEY:invalid cross reference id:--","a251r0000071xbdAAA"
"","INVALID_CROSS_REFERENCE_KEY:invalid cross reference id:--","a251r0000071xcTAAQ"
"","INVALID_CROSS_REFERENCE_KEY:invalid cross reference id:--","a251r0000071xcWAAQ"
"","INVALID_CROSS_REFERENCE_KEY:invalid cross reference id:--","a251r0000071xclAAA"
"","INVALID_CROSS_REFERENCE_KEY:invalid cross reference id:--","a251r0000071xcnAAA"
"","INVALID_CROSS_REFERENCE_KEY:invalid cross reference id:--","a251r0000071xcqAAA"
"","INVALID_CROSS_REFERENCE_KEY:invalid cross reference id:--","a251r0000071xcrAAA"
"","INVALID_CROSS_REFERENCE_KEY:invalid cross reference id:--","a251r0000071xd0AAA"
"","INVALID_CROSS_REFERENCE_KEY:invalid cross reference id:--","a251r0000071xd9AAA"
"","INVALID_CROSS_REFERENCE_KEY:invalid cross reference id:--","a251r0000071xdCAAQ"
"","INVALID_CROSS_REFERENCE_KEY:invalid cross reference id:--","a251r0000071xdGAAQ"
"","INVALID_CROSS_REFERENCE_KEY:invalid cross reference id:--","a251r0000071xdHAAQ"
"","INVALID_CROSS_REFERENCE_KEY:invalid cross reference id:--","a251r0000071xdIAAQ"
"","INVALID_CROSS_REFERENCE_KEY:invalid cross reference id:--","a251r0000071xdQAAQ"
"","INVALID_CROSS_REFERENCE_KEY:invalid cross reference id:--","a251r0000071xdTAAQ"
"","INVALID_CROSS_REFERENCE_KEY:invalid cross reference id:--","a251r0000071xdbAAA"
"","INVALID_CROSS_REFERENCE_KEY:invalid cross reference id:--","a251r0000071xdgAAA"
"","INVALID_CROSS_REFERENCE_KEY:invalid cross reference id:--","a251r0000071xdiAAA"
"","INVALID_CROSS_REFERENCE_KEY:invalid cross reference id:--","a251r0000071xdkAAA"
"","INVALID_CROSS_REFERENCE_KEY:invalid cross reference id:--","a251r0000071xdpAAA"
"","INVALID_CROSS_REFERENCE_KEY:invalid cross reference id:--","a251r0000071xduAAA"
"","INVALID_CROSS_REFERENCE_KEY:invalid cross reference id:--","a251r0000071xe2AAA"
"","INVALID_CROSS_REFERENCE_KEY:invalid cross reference id:--","a251r0000071xe5AAA"
"","INVALID_CROSS_REFERENCE_KEY:invalid cross reference id:--","a251r0000071xeUAAQ"
"","INVALID_CROSS_REFERENCE_KEY:invalid cross reference id:--","a251r0000071xecAAA"
"","INVALID_CROSS_REFERENCE_KEY:invalid cross reference id:--","a251r0000071xehAAA"
"","INVALID_CROSS_REFERENCE_KEY:invalid cross reference id:--","a251r0000071xekAAA"
"","INVALID_CROSS_REFERENCE_KEY:invalid cross reference id:--","a251r0000071xhBAAQ"
"","INVALID_CROSS_REFERENCE_KEY:invalid cross reference id:--","a251r0000071xoQAAQ"
"","INVALID_CROSS_REFERENCE_KEY:invalid cross reference id:--","a251r0000071xuOAAQ"
"","INVALID_CROSS_REFERENCE_KEY:invalid cross reference id:--","a251r0000071xvCAAQ"
"","INVALID_CROSS_REFERENCE_KEY:invalid cross reference id:--","a251r0000071xvWAAQ"
"","INVALID_CROSS_REFERENCE_KEY:invalid cross reference id:--","a251r0000071y21AAA"
"","INVALID_CROSS_REFERENCE_KEY:invalid cross reference id:--","a251r0000071y5kAAA"
"","INVALID_CROSS_REFERENCE_KEY:invalid cross reference id:--","a251r0000071y5rAAA"
"","INVALID_CROSS_REFERENCE_KEY:invalid cross reference id:--","a251r0000071y9jAAA"
"","INVALID_CROSS_REFERENCE_KEY:invalid cross reference id:--","a251r0000071y9mAAA"
"","INVALID_CROSS_REFERENCE_KEY:invalid cross reference id:--","a251r0000071yGkAAI"
"","INVALID_CROSS_REFERENCE_KEY:invalid cross reference id:--","a251r0000071yKnAAI"
"","INVALID_CROSS_REFERENCE_KEY:invalid cross reference id:--","a251r0000071yM7AAI"
"","INVALID_CROSS_REFERENCE_KEY:invalid cross reference id:--","a251r0000071yVZAAY"
"","INVALID_CROSS_REFERENCE_KEY:invalid cross reference id:--","a251r0000071yagAAA"
"","INVALID_CROSS_REFERENCE_KEY:invalid cross reference id:--","a251r0000071ybBAAQ"
"","INVALID_CROSS_REFERENCE_KEY:invalid cross reference id:--","a251r0000071ygYAAQ"
"","INVALID_CROSS_REFERENCE_KEY:invalid cross reference id:--","a251r0000071yiSAAQ"
"","INVALID_CROSS_REFERENCE_KEY:invalid cross reference id:--","a251r0000071yjTAAQ"
"","INVALID_CROSS_REFERENCE_KEY:invalid cross reference id:--","a251r0000071ymIAAQ"
"","INVALID_CROSS_REFERENCE_KEY:invalid cross reference id:--","a251r0000071ynKAAQ"
"","INVALID_CROSS_REFERENCE_KEY:invalid cross reference id:--","a251r0000071yxfAAA"
"","INVALID_CROSS_REFERENCE_KEY:invalid cross reference id:--","a251r0000071z1CAAQ"
"","INVALID_CROSS_REFERENCE_KEY:invalid cross reference id:--","a251r0000071z1DAAQ"
"","INVALID_CROSS_REFERENCE_KEY:invalid cross reference id:--","a251r0000071z7IAAQ"
"","INVALID_CROSS_REFERENCE_KEY:invalid cross reference id:--","a251r0000071z7KAAQ"
"","INVALID_CROSS_REFERENCE_KEY:invalid cross reference id:--","a251r0000071z7LAAQ"
"","INVALID_CROSS_REFERENCE_KEY:invalid cross reference id:--","a251r0000071z9qAAA"
"","INVALID_CROSS_REFERENCE_KEY:invalid cross reference id:--","a251r0000071zAbAAI"
"","INVALID_CROSS_REFERENCE_KEY:invalid cross reference id:--","a251r0000071zCwAAI"
"","INVALID_CROSS_REFERENCE_KEY:invalid cross reference id:--","a251r0000071zD0AAI"
"","INVALID_CROSS_REFERENCE_KEY:invalid cross reference id:--","a251r0000071zD4AAI"
"","INVALID_CROSS_REFERENCE_KEY:invalid cross reference id:--","a251r0000071zD9AAI"
"","INVALID_CROSS_REFERENCE_KEY:invalid cross reference id:--","a251r0000071zDDAAY"
"","INVALID_CROSS_REFERENCE_KEY:invalid cross reference id:--","a251r0000071zDFAAY"
"","INVALID_CROSS_REFERENCE_KEY:invalid cross reference id:--","a251r0000071zDOAAY"
"","INVALID_CROSS_REFERENCE_KEY:invalid cross reference id:--","a251r0000071zDVAAY"
"","INVALID_CROSS_REFERENCE_KEY:invalid cross reference id:--","a251r0000071zDiAAI"
"","INVALID_CROSS_REFERENCE_KEY:invalid cross reference id:--","a251r0000071zDmAAI"
"","INVALID_CROSS_REFERENCE_KEY:invalid cross reference id:--","a251r0000071zKsAAI"
"","INVALID_CROSS_REFERENCE_KEY:invalid cross reference id:--","a251r0000071zKtAAI"
"","INVALID_CROSS_REFERENCE_KEY:invalid cross reference id:--","a251r0000071zKyAAI"
"","INVALID_CROSS_REFERENCE_KEY:invalid cross reference id:--","a251r0000071zL1AAI"
"","INVALID_CROSS_REFERENCE_KEY:invalid cross reference id:--","a251r0000071zL2AAI"
"","INVALID_CROSS_REFERENCE_KEY:invalid cross reference id:--","a251r0000071zL5AAI"
"","INVALID_CROSS_REFERENCE_KEY:invalid cross reference id:--","a251r0000071zL9AAI"
"","INVALID_CROSS_REFERENCE_KEY:invalid cross reference id:--","a251r0000071zLBAAY"
"","INVALID_CROSS_REFERENCE_KEY:invalid cross reference id:--","a251r0000071zLEAAY"
"","INVALID_CROSS_REFERENCE_KEY:invalid cross reference id:--","a251r0000071zLPAAY"
"","INVALID_CROSS_REFERENCE_KEY:invalid cross reference id:--","a251r0000071zLUAAY"
"","INVALID_CROSS_REFERENCE_KEY:invalid cross reference id:--","a251r0000071zLVAAY"
"","INVALID_CROSS_REFERENCE_KEY:invalid cross reference id:--","a251r0000071zLgAAI"
"","INVALID_CROSS_REFERENCE_KEY:invalid cross reference id:--","a251r0000071zLrAAI"
"","INVALID_CROSS_REFERENCE_KEY:invalid cross reference id:--","a251r0000071zM6AAI"
"","INVALID_CROSS_REFERENCE_KEY:invalid cross reference id:--","a251r0000071zMEAAY"
"","INVALID_CROSS_REFERENCE_KEY:invalid cross reference id:--","a251r0000071zMGAAY"
"","INVALID_CROSS_REFERENCE_KEY:invalid cross reference id:--","a251r0000071zMOAAY"
"","INVALID_CROSS_REFERENCE_KEY:invalid cross reference id:--","a251r0000071zMPAAY"
"","INVALID_CROSS_REFERENCE_KEY:invalid cross reference id:--","a251r0000071zMQAAY"
"","INVALID_CROSS_REFERENCE_KEY:invalid cross reference id:--","a251r0000071zMSAAY"
"","INVALID_CROSS_REFERENCE_KEY:invalid cross reference id:--","a251r0000071zMVAAY"
"","INVALID_CROSS_REFERENCE_KEY:invalid cross reference id:--","a251r0000071zMbAAI"
"","INVALID_CROSS_REFERENCE_KEY:invalid cross reference id:--","a251r0000071zMhAAI"
"","INVALID_CROSS_REFERENCE_KEY:invalid cross reference id:--","a251r0000071zMkAAI"
"","INVALID_CROSS_REFERENCE_KEY:invalid cross reference id:--","a251r0000071zMlAAI"
"","INVALID_CROSS_REFERENCE_KEY:invalid cross reference id:--","a251r0000071zMmAAI"
"","INVALID_CROSS_REFERENCE_KEY:invalid cross reference id:--","a251r0000071zMnAAI"
"","INVALID_CROSS_REFERENCE_KEY:invalid cross reference id:--","a251r0000071zMrAAI"
"","INVALID_CROSS_REFERENCE_KEY:invalid cross reference id:--","a251r0000071zN4AAI"
"","INVALID_CROSS_REFERENCE_KEY:invalid cross reference id:--","a251r0000071zN5AAI"
"","INVALID_CROSS_REFERENCE_KEY:invalid cross reference id:--","a251r0000071zNBAAY"
"","INVALID_CROSS_REFERENCE_KEY:invalid cross reference id:--","a251r0000071zNFAAY"
"","INVALID_CROSS_REFERENCE_KEY:invalid cross reference id:--","a251r0000071zNGAAY"
"","INVALID_CROSS_REFERENCE_KEY:invalid cross reference id:--","a251r0000071zNIAAY"
"","INVALID_CROSS_REFERENCE_KEY:invalid cross reference id:--","a251r0000071zNLAAY"
"","INVALID_CROSS_REFERENCE_KEY:invalid cross reference id:--","a251r0000071zNMAAY"
"","INVALID_CROSS_REFERENCE_KEY:invalid cross reference id:--","a251r0000071zNNAAY"
"","INVALID_CROSS_REFERENCE_KEY:invalid cross reference id:--","a251r0000071zNUAAY"
"","INVALID_CROSS_REFERENCE_KEY:invalid cross reference id:--","a251r0000071zNVAAY"
"","INVALID_CROSS_REFERENCE_KEY:invalid cross reference id:--","a251r0000071zNXAAY"
"","INVALID_CROSS_REFERENCE_KEY:invalid cross reference id:--","a251r0000071zNdAAI"
"","INVALID_CROSS_REFERENCE_KEY:invalid cross reference id:--","a251r0000071zNkAAI"
"","INVALID_CROSS_REFERENCE_KEY:invalid cross reference id:--","a251r0000071zNzAAI"
"","INVALID_CROSS_REFERENCE_KEY:invalid cross reference id:--","a251r0000071zO2AAI"
"","INVALID_CROSS_REFERENCE_KEY:invalid cross reference id:--","a251r0000071zOKAAY"
"","INVALID_CROSS_REFERENCE_KEY:invalid cross reference id:--","a251r0000071zORAAY"
"","INVALID_CROSS_REFERENCE_KEY:invalid cross reference id:--","a251r0000071zOSAAY"
"","INVALID_CROSS_REFERENCE_KEY:invalid cross reference id:--","a251r0000071zOTAAY"
"","INVALID_CROSS_REFERENCE_KEY:invalid cross reference id:--","a251r0000071zOUAAY"
"","INVALID_CROSS_REFERENCE_KEY:invalid cross reference id:--","a251r0000071zOWAAY"
"","INVALID_CROSS_REFERENCE_KEY:invalid cross reference id:--","a251r0000071zOiAAI"
"","INVALID_CROSS_REFERENCE_KEY:invalid cross reference id:--","a251r0000071zOvAAI"
"","INVALID_CROSS_REFERENCE_KEY:invalid cross reference id:--","a251r0000071zOxAAI"
"","INVALID_CROSS_REFERENCE_KEY:invalid cross reference id:--","a251r0000071zOyAAI"
"","INVALID_CROSS_REFERENCE_KEY:invalid cross reference id:--","a251r0000071zP1AAI"
"","INVALID_CROSS_REFERENCE_KEY:invalid cross reference id:--","a251r0000071zP3AAI"
"","INVALID_CROSS_REFERENCE_KEY:invalid cross reference id:--","a251r0000071zP5AAI"
"","INVALID_CROSS_REFERENCE_KEY:invalid cross reference id:--","a251r0000071zPHAAY"
"","INVALID_CROSS_REFERENCE_KEY:invalid cross reference id:--","a251r0000071zPJAAY"
"","INVALID_CROSS_REFERENCE_KEY:invalid cross reference id:--","a251r0000071zPRAAY"
"","INVALID_CROSS_REFERENCE_KEY:invalid cross reference id:--","a251r0000071zPXAAY"
"","INVALID_CROSS_REFERENCE_KEY:invalid cross reference id:--","a251r0000071zPZAAY"
"","INVALID_CROSS_REFERENCE_KEY:invalid cross reference id:--","a251r0000071zPnAAI"
"","INVALID_CROSS_REFERENCE_KEY:invalid cross reference id:--","a251r0000071zPtAAI"
"","INVALID_CROSS_REFERENCE_KEY:invalid cross reference id:--","a251r0000071zPuAAI"
"","INVALID_CROSS_REFERENCE_KEY:invalid cross reference id:--","a251r0000071zPzAAI"
"","INVALID_CROSS_REFERENCE_KEY:invalid cross reference id:--","a251r0000071zQ2AAI"
"","INVALID_CROSS_REFERENCE_KEY:invalid cross reference id:--","a251r0000071zQ7AAI"
"","INVALID_CROSS_REFERENCE_KEY:invalid cross reference id:--","a251r0000071zQEAAY"
"","INVALID_CROSS_REFERENCE_KEY:invalid cross reference id:--","a251r0000071zQFAAY"
"","INVALID_CROSS_REFERENCE_KEY:invalid cross reference id:--","a251r0000071zQGAAY"
"","INVALID_CROSS_REFERENCE_KEY:invalid cross reference id:--","a251r0000071zQIAAY"
"","INVALID_CROSS_REFERENCE_KEY:invalid cross reference id:--","a251r0000071zQLAAY"
"","INVALID_CROSS_REFERENCE_KEY:invalid cross reference id:--","a251r0000071zQhAAI"
"","INVALID_CROSS_REFERENCE_KEY:invalid cross reference id:--","a251r0000071zQiAAI"
"","INVALID_CROSS_REFERENCE_KEY:invalid cross reference id:--","a251r0000071zQjAAI"
"","INVALID_CROSS_REFERENCE_KEY:invalid cross reference id:--","a251r0000071zQkAAI"
"","INVALID_CROSS_REFERENCE_KEY:invalid cross reference id:--","a251r0000071zQwAAI"
"","INVALID_CROSS_REFERENCE_KEY:invalid cross reference id:--","a251r0000071zR6AAI"
"","INVALID_CROSS_REFERENCE_KEY:invalid cross reference id:--","a251r0000071zR7AAI"
"","INVALID_CROSS_REFERENCE_KEY:invalid cross reference id:--","a251r0000071zRCAAY"
"","INVALID_CROSS_REFERENCE_KEY:invalid cross reference id:--","a251r0000071zRIAAY"
"","INVALID_CROSS_REFERENCE_KEY:invalid cross reference id:--","a251r0000071zRJAAY"
"","INVALID_CROSS_REFERENCE_KEY:invalid cross reference id:--","a251r0000071zRKAAY"
"","INVALID_CROSS_REFERENCE_KEY:invalid cross reference id:--","a251r0000071zRPAAY"
"","INVALID_CROSS_REFERENCE_KEY:invalid cross reference id:--","a251r0000071zRbAAI"
"","INVALID_CROSS_REFERENCE_KEY:invalid cross reference id:--","a251r0000071zRdAAI"
"","INVALID_CROSS_REFERENCE_KEY:invalid cross reference id:--","a251r0000071zRgAAI"
"","INVALID_CROSS_REFERENCE_KEY:invalid cross reference id:--","a251r0000071zRiAAI"
"","INVALID_CROSS_REFERENCE_KEY:invalid cross reference id:--","a251r0000071zRoAAI"
"","INVALID_CROSS_REFERENCE_KEY:invalid cross reference id:--","a251r0000071zRrAAI"
"","INVALID_CROSS_REFERENCE_KEY:invalid cross reference id:--","a251r0000071zRxAAI"
"","INVALID_CROSS_REFERENCE_KEY:invalid cross reference id:--","a251r0000071zSQAAY"
"","INVALID_CROSS_REFERENCE_KEY:invalid cross reference id:--","a251r0000071zSSAAY"
"","INVALID_CROSS_REFERENCE_KEY:invalid cross reference id:--","a251r0000071zSUAAY"
"","INVALID_CROSS_REFERENCE_KEY:invalid cross reference id:--","a251r0000071zSVAAY"
"","INVALID_CROSS_REFERENCE_KEY:invalid cross reference id:--","a251r0000071zSWAAY"
"","INVALID_CROSS_REFERENCE_KEY:invalid cross reference id:--","a251r0000071zSYAAY"
"","INVALID_CROSS_REFERENCE_KEY:invalid cross reference id:--","a251r0000071zSaAAI"
"","INVALID_CROSS_REFERENCE_KEY:invalid cross reference id:--","a251r0000071zSxAAI"
"","INVALID_CROSS_REFERENCE_KEY:invalid cross reference id:--","a251r0000071zTLAAY"
"","INVALID_CROSS_REFERENCE_KEY:invalid cross reference id:--","a251r0000071zTPAAY"
"","INVALID_CROSS_REFERENCE_KEY:invalid cross reference id:--","a251r0000071zTTAAY"
"","INVALID_CROSS_REFERENCE_KEY:invalid cross reference id:--","a251r0000071zTZAAY"
"","INVALID_CROSS_REFERENCE_KEY:invalid cross reference id:--","a251r0000071zTiAAI"
"","INVALID_CROSS_REFERENCE_KEY:invalid cross reference id:--","a251r0000071zTjAAI"
"","INVALID_CROSS_REFERENCE_KEY:invalid cross reference id:--","a251r0000071zTmAAI"
"","INVALID_CROSS_REFERENCE_KEY:invalid cross reference id:--","a251r0000071zTnAAI"
"","INVALID_CROSS_REFERENCE_KEY:invalid cross reference id:--","a251r0000071zTqAAI"
"","INVALID_CROSS_REFERENCE_KEY:invalid cross reference id:--","a251r0000071zU5AAI"
"","INVALID_CROSS_REFERENCE_KEY:invalid cross reference id:--","a251r0000071zUHAAY"
"","INVALID_CROSS_REFERENCE_KEY:invalid cross reference id:--","a251r0000071zUJAAY"
"","INVALID_CROSS_REFERENCE_KEY:invalid cross reference id:--","a251r0000071zULAAY"
"","INVALID_CROSS_REFERENCE_KEY:invalid cross reference id:--","a251r0000071zUTAAY"
"","INVALID_CROSS_REFERENCE_KEY:invalid cross reference id:--","a251r0000071zUUAAY"
"","INVALID_CROSS_REFERENCE_KEY:invalid cross reference id:--","a251r00000720GMAAY"
"","INVALID_CROSS_REFERENCE_KEY:invalid cross reference id:--","a251r00000720GWAAY"
"","INVALID_CROSS_REFERENCE_KEY:invalid cross reference id:--","a251r00000720GYAAY"
"","INVALID_CROSS_REFERENCE_KEY:invalid cross reference id:--","a251r00000720GgAAI"
"","INVALID_CROSS_REFERENCE_KEY:invalid cross reference id:--","a251r00000720GnAAI"
"","INVALID_CROSS_REFERENCE_KEY:invalid cross reference id:--","a251r00000720GqAAI"
"","INVALID_CROSS_REFERENCE_KEY:invalid cross reference id:--","a251r00000720H1AAI"
"","INVALID_CROSS_REFERENCE_KEY:invalid cross reference id:--","a251r00000720HAAAY"
"","INVALID_CROSS_REFERENCE_KEY:invalid cross reference id:--","a251r00000720HIAAY"
"","INVALID_CROSS_REFERENCE_KEY:invalid cross reference id:--","a251r00000720HJAAY"
"","INVALID_CROSS_REFERENCE_KEY:invalid cross reference id:--","a251r00000720HMAAY"
"","INVALID_CROSS_REFERENCE_KEY:invalid cross reference id:--","a251r00000720HTAAY"
"","INVALID_CROSS_REFERENCE_KEY:invalid cross reference id:--","a251r00000720HVAAY"
"","INVALID_CROSS_REFERENCE_KEY:invalid cross reference id:--","a251r00000720HcAAI"
"","INVALID_CROSS_REFERENCE_KEY:invalid cross reference id:--","a251r00000720HhAAI"
"","INVALID_CROSS_REFERENCE_KEY:invalid cross reference id:--","a251r00000720HjAAI"
"","INVALID_CROSS_REFERENCE_KEY:invalid cross reference id:--","a251r00000720HuAAI"
"","INVALID_CROSS_REFERENCE_KEY:invalid cross reference id:--","a251r00000720IGAAY"
"","INVALID_CROSS_REFERENCE_KEY:invalid cross reference id:--","a251r00000720IKAAY"
