"sf__Id","sf__Error",AxtriaSalesIQTM__Account_Alignment_Type__c,AxtriaSalesIQTM__Account__c,AxtriaSalesIQTM__Affiliation_Based_Alignment__c,AxtriaSalesIQTM__Effective_End_Date__c,AxtriaSalesIQTM__Effective_Start_Date__c,AxtriaSalesIQTM__IsShared__c,AxtriaSalesIQTM__Metric1__c,AxtriaSalesIQTM__Position__c,AxtriaSalesIQTM__Segment_1__c,AxtriaSalesIQTM__SharedWith__c,AxtriaSalesIQTM__Team_Instance__c,Id
"","CANNOT_INSERT_UPDATE_ACTIVATE_ENTITY:AxtriaSalesIQTM.PositionAccountTrigger: execution of BeforeUpdate

caused by: System.ListException: Duplicate id in list: 0011r00001tpjY6AAI

Trigger.AxtriaSalesIQTM.PositionAccountTrigger: line 76, column 1:--","Implicit","0011r00001tpjXiAAI","true","2019-04-28","2019-04-17","","","a2B1r00000BdBCNEA3","","","a2X1r000005JlG8EAK","a251r000007SbaAAAS"
"","CANNOT_INSERT_UPDATE_ACTIVATE_ENTITY:AxtriaSalesIQTM.PositionAccountTrigger: execution of BeforeUpdate

caused by: System.ListException: Duplicate id in list: 0011r00001tpjY6AAI

Trigger.AxtriaSalesIQTM.PositionAccountTrigger: line 76, column 1:--","Implicit","0011r00001tpjXiAAI","true","2019-04-28","2019-04-17","","","a2B1r00000BdBCREA3","","","a2X1r000005JlG8EAK","a251r000007SbaBAAS"
"","CANNOT_INSERT_UPDATE_ACTIVATE_ENTITY:AxtriaSalesIQTM.PositionAccountTrigger: execution of BeforeUpdate

caused by: System.ListException: Duplicate id in list: 0011r00001tpjY6AAI

Trigger.AxtriaSalesIQTM.PositionAccountTrigger: line 76, column 1:--","Implicit","0011r00001tpofjAAA","true","2019-04-28","2019-04-17","","","a2B1r00000BdBCOEA3","","","a2X1r000005JlG8EAK","a251r000007SbbJAAS"
"","CANNOT_INSERT_UPDATE_ACTIVATE_ENTITY:AxtriaSalesIQTM.PositionAccountTrigger: execution of BeforeUpdate

caused by: System.ListException: Duplicate id in list: 0011r00001tpjY6AAI

Trigger.AxtriaSalesIQTM.PositionAccountTrigger: line 76, column 1:--","Implicit","0011r00001tpofjAAA","true","2019-04-28","2019-04-17","","","a2B1r00000BdBCSEA3","","","a2X1r000005JlG8EAK","a251r000007SbbKAAS"
"","CANNOT_INSERT_UPDATE_ACTIVATE_ENTITY:AxtriaSalesIQTM.PositionAccountTrigger: execution of BeforeUpdate

caused by: System.ListException: Duplicate id in list: 0011r00001tpjY6AAI

Trigger.AxtriaSalesIQTM.PositionAccountTrigger: line 76, column 1:--","Implicit","0011r00001tpuDzAAI","true","2019-04-28","2019-04-17","","","a2B1r00000BdBC6EAN","","","a2X1r000005JlG8EAK","a251r000007SbdRAAS"
"","CANNOT_INSERT_UPDATE_ACTIVATE_ENTITY:AxtriaSalesIQTM.PositionAccountTrigger: execution of BeforeUpdate

caused by: System.ListException: Duplicate id in list: 0011r00001tpjY6AAI

Trigger.AxtriaSalesIQTM.PositionAccountTrigger: line 76, column 1:--","Implicit","0011r00001tpuDzAAI","true","2019-04-28","2019-04-17","","","a2B1r00000BdBC9EAN","","","a2X1r000005JlG8EAK","a251r000007SbdSAAS"
"","CANNOT_INSERT_UPDATE_ACTIVATE_ENTITY:AxtriaSalesIQTM.PositionAccountTrigger: execution of BeforeUpdate

caused by: System.ListException: Duplicate id in list: 0011r00001tpjY6AAI

Trigger.AxtriaSalesIQTM.PositionAccountTrigger: line 76, column 1:--","Implicit","0011r00001tpuDzAAI","true","2019-04-28","2019-04-17","","","a2B1r00000BdBCCEA3","","","a2X1r000005JlG8EAK","a251r000007SbdTAAS"
"","CANNOT_INSERT_UPDATE_ACTIVATE_ENTITY:AxtriaSalesIQTM.PositionAccountTrigger: execution of BeforeUpdate

caused by: System.ListException: Duplicate id in list: 0011r00001tpjY6AAI

Trigger.AxtriaSalesIQTM.PositionAccountTrigger: line 76, column 1:--","Implicit","0011r00001tq6OGAAY","true","2019-04-28","2019-04-17","","","a2B1r00000BdBBvEAN","","","a2X1r000005JlG8EAK","a251r000007SbjNAAS"
"","CANNOT_INSERT_UPDATE_ACTIVATE_ENTITY:AxtriaSalesIQTM.PositionAccountTrigger: execution of BeforeUpdate

caused by: System.ListException: Duplicate id in list: 0011r00001tpjY6AAI

Trigger.AxtriaSalesIQTM.PositionAccountTrigger: line 76, column 1:--","Implicit","0011r00001tq6OGAAY","true","2019-04-28","2019-04-17","","","a2B1r00000BdBBzEAN","","","a2X1r000005JlG8EAK","a251r000007SbjOAAS"
"","CANNOT_INSERT_UPDATE_ACTIVATE_ENTITY:AxtriaSalesIQTM.PositionAccountTrigger: execution of BeforeUpdate

caused by: System.ListException: Duplicate id in list: 0011r00001tpjY6AAI

Trigger.AxtriaSalesIQTM.PositionAccountTrigger: line 76, column 1:--","Implicit","0011r00001tq6OGAAY","true","2019-04-28","2019-04-17","","","a2B1r00000BdBC1EAN","","","a2X1r000005JlG8EAK","a251r000007SbjPAAS"
"","CANNOT_INSERT_UPDATE_ACTIVATE_ENTITY:AxtriaSalesIQTM.PositionAccountTrigger: execution of BeforeUpdate

caused by: System.ListException: Duplicate id in list: 0011r00001tpjY6AAI

Trigger.AxtriaSalesIQTM.PositionAccountTrigger: line 76, column 1:--","Implicit","0011r00001tqD4rAAE","true","2019-04-28","2019-04-17","","","a2B1r00000BdBBvEAN","","","a2X1r000005JlG8EAK","a251r000007SbnSAAS"
"","CANNOT_INSERT_UPDATE_ACTIVATE_ENTITY:AxtriaSalesIQTM.PositionAccountTrigger: execution of BeforeUpdate

caused by: System.ListException: Duplicate id in list: 0011r00001tpjY6AAI

Trigger.AxtriaSalesIQTM.PositionAccountTrigger: line 76, column 1:--","Implicit","0011r00001tqD4rAAE","true","2019-04-28","2019-04-17","","","a2B1r00000BdBBzEAN","","","a2X1r000005JlG8EAK","a251r000007SbnTAAS"
"","CANNOT_INSERT_UPDATE_ACTIVATE_ENTITY:AxtriaSalesIQTM.PositionAccountTrigger: execution of BeforeUpdate

caused by: System.ListException: Duplicate id in list: 0011r00001tpjY6AAI

Trigger.AxtriaSalesIQTM.PositionAccountTrigger: line 76, column 1:--","Implicit","0011r00001tqD4rAAE","true","2019-04-28","2019-04-17","","","a2B1r00000BdBC1EAN","","","a2X1r000005JlG8EAK","a251r000007SbnUAAS"
"","CANNOT_INSERT_UPDATE_ACTIVATE_ENTITY:AxtriaSalesIQTM.PositionAccountTrigger: execution of BeforeUpdate

caused by: System.ListException: Duplicate id in list: 0011r00001tpjY6AAI

Trigger.AxtriaSalesIQTM.PositionAccountTrigger: line 76, column 1:--","Implicit","0011r00001tqFOsAAM","true","2019-04-28","2019-04-17","","","a2B1r00000BdBC3EAN","","","a2X1r000005JlG8EAK","a251r000007SbpBAAS"
"","CANNOT_INSERT_UPDATE_ACTIVATE_ENTITY:AxtriaSalesIQTM.PositionAccountTrigger: execution of BeforeUpdate

caused by: System.ListException: Duplicate id in list: 0011r00001tpjY6AAI

Trigger.AxtriaSalesIQTM.PositionAccountTrigger: line 76, column 1:--","Implicit","0011r00001tqFOsAAM","true","2019-04-28","2019-04-17","","","a2B1r00000BdBC8EAN","","","a2X1r000005JlG8EAK","a251r000007SbpCAAS"
"","CANNOT_INSERT_UPDATE_ACTIVATE_ENTITY:AxtriaSalesIQTM.PositionAccountTrigger: execution of BeforeUpdate

caused by: System.ListException: Duplicate id in list: 0011r00001tpjY6AAI

Trigger.AxtriaSalesIQTM.PositionAccountTrigger: line 76, column 1:--","Implicit","0011r00001tqFOsAAM","true","2019-04-28","2019-04-17","","","a2B1r00000BdBCAEA3","","","a2X1r000005JlG8EAK","a251r000007SbpDAAS"
"","CANNOT_INSERT_UPDATE_ACTIVATE_ENTITY:AxtriaSalesIQTM.PositionAccountTrigger: execution of BeforeUpdate

caused by: System.ListException: Duplicate id in list: 0011r00001tpjY6AAI

Trigger.AxtriaSalesIQTM.PositionAccountTrigger: line 76, column 1:--","Implicit","0011r00001tqHrQAAU","true","2019-04-28","2019-04-17","","","a2B1r00000BdBBvEAN","","","a2X1r000005JlG8EAK","a251r000007SbqUAAS"
"","CANNOT_INSERT_UPDATE_ACTIVATE_ENTITY:AxtriaSalesIQTM.PositionAccountTrigger: execution of BeforeUpdate

caused by: System.ListException: Duplicate id in list: 0011r00001tpjY6AAI

Trigger.AxtriaSalesIQTM.PositionAccountTrigger: line 76, column 1:--","Implicit","0011r00001tqHrQAAU","true","2019-04-28","2019-04-17","","","a2B1r00000BdBBzEAN","","","a2X1r000005JlG8EAK","a251r000007SbqVAAS"
"","CANNOT_INSERT_UPDATE_ACTIVATE_ENTITY:AxtriaSalesIQTM.PositionAccountTrigger: execution of BeforeUpdate

caused by: System.ListException: Duplicate id in list: 0011r00001tpjY6AAI

Trigger.AxtriaSalesIQTM.PositionAccountTrigger: line 76, column 1:--","Implicit","0011r00001tqHrQAAU","true","2019-04-28","2019-04-17","","","a2B1r00000BdBC1EAN","","","a2X1r000005JlG8EAK","a251r000007SbqWAAS"
"","INVALID_CROSS_REFERENCE_KEY:invalid cross reference id:--","Implicit","0011r00001tphl9AAA","true","2019-04-28","2019-04-19","","","a2B1r00000BdBBwEAN","","","a2X1r000005JlG8EAK","a251r000007YPX9AAO"
"","INVALID_CROSS_REFERENCE_KEY:invalid cross reference id:--","Implicit","0011r00001tphl9AAA","true","2019-04-28","2019-04-19","","","a2B1r00000BdBC1EAN","","","a2X1r000005JlG8EAK","a251r000007YPXAAA4"
"","CANNOT_INSERT_UPDATE_ACTIVATE_ENTITY:AxtriaSalesIQTM.PositionAccountTrigger: execution of BeforeUpdate

caused by: System.ListException: Duplicate id in list: 0011r00001tpjY6AAI

Trigger.AxtriaSalesIQTM.PositionAccountTrigger: line 76, column 1:--","Implicit","0011r00001tq3AhAAI","true","2019-04-28","2019-01-30","","","a2B1r00000BdBD5EAN","","","a2X1r000005JlG8EAK","a251r000005nJPjAAM"
"","CANNOT_INSERT_UPDATE_ACTIVATE_ENTITY:AxtriaSalesIQTM.PositionAccountTrigger: execution of BeforeUpdate

caused by: System.ListException: Duplicate id in list: 0011r00001tpjY6AAI

Trigger.AxtriaSalesIQTM.PositionAccountTrigger: line 76, column 1:--","Implicit","0011r00001tq3AhAAI","true","2019-04-28","2019-01-30","","","a2B1r00000BdBD2EAN","","","a2X1r000005JlG8EAK","a251r000005nJPkAAM"
"","CANNOT_INSERT_UPDATE_ACTIVATE_ENTITY:AxtriaSalesIQTM.PositionAccountTrigger: execution of BeforeUpdate

caused by: System.ListException: Duplicate id in list: 0011r00001tpjY6AAI

Trigger.AxtriaSalesIQTM.PositionAccountTrigger: line 76, column 1:--","Implicit","0011r00001tq3AhAAI","true","2019-04-28","2019-01-30","","","a2B1r00000BdBCyEAN","","","a2X1r000005JlG8EAK","a251r000005nJPlAAM"
"","CANNOT_INSERT_UPDATE_ACTIVATE_ENTITY:AxtriaSalesIQTM.PositionAccountTrigger: execution of BeforeUpdate

caused by: System.ListException: Duplicate id in list: 0011r00001tpjY6AAI

Trigger.AxtriaSalesIQTM.PositionAccountTrigger: line 76, column 1:--","Implicit","0011r00001tqHWHAA2","true","2019-04-28","2019-01-30","","","a2B1r00000BdBBvEAN","","","a2X1r000005JlG8EAK","a251r000005nKmBAAU"
"","CANNOT_INSERT_UPDATE_ACTIVATE_ENTITY:AxtriaSalesIQTM.PositionAccountTrigger: execution of BeforeUpdate

caused by: System.ListException: Duplicate id in list: 0011r00001tpjY6AAI

Trigger.AxtriaSalesIQTM.PositionAccountTrigger: line 76, column 1:--","Implicit","0011r00001tqHWHAA2","true","2019-04-28","2019-01-30","","","a2B1r00000BdBBzEAN","","","a2X1r000005JlG8EAK","a251r000005nKmCAAU"
"","CANNOT_INSERT_UPDATE_ACTIVATE_ENTITY:AxtriaSalesIQTM.PositionAccountTrigger: execution of BeforeUpdate

caused by: System.ListException: Duplicate id in list: 0011r00001tpjY6AAI

Trigger.AxtriaSalesIQTM.PositionAccountTrigger: line 76, column 1:--","Implicit","0011r00001tqHWHAA2","true","2019-04-28","2019-01-30","","","a2B1r00000BdBC1EAN","","","a2X1r000005JlG8EAK","a251r000005nKmDAAU"
"","CANNOT_INSERT_UPDATE_ACTIVATE_ENTITY:AxtriaSalesIQTM.PositionAccountTrigger: execution of BeforeUpdate

caused by: System.ListException: Duplicate id in list: 0011r00001tpjY6AAI

Trigger.AxtriaSalesIQTM.PositionAccountTrigger: line 76, column 1:--","Implicit","0011r00001tq7Y3AAI","true","2019-04-28","2019-01-30","","","a2B1r00000BdBCAEA3","","","a2X1r000005JlG8EAK","a251r000005nLmWAAU"
"","CANNOT_INSERT_UPDATE_ACTIVATE_ENTITY:AxtriaSalesIQTM.PositionAccountTrigger: execution of BeforeUpdate

caused by: System.ListException: Duplicate id in list: 0011r00001tpjY6AAI

Trigger.AxtriaSalesIQTM.PositionAccountTrigger: line 76, column 1:--","Implicit","0011r00001tq7Y3AAI","true","2019-04-28","2019-01-30","","","a2B1r00000BdBC8EAN","","","a2X1r000005JlG8EAK","a251r000005nLmXAAU"
"","CANNOT_INSERT_UPDATE_ACTIVATE_ENTITY:AxtriaSalesIQTM.PositionAccountTrigger: execution of BeforeUpdate

caused by: System.ListException: Duplicate id in list: 0011r00001tpjY6AAI

Trigger.AxtriaSalesIQTM.PositionAccountTrigger: line 76, column 1:--","Implicit","0011r00001tq7Y3AAI","true","2019-04-28","2019-01-30","","","a2B1r00000BdBC7EAN","","","a2X1r000005JlG8EAK","a251r000005nLmYAAU"
"","CANNOT_INSERT_UPDATE_ACTIVATE_ENTITY:AxtriaSalesIQTM.PositionAccountTrigger: execution of BeforeUpdate

caused by: System.ListException: Duplicate id in list: 0011r00001tpjY6AAI

Trigger.AxtriaSalesIQTM.PositionAccountTrigger: line 76, column 1:--","Implicit","0011r00001tqElsAAE","true","2019-04-28","2019-01-30","","","a2B1r00000BdBCeEAN","","","a2X1r000005JlG8EAK","a251r000005nLy7AAE"
"","CANNOT_INSERT_UPDATE_ACTIVATE_ENTITY:AxtriaSalesIQTM.PositionAccountTrigger: execution of BeforeUpdate

caused by: System.ListException: Duplicate id in list: 0011r00001tpjY6AAI

Trigger.AxtriaSalesIQTM.PositionAccountTrigger: line 76, column 1:--","Implicit","0011r00001tqElsAAE","true","2019-04-28","2019-01-30","","","a2B1r00000BdBCbEAN","","","a2X1r000005JlG8EAK","a251r000005nLy8AAE"
"","CANNOT_INSERT_UPDATE_ACTIVATE_ENTITY:AxtriaSalesIQTM.PositionAccountTrigger: execution of BeforeUpdate

caused by: System.ListException: Duplicate id in list: 0011r00001tpjY6AAI

Trigger.AxtriaSalesIQTM.PositionAccountTrigger: line 76, column 1:--","Implicit","0011r00001tqElsAAE","true","2019-04-28","2019-01-30","","","a2B1r00000BdBCXEA3","","","a2X1r000005JlG8EAK","a251r000005nLy9AAE"
"","CANNOT_INSERT_UPDATE_ACTIVATE_ENTITY:AxtriaSalesIQTM.PositionAccountTrigger: execution of BeforeUpdate

caused by: System.ListException: Duplicate id in list: 0011r00001tpjY6AAI

Trigger.AxtriaSalesIQTM.PositionAccountTrigger: line 76, column 1:--","Implicit","0011r00001tqBERAA2","true","2019-04-28","2019-01-30","","","a2B1r00000BdBBpEAN","","","a2X1r000005JlG8EAK","a251r000005nMIUAA2"
"","CANNOT_INSERT_UPDATE_ACTIVATE_ENTITY:AxtriaSalesIQTM.PositionAccountTrigger: execution of BeforeUpdate

caused by: System.ListException: Duplicate id in list: 0011r00001tpjY6AAI

Trigger.AxtriaSalesIQTM.PositionAccountTrigger: line 76, column 1:--","Implicit","0011r00001tqBERAA2","true","2019-04-28","2019-01-30","","","a2B1r00000BdBBtEAN","","","a2X1r000005JlG8EAK","a251r000005nMIVAA2"
"","CANNOT_INSERT_UPDATE_ACTIVATE_ENTITY:AxtriaSalesIQTM.PositionAccountTrigger: execution of BeforeUpdate

caused by: System.ListException: Duplicate id in list: 0011r00001tpjY6AAI

Trigger.AxtriaSalesIQTM.PositionAccountTrigger: line 76, column 1:--","Implicit","0011r00001tq1wjAAA","true","2019-04-28","2019-01-30","","","a2B1r00000BdBBpEAN","","","a2X1r000005JlG8EAK","a251r000005nMeHAAU"
"","CANNOT_INSERT_UPDATE_ACTIVATE_ENTITY:AxtriaSalesIQTM.PositionAccountTrigger: execution of BeforeUpdate

caused by: System.ListException: Duplicate id in list: 0011r00001tpjY6AAI

Trigger.AxtriaSalesIQTM.PositionAccountTrigger: line 76, column 1:--","Implicit","0011r00001tq1wjAAA","true","2019-04-28","2019-01-30","","","a2B1r00000BdBBtEAN","","","a2X1r000005JlG8EAK","a251r000005nMeIAAU"
"","CANNOT_INSERT_UPDATE_ACTIVATE_ENTITY:AxtriaSalesIQTM.PositionAccountTrigger: execution of BeforeUpdate

caused by: System.ListException: Duplicate id in list: 0011r00001tpjY6AAI

Trigger.AxtriaSalesIQTM.PositionAccountTrigger: line 76, column 1:--","Implicit","0011r00001tqD1qAAE","true","2019-04-28","2019-01-30","","","a2B1r00000BdBDsEAN","","","a2X1r000005JlG8EAK","a251r000005nPutAAE"
"","CANNOT_INSERT_UPDATE_ACTIVATE_ENTITY:AxtriaSalesIQTM.PositionAccountTrigger: execution of BeforeUpdate

caused by: System.ListException: Duplicate id in list: 0011r00001tpjY6AAI

Trigger.AxtriaSalesIQTM.PositionAccountTrigger: line 76, column 1:--","Implicit","0011r00001tqD1qAAE","true","2019-04-28","2019-01-30","","","a2B1r00000BdBDoEAN","","","a2X1r000005JlG8EAK","a251r000005nPuuAAE"
"","CANNOT_INSERT_UPDATE_ACTIVATE_ENTITY:AxtriaSalesIQTM.PositionAccountTrigger: execution of BeforeUpdate

caused by: System.ListException: Duplicate id in list: 0011r00001tpjY6AAI

Trigger.AxtriaSalesIQTM.PositionAccountTrigger: line 76, column 1:--","Implicit","0011r00001tqD1qAAE","true","2019-04-28","2019-01-30","","","a2B1r00000BdBDuEAN","","","a2X1r000005JlG8EAK","a251r000005nPuvAAE"
"","CANNOT_INSERT_UPDATE_ACTIVATE_ENTITY:AxtriaSalesIQTM.PositionAccountTrigger: execution of BeforeUpdate

caused by: System.ListException: Duplicate id in list: 0011r00001tpjY6AAI

Trigger.AxtriaSalesIQTM.PositionAccountTrigger: line 76, column 1:--","Implicit","0011r00001tqKcHAAU","true","2019-04-28","2019-01-30","","","a2B1r00000BdBC1EAN","","","a2X1r000005JlG8EAK","a251r000005nQIsAAM"
"","CANNOT_INSERT_UPDATE_ACTIVATE_ENTITY:AxtriaSalesIQTM.PositionAccountTrigger: execution of BeforeUpdate

caused by: System.ListException: Duplicate id in list: 0011r00001tpjY6AAI

Trigger.AxtriaSalesIQTM.PositionAccountTrigger: line 76, column 1:--","Implicit","0011r00001tqKcHAAU","true","2019-04-28","2019-01-30","","","a2B1r00000BdBBvEAN","","","a2X1r000005JlG8EAK","a251r000005nQItAAM"
"","CANNOT_INSERT_UPDATE_ACTIVATE_ENTITY:AxtriaSalesIQTM.PositionAccountTrigger: execution of BeforeUpdate

caused by: System.ListException: Duplicate id in list: 0011r00001tpjY6AAI

Trigger.AxtriaSalesIQTM.PositionAccountTrigger: line 76, column 1:--","Implicit","0011r00001tqKcHAAU","true","2019-04-28","2019-01-30","","","a2B1r00000BdBBzEAN","","","a2X1r000005JlG8EAK","a251r000005nQIuAAM"
"","CANNOT_INSERT_UPDATE_ACTIVATE_ENTITY:AxtriaSalesIQTM.PositionAccountTrigger: execution of BeforeUpdate

caused by: System.ListException: Duplicate id in list: 0011r00001tpjY6AAI

Trigger.AxtriaSalesIQTM.PositionAccountTrigger: line 76, column 1:--","Implicit","0011r00001tqIbuAAE","true","2019-04-28","2019-01-30","","","a2B1r00000BdBDbEAN","","","a2X1r000005JlG8EAK","a251r000005nRhIAAU"
"","CANNOT_INSERT_UPDATE_ACTIVATE_ENTITY:AxtriaSalesIQTM.PositionAccountTrigger: execution of BeforeUpdate

caused by: System.ListException: Duplicate id in list: 0011r00001tpjY6AAI

Trigger.AxtriaSalesIQTM.PositionAccountTrigger: line 76, column 1:--","Implicit","0011r00001tqIbuAAE","true","2019-04-28","2019-01-30","","","a2B1r00000BdBDfEAN","","","a2X1r000005JlG8EAK","a251r000005nRhJAAU"
"","CANNOT_INSERT_UPDATE_ACTIVATE_ENTITY:AxtriaSalesIQTM.PositionAccountTrigger: execution of BeforeUpdate

caused by: System.ListException: Duplicate id in list: 0011r00001tpjY6AAI

Trigger.AxtriaSalesIQTM.PositionAccountTrigger: line 76, column 1:--","Implicit","0011r00001tqIbzAAE","true","2019-04-28","2019-01-30","","","a2B1r00000BdBCnEAN","","","a2X1r000005JlG8EAK","a251r000005nRhaAAE"
"","CANNOT_INSERT_UPDATE_ACTIVATE_ENTITY:AxtriaSalesIQTM.PositionAccountTrigger: execution of BeforeUpdate

caused by: System.ListException: Duplicate id in list: 0011r00001tpjY6AAI

Trigger.AxtriaSalesIQTM.PositionAccountTrigger: line 76, column 1:--","Implicit","0011r00001tqIbzAAE","true","2019-04-28","2019-01-30","","","a2B1r00000BdBCrEAN","","","a2X1r000005JlG8EAK","a251r000005nRhbAAE"
"","CANNOT_INSERT_UPDATE_ACTIVATE_ENTITY:AxtriaSalesIQTM.PositionAccountTrigger: execution of BeforeUpdate

caused by: System.ListException: Duplicate id in list: 0011r00001tpjY6AAI

Trigger.AxtriaSalesIQTM.PositionAccountTrigger: line 76, column 1:--","Implicit","0011r00001tqIbzAAE","true","2019-04-28","2019-01-30","","","a2B1r00000BdBCvEAN","","","a2X1r000005JlG8EAK","a251r000005nRhcAAE"
"","CANNOT_INSERT_UPDATE_ACTIVATE_ENTITY:AxtriaSalesIQTM.PositionAccountTrigger: execution of BeforeUpdate

caused by: System.ListException: Duplicate id in list: 0011r00001tpjY6AAI

Trigger.AxtriaSalesIQTM.PositionAccountTrigger: line 76, column 1:--","Implicit","0011r00001tqBQoAAM","true","2019-04-28","2019-01-30","","","a2B1r00000BdBEGEA3","","","a2X1r000005JlG8EAK","a251r000005nVfVAAU"
"","CANNOT_INSERT_UPDATE_ACTIVATE_ENTITY:AxtriaSalesIQTM.PositionAccountTrigger: execution of BeforeUpdate

caused by: System.ListException: Duplicate id in list: 0011r00001tpjY6AAI

Trigger.AxtriaSalesIQTM.PositionAccountTrigger: line 76, column 1:--","Implicit","0011r00001tqBQoAAM","true","2019-04-28","2019-01-30","","","a2B1r00000BdBEKEA3","","","a2X1r000005JlG8EAK","a251r000005nVfWAAU"
"","CANNOT_INSERT_UPDATE_ACTIVATE_ENTITY:AxtriaSalesIQTM.PositionAccountTrigger: execution of BeforeUpdate

caused by: System.ListException: Duplicate id in list: 0011r00001tpjY6AAI

Trigger.AxtriaSalesIQTM.PositionAccountTrigger: line 76, column 1:--","Implicit","0011r00001tqBQoAAM","true","2019-04-28","2019-01-30","","","a2B1r00000BdBENEA3","","","a2X1r000005JlG8EAK","a251r000005nVfXAAU"
"","CANNOT_INSERT_UPDATE_ACTIVATE_ENTITY:AxtriaSalesIQTM.PositionAccountTrigger: execution of BeforeUpdate

caused by: System.ListException: Duplicate id in list: 0011r00001tpjY6AAI

Trigger.AxtriaSalesIQTM.PositionAccountTrigger: line 76, column 1:--","Implicit","0011r00001tqG8zAAE","true","2019-04-28","2019-01-30","","","a2B1r00000BdBC7EAN","","","a2X1r000005JlG8EAK","a251r000005nWWZAA2"
"","CANNOT_INSERT_UPDATE_ACTIVATE_ENTITY:AxtriaSalesIQTM.PositionAccountTrigger: execution of BeforeUpdate

caused by: System.ListException: Duplicate id in list: 0011r00001tpjY6AAI

Trigger.AxtriaSalesIQTM.PositionAccountTrigger: line 76, column 1:--","Implicit","0011r00001tqG8zAAE","true","2019-04-28","2019-01-30","","","a2B1r00000BdBCAEA3","","","a2X1r000005JlG8EAK","a251r000005nWWaAAM"
"","CANNOT_INSERT_UPDATE_ACTIVATE_ENTITY:AxtriaSalesIQTM.PositionAccountTrigger: execution of BeforeUpdate

caused by: System.ListException: Duplicate id in list: 0011r00001tpjY6AAI

Trigger.AxtriaSalesIQTM.PositionAccountTrigger: line 76, column 1:--","Implicit","0011r00001tqG8zAAE","true","2019-04-28","2019-01-30","","","a2B1r00000BdBC8EAN","","","a2X1r000005JlG8EAK","a251r000005nWWbAAM"
"","CANNOT_INSERT_UPDATE_ACTIVATE_ENTITY:AxtriaSalesIQTM.PositionAccountTrigger: execution of BeforeUpdate

caused by: System.ListException: Duplicate id in list: 0011r00001tpjY6AAI

Trigger.AxtriaSalesIQTM.PositionAccountTrigger: line 76, column 1:--","Implicit","0011r00001tqKR0AAM","true","2019-04-28","2019-01-30","","","a2B1r00000BdBBqEAN","","","a2X1r000005JlG8EAK","a251r000005nX3mAAE"
"","CANNOT_INSERT_UPDATE_ACTIVATE_ENTITY:AxtriaSalesIQTM.PositionAccountTrigger: execution of BeforeUpdate

caused by: System.ListException: Duplicate id in list: 0011r00001tpjY6AAI

Trigger.AxtriaSalesIQTM.PositionAccountTrigger: line 76, column 1:--","Implicit","0011r00001tqKR0AAM","true","2019-04-28","2019-01-30","","","a2B1r00000BdBCAEA3","","","a2X1r000005JlG8EAK","a251r000005nX3nAAE"
"","CANNOT_INSERT_UPDATE_ACTIVATE_ENTITY:AxtriaSalesIQTM.PositionAccountTrigger: execution of BeforeUpdate

caused by: System.ListException: Duplicate id in list: 0011r00001tpjY6AAI

Trigger.AxtriaSalesIQTM.PositionAccountTrigger: line 76, column 1:--","Implicit","0011r00001tps41AAA","true","2019-04-28","2019-01-30","","","a2B1r00000BdBBwEAN","","","a2X1r000005JlG8EAK","a251r000005nXNdAAM"
"","CANNOT_INSERT_UPDATE_ACTIVATE_ENTITY:AxtriaSalesIQTM.PositionAccountTrigger: execution of BeforeUpdate

caused by: System.ListException: Duplicate id in list: 0011r00001tpjY6AAI

Trigger.AxtriaSalesIQTM.PositionAccountTrigger: line 76, column 1:--","Implicit","0011r00001tps41AAA","true","2019-04-28","2019-01-30","","","a2B1r00000BdBC1EAN","","","a2X1r000005JlG8EAK","a251r000005nXNeAAM"
"","CANNOT_INSERT_UPDATE_ACTIVATE_ENTITY:AxtriaSalesIQTM.PositionAccountTrigger: execution of BeforeUpdate

caused by: System.ListException: Duplicate id in list: 0011r00001tpjY6AAI

Trigger.AxtriaSalesIQTM.PositionAccountTrigger: line 76, column 1:--","Implicit","0011r00001tqDiFAAU","true","2019-04-28","2019-01-30","","","a2B1r00000BdBD6EAN","","","a2X1r000005JlG8EAK","a251r000005nXS3AAM"
"","CANNOT_INSERT_UPDATE_ACTIVATE_ENTITY:AxtriaSalesIQTM.PositionAccountTrigger: execution of BeforeUpdate

caused by: System.ListException: Duplicate id in list: 0011r00001tpjY6AAI

Trigger.AxtriaSalesIQTM.PositionAccountTrigger: line 76, column 1:--","Implicit","0011r00001tqDiFAAU","true","2019-04-28","2019-01-30","","","a2B1r00000BdBD3EAN","","","a2X1r000005JlG8EAK","a251r000005nXS4AAM"
"","CANNOT_INSERT_UPDATE_ACTIVATE_ENTITY:AxtriaSalesIQTM.PositionAccountTrigger: execution of BeforeUpdate

caused by: System.ListException: Duplicate id in list: 0011r00001tpjY6AAI

Trigger.AxtriaSalesIQTM.PositionAccountTrigger: line 76, column 1:--","Implicit","0011r00001tqDiFAAU","true","2019-04-28","2019-01-30","","","a2B1r00000BdBCzEAN","","","a2X1r000005JlG8EAK","a251r000005nXS5AAM"
"","CANNOT_INSERT_UPDATE_ACTIVATE_ENTITY:AxtriaSalesIQTM.PositionAccountTrigger: execution of BeforeUpdate

caused by: System.ListException: Duplicate id in list: 0011r00001tpjY6AAI

Trigger.AxtriaSalesIQTM.PositionAccountTrigger: line 76, column 1:--","Implicit","0011r00001tqBuiAAE","true","2019-04-28","2019-01-30","","","a2B1r00000BdBCZEA3","","","a2X1r000005JlG8EAK","a251r000005nYAeAAM"
"","CANNOT_INSERT_UPDATE_ACTIVATE_ENTITY:AxtriaSalesIQTM.PositionAccountTrigger: execution of BeforeUpdate

caused by: System.ListException: Duplicate id in list: 0011r00001tpjY6AAI

Trigger.AxtriaSalesIQTM.PositionAccountTrigger: line 76, column 1:--","Implicit","0011r00001tqBuiAAE","true","2019-04-28","2019-01-30","","","a2B1r00000BdBCdEAN","","","a2X1r000005JlG8EAK","a251r000005nYAfAAM"
"","CANNOT_INSERT_UPDATE_ACTIVATE_ENTITY:AxtriaSalesIQTM.PositionAccountTrigger: execution of BeforeUpdate

caused by: System.ListException: Duplicate id in list: 0011r00001tpjY6AAI

Trigger.AxtriaSalesIQTM.PositionAccountTrigger: line 76, column 1:--","Implicit","0011r00001tqBuiAAE","true","2019-04-28","2019-01-30","","","a2B1r00000BdBCVEA3","","","a2X1r000005JlG8EAK","a251r000005nYAgAAM"
"","CANNOT_INSERT_UPDATE_ACTIVATE_ENTITY:AxtriaSalesIQTM.PositionAccountTrigger: execution of BeforeUpdate

caused by: System.ListException: Duplicate id in list: 0011r00001tpjY6AAI

Trigger.AxtriaSalesIQTM.PositionAccountTrigger: line 76, column 1:--","Implicit","0011r00001tqKT9AAM","true","2019-04-28","2019-01-30","","","a2B1r00000BdBBpEAN","","","a2X1r000005JlG8EAK","a251r000005nYxPAAU"
"","CANNOT_INSERT_UPDATE_ACTIVATE_ENTITY:AxtriaSalesIQTM.PositionAccountTrigger: execution of BeforeUpdate

caused by: System.ListException: Duplicate id in list: 0011r00001tpjY6AAI

Trigger.AxtriaSalesIQTM.PositionAccountTrigger: line 76, column 1:--","Implicit","0011r00001tqKT9AAM","true","2019-04-28","2019-01-30","","","a2B1r00000BdBBtEAN","","","a2X1r000005JlG8EAK","a251r000005nYxQAAU"
"","CANNOT_INSERT_UPDATE_ACTIVATE_ENTITY:AxtriaSalesIQTM.PositionAccountTrigger: execution of BeforeUpdate

caused by: System.ListException: Duplicate id in list: 0011r00001tpjY6AAI

Trigger.AxtriaSalesIQTM.PositionAccountTrigger: line 76, column 1:--","Implicit","0011r00001tq7bwAAA","true","2019-04-28","2019-01-30","","","a2B1r00000BdBEPEA3","","","a2X1r000005JlG8EAK","a251r000005nZNZAA2"
"","CANNOT_INSERT_UPDATE_ACTIVATE_ENTITY:AxtriaSalesIQTM.PositionAccountTrigger: execution of BeforeUpdate

caused by: System.ListException: Duplicate id in list: 0011r00001tpjY6AAI

Trigger.AxtriaSalesIQTM.PositionAccountTrigger: line 76, column 1:--","Implicit","0011r00001tq7bwAAA","true","2019-04-28","2019-01-30","","","a2B1r00000BdBEIEA3","","","a2X1r000005JlG8EAK","a251r000005nZNaAAM"
"","CANNOT_INSERT_UPDATE_ACTIVATE_ENTITY:AxtriaSalesIQTM.PositionAccountTrigger: execution of BeforeUpdate

caused by: System.ListException: Duplicate id in list: 0011r00001tpjY6AAI

Trigger.AxtriaSalesIQTM.PositionAccountTrigger: line 76, column 1:--","Implicit","0011r00001tq7bwAAA","true","2019-04-28","2019-01-30","","","a2B1r00000BdBELEA3","","","a2X1r000005JlG8EAK","a251r000005nZNbAAM"
"","CANNOT_INSERT_UPDATE_ACTIVATE_ENTITY:AxtriaSalesIQTM.PositionAccountTrigger: execution of BeforeUpdate

caused by: System.ListException: Duplicate id in list: 0011r00001tpjY6AAI

Trigger.AxtriaSalesIQTM.PositionAccountTrigger: line 76, column 1:--","Implicit","0011r00001tq8K2AAI","true","2019-04-28","2019-01-30","","","a2B1r00000BdBBwEAN","","","a2X1r000005JlG8EAK","a251r000005nZacAAE"
"","CANNOT_INSERT_UPDATE_ACTIVATE_ENTITY:AxtriaSalesIQTM.PositionAccountTrigger: execution of BeforeUpdate

caused by: System.ListException: Duplicate id in list: 0011r00001tpjY6AAI

Trigger.AxtriaSalesIQTM.PositionAccountTrigger: line 76, column 1:--","Implicit","0011r00001tq8K2AAI","true","2019-04-28","2019-01-30","","","a2B1r00000BdBC1EAN","","","a2X1r000005JlG8EAK","a251r000005nZadAAE"
"","CANNOT_INSERT_UPDATE_ACTIVATE_ENTITY:AxtriaSalesIQTM.PositionAccountTrigger: execution of BeforeUpdate

caused by: System.ListException: Duplicate id in list: 0011r00001tpjY6AAI

Trigger.AxtriaSalesIQTM.PositionAccountTrigger: line 76, column 1:--","Implicit","0011r00001tq7DPAAY","true","2019-04-28","2019-01-30","","","a2B1r00000BdBDfEAN","","","a2X1r000005JlG8EAK","a251r000005na6rAAA"
"","CANNOT_INSERT_UPDATE_ACTIVATE_ENTITY:AxtriaSalesIQTM.PositionAccountTrigger: execution of BeforeUpdate

caused by: System.ListException: Duplicate id in list: 0011r00001tpjY6AAI

Trigger.AxtriaSalesIQTM.PositionAccountTrigger: line 76, column 1:--","Implicit","0011r00001tq7DPAAY","true","2019-04-28","2019-01-30","","","a2B1r00000BdBDbEAN","","","a2X1r000005JlG8EAK","a251r000005na6sAAA"
"","CANNOT_INSERT_UPDATE_ACTIVATE_ENTITY:AxtriaSalesIQTM.PositionAccountTrigger: execution of BeforeUpdate

caused by: System.ListException: Duplicate id in list: 0011r00001tpjY6AAI

Trigger.AxtriaSalesIQTM.PositionAccountTrigger: line 76, column 1:--","Implicit","0011r00001tq7ENAAY","true","2019-04-28","2019-01-30","","","a2B1r00000BdBBtEAN","","","a2X1r000005JlG8EAK","a251r000005narvAAA"
"","CANNOT_INSERT_UPDATE_ACTIVATE_ENTITY:AxtriaSalesIQTM.PositionAccountTrigger: execution of BeforeUpdate

caused by: System.ListException: Duplicate id in list: 0011r00001tpjY6AAI

Trigger.AxtriaSalesIQTM.PositionAccountTrigger: line 76, column 1:--","Implicit","0011r00001tq7ENAAY","true","2019-04-28","2019-01-30","","","a2B1r00000BdBBpEAN","","","a2X1r000005JlG8EAK","a251r000005narwAAA"
"","CANNOT_INSERT_UPDATE_ACTIVATE_ENTITY:AxtriaSalesIQTM.PositionAccountTrigger: execution of BeforeUpdate

caused by: System.ListException: Duplicate id in list: 0011r00001tpjY6AAI

Trigger.AxtriaSalesIQTM.PositionAccountTrigger: line 76, column 1:--","Implicit","0011r00001tqGIhAAM","true","2019-04-28","2019-01-30","","","a2B1r00000BdBCXEA3","","","a2X1r000005JlG8EAK","a251r000005ncYKAAY"
"","CANNOT_INSERT_UPDATE_ACTIVATE_ENTITY:AxtriaSalesIQTM.PositionAccountTrigger: execution of BeforeUpdate

caused by: System.ListException: Duplicate id in list: 0011r00001tpjY6AAI

Trigger.AxtriaSalesIQTM.PositionAccountTrigger: line 76, column 1:--","Implicit","0011r00001tqGIhAAM","true","2019-04-28","2019-01-30","","","a2B1r00000BdBCeEAN","","","a2X1r000005JlG8EAK","a251r000005ncYLAAY"
"","CANNOT_INSERT_UPDATE_ACTIVATE_ENTITY:AxtriaSalesIQTM.PositionAccountTrigger: execution of BeforeUpdate

caused by: System.ListException: Duplicate id in list: 0011r00001tpjY6AAI

Trigger.AxtriaSalesIQTM.PositionAccountTrigger: line 76, column 1:--","Implicit","0011r00001tqGIhAAM","true","2019-04-28","2019-01-30","","","a2B1r00000BdBCbEAN","","","a2X1r000005JlG8EAK","a251r000005ncYMAAY"
"","CANNOT_INSERT_UPDATE_ACTIVATE_ENTITY:AxtriaSalesIQTM.PositionAccountTrigger: execution of BeforeUpdate

caused by: System.ListException: Duplicate id in list: 0011r00001tpjY6AAI

Trigger.AxtriaSalesIQTM.PositionAccountTrigger: line 76, column 1:--","Implicit","0011r00001tq8uTAAQ","true","2019-04-28","2019-01-30","","","a2B1r00000BdBC1EAN","","","a2X1r000005JlG8EAK","a251r000005ndcnAAA"
"","CANNOT_INSERT_UPDATE_ACTIVATE_ENTITY:AxtriaSalesIQTM.PositionAccountTrigger: execution of BeforeUpdate

caused by: System.ListException: Duplicate id in list: 0011r00001tpjY6AAI

Trigger.AxtriaSalesIQTM.PositionAccountTrigger: line 76, column 1:--","Implicit","0011r00001tq8uTAAQ","true","2019-04-28","2019-01-30","","","a2B1r00000BdBBzEAN","","","a2X1r000005JlG8EAK","a251r000005ndcoAAA"
"","CANNOT_INSERT_UPDATE_ACTIVATE_ENTITY:AxtriaSalesIQTM.PositionAccountTrigger: execution of BeforeUpdate

caused by: System.ListException: Duplicate id in list: 0011r00001tpjY6AAI

Trigger.AxtriaSalesIQTM.PositionAccountTrigger: line 76, column 1:--","Implicit","0011r00001tq8uTAAQ","true","2019-04-28","2019-01-30","","","a2B1r00000BdBBvEAN","","","a2X1r000005JlG8EAK","a251r000005ndcpAAA"
"","CANNOT_INSERT_UPDATE_ACTIVATE_ENTITY:AxtriaSalesIQTM.PositionAccountTrigger: execution of BeforeUpdate

caused by: System.ListException: Duplicate id in list: 0011r00001tpjY6AAI

Trigger.AxtriaSalesIQTM.PositionAccountTrigger: line 76, column 1:--","Implicit","0011r00001tqGNaAAM","true","2019-04-28","2019-01-30","","","a2B1r00000BdBCdEAN","","","a2X1r000005JlG8EAK","a251r000005ne7dAAA"
"","CANNOT_INSERT_UPDATE_ACTIVATE_ENTITY:AxtriaSalesIQTM.PositionAccountTrigger: execution of BeforeUpdate

caused by: System.ListException: Duplicate id in list: 0011r00001tpjY6AAI

Trigger.AxtriaSalesIQTM.PositionAccountTrigger: line 76, column 1:--","Implicit","0011r00001tqGNaAAM","true","2019-04-28","2019-01-30","","","a2B1r00000BdBCVEA3","","","a2X1r000005JlG8EAK","a251r000005ne7eAAA"
"","CANNOT_INSERT_UPDATE_ACTIVATE_ENTITY:AxtriaSalesIQTM.PositionAccountTrigger: execution of BeforeUpdate

caused by: System.ListException: Duplicate id in list: 0011r00001tpjY6AAI

Trigger.AxtriaSalesIQTM.PositionAccountTrigger: line 76, column 1:--","Implicit","0011r00001tqGNaAAM","true","2019-04-28","2019-01-30","","","a2B1r00000BdBCZEA3","","","a2X1r000005JlG8EAK","a251r000005ne7fAAA"
"","CANNOT_INSERT_UPDATE_ACTIVATE_ENTITY:AxtriaSalesIQTM.PositionAccountTrigger: execution of BeforeUpdate

caused by: System.ListException: Duplicate id in list: 0011r00001tpjY6AAI

Trigger.AxtriaSalesIQTM.PositionAccountTrigger: line 76, column 1:--","Implicit","0011r00001tqGQoAAM","true","2019-04-28","2019-01-30","","","a2B1r00000BdBCCEA3","","","a2X1r000005JlG8EAK","a251r000005nfHqAAI"
"","CANNOT_INSERT_UPDATE_ACTIVATE_ENTITY:AxtriaSalesIQTM.PositionAccountTrigger: execution of BeforeUpdate

caused by: System.ListException: Duplicate id in list: 0011r00001tpjY6AAI

Trigger.AxtriaSalesIQTM.PositionAccountTrigger: line 76, column 1:--","Implicit","0011r00001tqGQoAAM","true","2019-04-28","2019-01-30","","","a2B1r00000BdBC9EAN","","","a2X1r000005JlG8EAK","a251r000005nfHrAAI"
"","CANNOT_INSERT_UPDATE_ACTIVATE_ENTITY:AxtriaSalesIQTM.PositionAccountTrigger: execution of BeforeUpdate

caused by: System.ListException: Duplicate id in list: 0011r00001tpjY6AAI

Trigger.AxtriaSalesIQTM.PositionAccountTrigger: line 76, column 1:--","Implicit","0011r00001tqGQoAAM","true","2019-04-28","2019-01-30","","","a2B1r00000BdBC6EAN","","","a2X1r000005JlG8EAK","a251r000005nfHsAAI"
"","CANNOT_INSERT_UPDATE_ACTIVATE_ENTITY:AxtriaSalesIQTM.PositionAccountTrigger: execution of BeforeUpdate

caused by: System.ListException: Duplicate id in list: 0011r00001tpjY6AAI

Trigger.AxtriaSalesIQTM.PositionAccountTrigger: line 76, column 1:--","Implicit","0011r00001tqGT8AAM","true","2019-04-28","2019-01-30","","","a2B1r00000BdBCNEA3","","","a2X1r000005JlG8EAK","a251r000005ng9LAAQ"
"","CANNOT_INSERT_UPDATE_ACTIVATE_ENTITY:AxtriaSalesIQTM.PositionAccountTrigger: execution of BeforeUpdate

caused by: System.ListException: Duplicate id in list: 0011r00001tpjY6AAI

Trigger.AxtriaSalesIQTM.PositionAccountTrigger: line 76, column 1:--","Implicit","0011r00001tqGT8AAM","true","2019-04-28","2019-01-30","","","a2B1r00000BdBCREA3","","","a2X1r000005JlG8EAK","a251r000005ng9MAAQ"
"","CANNOT_INSERT_UPDATE_ACTIVATE_ENTITY:AxtriaSalesIQTM.PositionAccountTrigger: execution of BeforeUpdate

caused by: System.ListException: Duplicate id in list: 0011r00001tpjY6AAI

Trigger.AxtriaSalesIQTM.PositionAccountTrigger: line 76, column 1:--","Implicit","0011r00001tqJC1AAM","true","2019-04-28","2019-01-30","","","a2B1r00000BdBC6EAN","","","a2X1r000005JlG8EAK","a251r000005ngM9AAI"
"","CANNOT_INSERT_UPDATE_ACTIVATE_ENTITY:AxtriaSalesIQTM.PositionAccountTrigger: execution of BeforeUpdate

caused by: System.ListException: Duplicate id in list: 0011r00001tpjY6AAI

Trigger.AxtriaSalesIQTM.PositionAccountTrigger: line 76, column 1:--","Implicit","0011r00001tqJC1AAM","true","2019-04-28","2019-01-30","","","a2B1r00000BdBC9EAN","","","a2X1r000005JlG8EAK","a251r000005ngMAAAY"
"","CANNOT_INSERT_UPDATE_ACTIVATE_ENTITY:AxtriaSalesIQTM.PositionAccountTrigger: execution of BeforeUpdate

caused by: System.ListException: Duplicate id in list: 0011r00001tpjY6AAI

Trigger.AxtriaSalesIQTM.PositionAccountTrigger: line 76, column 1:--","Implicit","0011r00001tqJC1AAM","true","2019-04-28","2019-01-30","","","a2B1r00000BdBCCEA3","","","a2X1r000005JlG8EAK","a251r000005ngMBAAY"
"","CANNOT_INSERT_UPDATE_ACTIVATE_ENTITY:AxtriaSalesIQTM.PositionAccountTrigger: execution of BeforeUpdate

caused by: System.ListException: Duplicate id in list: 0011r00001tpjY6AAI

Trigger.AxtriaSalesIQTM.PositionAccountTrigger: line 76, column 1:--","Implicit","0011r00001tqGUoAAM","true","2019-04-28","2019-01-30","","","a2B1r00000BdBC8EAN","","","a2X1r000005JlG8EAK","a251r000005ngYvAAI"
"","CANNOT_INSERT_UPDATE_ACTIVATE_ENTITY:AxtriaSalesIQTM.PositionAccountTrigger: execution of BeforeUpdate

caused by: System.ListException: Duplicate id in list: 0011r00001tpjY6AAI

Trigger.AxtriaSalesIQTM.PositionAccountTrigger: line 76, column 1:--","Implicit","0011r00001tqGUoAAM","true","2019-04-28","2019-01-30","","","a2B1r00000BdBC7EAN","","","a2X1r000005JlG8EAK","a251r000005ngYwAAI"
"","CANNOT_INSERT_UPDATE_ACTIVATE_ENTITY:AxtriaSalesIQTM.PositionAccountTrigger: execution of BeforeUpdate

caused by: System.ListException: Duplicate id in list: 0011r00001tpjY6AAI

Trigger.AxtriaSalesIQTM.PositionAccountTrigger: line 76, column 1:--","Implicit","0011r00001tqGUoAAM","true","2019-04-28","2019-01-30","","","a2B1r00000BdBCAEA3","","","a2X1r000005JlG8EAK","a251r000005ngYuAAI"
"","CANNOT_INSERT_UPDATE_ACTIVATE_ENTITY:AxtriaSalesIQTM.PositionAccountTrigger: execution of BeforeUpdate

caused by: System.ListException: Duplicate id in list: 0011r00001tpjY6AAI

Trigger.AxtriaSalesIQTM.PositionAccountTrigger: line 76, column 1:--","Implicit","0011r00001tqE3oAAE","true","2019-04-28","2019-01-30","","","a2B1r00000BdBCOEA3","","","a2X1r000005JlG8EAK","a251r000005ngnvAAA"
"","CANNOT_INSERT_UPDATE_ACTIVATE_ENTITY:AxtriaSalesIQTM.PositionAccountTrigger: execution of BeforeUpdate

caused by: System.ListException: Duplicate id in list: 0011r00001tpjY6AAI

Trigger.AxtriaSalesIQTM.PositionAccountTrigger: line 76, column 1:--","Implicit","0011r00001tqE3oAAE","true","2019-04-28","2019-01-30","","","a2B1r00000BdBCSEA3","","","a2X1r000005JlG8EAK","a251r000005ngnwAAA"
"","CANNOT_INSERT_UPDATE_ACTIVATE_ENTITY:AxtriaSalesIQTM.PositionAccountTrigger: execution of BeforeUpdate

caused by: System.ListException: Duplicate id in list: 0011r00001tpjY6AAI

Trigger.AxtriaSalesIQTM.PositionAccountTrigger: line 76, column 1:--","Implicit","0011r00001tqE5bAAE","true","2019-04-28","2019-01-30","","","a2B1r00000BdBE6EAN","","","a2X1r000005JlG8EAK","a251r000005nhF8AAI"
"","CANNOT_INSERT_UPDATE_ACTIVATE_ENTITY:AxtriaSalesIQTM.PositionAccountTrigger: execution of BeforeUpdate

caused by: System.ListException: Duplicate id in list: 0011r00001tpjY6AAI

Trigger.AxtriaSalesIQTM.PositionAccountTrigger: line 76, column 1:--","Implicit","0011r00001tqE5bAAE","true","2019-04-28","2019-01-30","","","a2B1r00000BdBEDEA3","","","a2X1r000005JlG8EAK","a251r000005nhF9AAI"
"","CANNOT_INSERT_UPDATE_ACTIVATE_ENTITY:AxtriaSalesIQTM.PositionAccountTrigger: execution of BeforeUpdate

caused by: System.ListException: Duplicate id in list: 0011r00001tpjY6AAI

Trigger.AxtriaSalesIQTM.PositionAccountTrigger: line 76, column 1:--","Implicit","0011r00001tqE5bAAE","true","2019-04-28","2019-01-30","","","a2B1r00000BdBEAEA3","","","a2X1r000005JlG8EAK","a251r000005nhFAAAY"
"","CANNOT_INSERT_UPDATE_ACTIVATE_ENTITY:AxtriaSalesIQTM.PositionAccountTrigger: execution of BeforeUpdate

caused by: System.ListException: Duplicate id in list: 0011r00001tpjY6AAI

Trigger.AxtriaSalesIQTM.PositionAccountTrigger: line 76, column 1:--","Implicit","0011r00001tqJg0AAE","true","2019-04-28","2019-01-30","","","a2B1r00000BdBEKEA3","","","a2X1r000005JlG8EAK","a251r000005nhK9AAI"
"","CANNOT_INSERT_UPDATE_ACTIVATE_ENTITY:AxtriaSalesIQTM.PositionAccountTrigger: execution of BeforeUpdate

caused by: System.ListException: Duplicate id in list: 0011r00001tpjY6AAI

Trigger.AxtriaSalesIQTM.PositionAccountTrigger: line 76, column 1:--","Implicit","0011r00001tqJg0AAE","true","2019-04-28","2019-01-30","","","a2B1r00000BdBEHEA3","","","a2X1r000005JlG8EAK","a251r000005nhKAAAY"
"","CANNOT_INSERT_UPDATE_ACTIVATE_ENTITY:AxtriaSalesIQTM.PositionAccountTrigger: execution of BeforeUpdate

caused by: System.ListException: Duplicate id in list: 0011r00001tpjY6AAI

Trigger.AxtriaSalesIQTM.PositionAccountTrigger: line 76, column 1:--","Implicit","0011r00001tqJg0AAE","true","2019-04-28","2019-01-30","","","a2B1r00000BdBEOEA3","","","a2X1r000005JlG8EAK","a251r000005nhKBAAY"
"","CANNOT_INSERT_UPDATE_ACTIVATE_ENTITY:AxtriaSalesIQTM.PositionAccountTrigger: execution of BeforeUpdate

caused by: System.ListException: Duplicate id in list: 0011r00001tpjY6AAI

Trigger.AxtriaSalesIQTM.PositionAccountTrigger: line 76, column 1:--","Implicit","0011r00001tqChwAAE","true","2019-04-28","2019-01-30","","","a2B1r00000BdBC6EAN","","","a2X1r000005JlG8EAK","a251r000005niVZAAY"
"","CANNOT_INSERT_UPDATE_ACTIVATE_ENTITY:AxtriaSalesIQTM.PositionAccountTrigger: execution of BeforeUpdate

caused by: System.ListException: Duplicate id in list: 0011r00001tpjY6AAI

Trigger.AxtriaSalesIQTM.PositionAccountTrigger: line 76, column 1:--","Implicit","0011r00001tqChwAAE","true","2019-04-28","2019-01-30","","","a2B1r00000BdBC9EAN","","","a2X1r000005JlG8EAK","a251r000005niVaAAI"
"","CANNOT_INSERT_UPDATE_ACTIVATE_ENTITY:AxtriaSalesIQTM.PositionAccountTrigger: execution of BeforeUpdate

caused by: System.ListException: Duplicate id in list: 0011r00001tpjY6AAI

Trigger.AxtriaSalesIQTM.PositionAccountTrigger: line 76, column 1:--","Implicit","0011r00001tqChwAAE","true","2019-04-28","2019-01-30","","","a2B1r00000BdBCCEA3","","","a2X1r000005JlG8EAK","a251r000005niVbAAI"
"","CANNOT_INSERT_UPDATE_ACTIVATE_ENTITY:AxtriaSalesIQTM.PositionAccountTrigger: execution of BeforeUpdate

caused by: System.ListException: Duplicate id in list: 0011r00001tpjY6AAI

Trigger.AxtriaSalesIQTM.PositionAccountTrigger: line 76, column 1:--","Implicit","0011r00001tqG19AAE","true","2019-04-28","2019-01-30","","","a2B1r00000BdBEOEA3","","","a2X1r000005JlG8EAK","a251r000005nklFAAQ"
"","CANNOT_INSERT_UPDATE_ACTIVATE_ENTITY:AxtriaSalesIQTM.PositionAccountTrigger: execution of BeforeUpdate

caused by: System.ListException: Duplicate id in list: 0011r00001tpjY6AAI

Trigger.AxtriaSalesIQTM.PositionAccountTrigger: line 76, column 1:--","Implicit","0011r00001tqG19AAE","true","2019-04-28","2019-01-30","","","a2B1r00000BdBEKEA3","","","a2X1r000005JlG8EAK","a251r000005nklGAAQ"
"","CANNOT_INSERT_UPDATE_ACTIVATE_ENTITY:AxtriaSalesIQTM.PositionAccountTrigger: execution of BeforeUpdate

caused by: System.ListException: Duplicate id in list: 0011r00001tpjY6AAI

Trigger.AxtriaSalesIQTM.PositionAccountTrigger: line 76, column 1:--","Implicit","0011r00001tqG19AAE","true","2019-04-28","2019-01-30","","","a2B1r00000BdBEHEA3","","","a2X1r000005JlG8EAK","a251r000005nklHAAQ"
"","CANNOT_INSERT_UPDATE_ACTIVATE_ENTITY:AxtriaSalesIQTM.PositionAccountTrigger: execution of BeforeUpdate

caused by: System.ListException: Duplicate id in list: 0011r00001tpjY6AAI

Trigger.AxtriaSalesIQTM.PositionAccountTrigger: line 76, column 1:--","Implicit","0011r00001tqG1KAAU","true","2019-04-28","2019-01-30","","","a2B1r00000BdBBxEAN","","","a2X1r000005JlG8EAK","a251r000005nklfAAA"
"","CANNOT_INSERT_UPDATE_ACTIVATE_ENTITY:AxtriaSalesIQTM.PositionAccountTrigger: execution of BeforeUpdate

caused by: System.ListException: Duplicate id in list: 0011r00001tpjY6AAI

Trigger.AxtriaSalesIQTM.PositionAccountTrigger: line 76, column 1:--","Implicit","0011r00001tqG1KAAU","true","2019-04-28","2019-01-30","","","a2B1r00000BdBC0EAN","","","a2X1r000005JlG8EAK","a251r000005nklgAAA"
"","CANNOT_INSERT_UPDATE_ACTIVATE_ENTITY:AxtriaSalesIQTM.PositionAccountTrigger: execution of BeforeUpdate

caused by: System.ListException: Duplicate id in list: 0011r00001tpjY6AAI

Trigger.AxtriaSalesIQTM.PositionAccountTrigger: line 76, column 1:--","Implicit","0011r00001tqG1KAAU","true","2019-04-28","2019-01-30","","","a2B1r00000BdBC2EAN","","","a2X1r000005JlG8EAK","a251r000005nklhAAA"
"","CANNOT_INSERT_UPDATE_ACTIVATE_ENTITY:AxtriaSalesIQTM.PositionAccountTrigger: execution of BeforeUpdate

caused by: System.ListException: Duplicate id in list: 0011r00001tpjY6AAI

Trigger.AxtriaSalesIQTM.PositionAccountTrigger: line 76, column 1:--","Implicit","0011r00001tqG2fAAE","true","2019-04-28","2019-01-30","","","a2B1r00000BdBBpEAN","","","a2X1r000005JlG8EAK","a251r000005nlFTAAY"
"","CANNOT_INSERT_UPDATE_ACTIVATE_ENTITY:AxtriaSalesIQTM.PositionAccountTrigger: execution of BeforeUpdate

caused by: System.ListException: Duplicate id in list: 0011r00001tpjY6AAI

Trigger.AxtriaSalesIQTM.PositionAccountTrigger: line 76, column 1:--","Implicit","0011r00001tqG2fAAE","true","2019-04-28","2019-01-30","","","a2B1r00000BdBBtEAN","","","a2X1r000005JlG8EAK","a251r000005nlFUAAY"
"","CANNOT_INSERT_UPDATE_ACTIVATE_ENTITY:AxtriaSalesIQTM.PositionAccountTrigger: execution of BeforeUpdate

caused by: System.ListException: Duplicate id in list: 0011r00001tpjY6AAI

Trigger.AxtriaSalesIQTM.PositionAccountTrigger: line 76, column 1:--","Implicit","0011r00001tq9S4AAI","true","2019-04-28","2019-01-30","","","a2B1r00000BdBDJEA3","","","a2X1r000005JlG8EAK","a251r000005nmreAAA"
"","CANNOT_INSERT_UPDATE_ACTIVATE_ENTITY:AxtriaSalesIQTM.PositionAccountTrigger: execution of BeforeUpdate

caused by: System.ListException: Duplicate id in list: 0011r00001tpjY6AAI

Trigger.AxtriaSalesIQTM.PositionAccountTrigger: line 76, column 1:--","Implicit","0011r00001tq9S4AAI","true","2019-04-28","2019-01-30","","","a2B1r00000BdBDMEA3","","","a2X1r000005JlG8EAK","a251r000005nmrfAAA"
"","CANNOT_INSERT_UPDATE_ACTIVATE_ENTITY:AxtriaSalesIQTM.PositionAccountTrigger: execution of BeforeUpdate

caused by: System.ListException: Duplicate id in list: 0011r00001tpjY6AAI

Trigger.AxtriaSalesIQTM.PositionAccountTrigger: line 76, column 1:--","Implicit","0011r00001tq9S4AAI","true","2019-04-28","2019-01-30","","","a2B1r00000BdBDGEA3","","","a2X1r000005JlG8EAK","a251r000005nmrgAAA"
"","CANNOT_INSERT_UPDATE_ACTIVATE_ENTITY:AxtriaSalesIQTM.PositionAccountTrigger: execution of BeforeUpdate

caused by: System.ListException: Duplicate id in list: 0011r00001tpjY6AAI

Trigger.AxtriaSalesIQTM.PositionAccountTrigger: line 76, column 1:--","Implicit","0011r00001tqHDrAAM","true","2019-04-28","2019-01-30","","","a2B1r00000BdBBpEAN","","","a2X1r000005JlG8EAK","a251r000005nn8BAAQ"
"","CANNOT_INSERT_UPDATE_ACTIVATE_ENTITY:AxtriaSalesIQTM.PositionAccountTrigger: execution of BeforeUpdate

caused by: System.ListException: Duplicate id in list: 0011r00001tpjY6AAI

Trigger.AxtriaSalesIQTM.PositionAccountTrigger: line 76, column 1:--","Implicit","0011r00001tqHDrAAM","true","2019-04-28","2019-01-30","","","a2B1r00000BdBBtEAN","","","a2X1r000005JlG8EAK","a251r000005nn8CAAQ"
"","CANNOT_INSERT_UPDATE_ACTIVATE_ENTITY:AxtriaSalesIQTM.PositionAccountTrigger: execution of BeforeUpdate

caused by: System.ListException: Duplicate id in list: 0011r00001tpjY6AAI

Trigger.AxtriaSalesIQTM.PositionAccountTrigger: line 76, column 1:--","Implicit","0011r00001tqHOEAA2","true","2019-04-28","2019-01-30","","","a2B1r00000BdBCmEAN","","","a2X1r000005JlG8EAK","a251r000005nosMAAQ"
"","CANNOT_INSERT_UPDATE_ACTIVATE_ENTITY:AxtriaSalesIQTM.PositionAccountTrigger: execution of BeforeUpdate

caused by: System.ListException: Duplicate id in list: 0011r00001tpjY6AAI

Trigger.AxtriaSalesIQTM.PositionAccountTrigger: line 76, column 1:--","Implicit","0011r00001tqHOEAA2","true","2019-04-28","2019-01-30","","","a2B1r00000BdBCiEAN","","","a2X1r000005JlG8EAK","a251r000005nosNAAQ"
"","CANNOT_INSERT_UPDATE_ACTIVATE_ENTITY:AxtriaSalesIQTM.PositionAccountTrigger: execution of BeforeUpdate

caused by: System.ListException: Duplicate id in list: 0011r00001tpjY6AAI

Trigger.AxtriaSalesIQTM.PositionAccountTrigger: line 76, column 1:--","Implicit","0011r00001tqAk0AAE","true","2019-04-28","2019-01-30","","","a2B1r00000BdBC8EAN","","","a2X1r000005JlG8EAK","a251r000005nqYJAAY"
"","CANNOT_INSERT_UPDATE_ACTIVATE_ENTITY:AxtriaSalesIQTM.PositionAccountTrigger: execution of BeforeUpdate

caused by: System.ListException: Duplicate id in list: 0011r00001tpjY6AAI

Trigger.AxtriaSalesIQTM.PositionAccountTrigger: line 76, column 1:--","Implicit","0011r00001tqAk0AAE","true","2019-04-28","2019-01-30","","","a2B1r00000BdBCAEA3","","","a2X1r000005JlG8EAK","a251r000005nqYKAAY"
"","CANNOT_INSERT_UPDATE_ACTIVATE_ENTITY:AxtriaSalesIQTM.PositionAccountTrigger: execution of BeforeUpdate

caused by: System.ListException: Duplicate id in list: 0011r00001tpjY6AAI

Trigger.AxtriaSalesIQTM.PositionAccountTrigger: line 76, column 1:--","Implicit","0011r00001tqAk0AAE","true","2019-04-28","2019-01-30","","","a2B1r00000BdBC7EAN","","","a2X1r000005JlG8EAK","a251r000005nqYLAAY"
"","CANNOT_INSERT_UPDATE_ACTIVATE_ENTITY:AxtriaSalesIQTM.PositionAccountTrigger: execution of BeforeUpdate

caused by: System.ListException: Duplicate id in list: 0011r00001tpjY6AAI

Trigger.AxtriaSalesIQTM.PositionAccountTrigger: line 76, column 1:--","Implicit","0011r00001tpjY6AAI","true","2019-04-28","2019-01-30","","","a2B1r00000BdBByEAN","","","a2X1r000005JlG8EAK","a251r000005lk41AAA"
"","CANNOT_INSERT_UPDATE_ACTIVATE_ENTITY:AxtriaSalesIQTM.PositionAccountTrigger: execution of BeforeUpdate

caused by: System.ListException: Duplicate id in list: 0011r00001tpjY6AAI

Trigger.AxtriaSalesIQTM.PositionAccountTrigger: line 76, column 1:--","Implicit","0011r00001tpjY6AAI","true","2019-04-28","2019-01-30","","","a2B1r00000BdBC2EAN","","","a2X1r000005JlG8EAK","a251r000005lk42AAA"
"","CANNOT_INSERT_UPDATE_ACTIVATE_ENTITY:AxtriaSalesIQTM.PositionAccountTrigger: execution of BeforeUpdate

caused by: System.ListException: Duplicate id in list: 0011r00001tpjY6AAI

Trigger.AxtriaSalesIQTM.PositionAccountTrigger: line 76, column 1:--","Implicit","0011r00001tpjY6AAI","true","2019-04-28","2019-01-30","","","a2B1r00000BdBC0EAN","","","a2X1r000005JlG8EAK","a251r000005lk43AAA"
"","CANNOT_INSERT_UPDATE_ACTIVATE_ENTITY:AxtriaSalesIQTM.PositionAccountTrigger: execution of BeforeUpdate

caused by: System.ListException: Duplicate id in list: 0011r00001tpjY6AAI

Trigger.AxtriaSalesIQTM.PositionAccountTrigger: line 76, column 1:--","Implicit","0011r00001tpvWfAAI","true","2019-04-28","2019-01-30","","","a2B1r00000BdBCOEA3","","","a2X1r000005JlG8EAK","a251r000005lywYAAQ"
"","CANNOT_INSERT_UPDATE_ACTIVATE_ENTITY:AxtriaSalesIQTM.PositionAccountTrigger: execution of BeforeUpdate

caused by: System.ListException: Duplicate id in list: 0011r00001tpjY6AAI

Trigger.AxtriaSalesIQTM.PositionAccountTrigger: line 76, column 1:--","Implicit","0011r00001tpvWfAAI","true","2019-04-28","2019-01-30","","","a2B1r00000BdBCSEA3","","","a2X1r000005JlG8EAK","a251r000005lywZAAQ"
"","CANNOT_INSERT_UPDATE_ACTIVATE_ENTITY:AxtriaSalesIQTM.PositionAccountTrigger: execution of BeforeUpdate

caused by: System.ListException: Duplicate id in list: 0011r00001tpjY6AAI

Trigger.AxtriaSalesIQTM.PositionAccountTrigger: line 76, column 1:--","Implicit","0011r00001tpt0hAAA","true","2019-04-28","2019-01-30","","","a2B1r00000BdBCOEA3","","","a2X1r000005JlG8EAK","a251r000005m3F8AAI"
"","CANNOT_INSERT_UPDATE_ACTIVATE_ENTITY:AxtriaSalesIQTM.PositionAccountTrigger: execution of BeforeUpdate

caused by: System.ListException: Duplicate id in list: 0011r00001tpjY6AAI

Trigger.AxtriaSalesIQTM.PositionAccountTrigger: line 76, column 1:--","Implicit","0011r00001tpt0hAAA","true","2019-04-28","2019-01-30","","","a2B1r00000BdBCSEA3","","","a2X1r000005JlG8EAK","a251r000005m3F9AAI"
"","CANNOT_INSERT_UPDATE_ACTIVATE_ENTITY:AxtriaSalesIQTM.PositionAccountTrigger: execution of BeforeUpdate

caused by: System.ListException: Duplicate id in list: 0011r00001tpjY6AAI

Trigger.AxtriaSalesIQTM.PositionAccountTrigger: line 76, column 1:--","Implicit","0011r00001tpvYMAAY","true","2019-04-28","2019-01-30","","","a2B1r00000BdBC3EAN","","","a2X1r000005JlG8EAK","a251r000005m5JjAAI"
"","CANNOT_INSERT_UPDATE_ACTIVATE_ENTITY:AxtriaSalesIQTM.PositionAccountTrigger: execution of BeforeUpdate

caused by: System.ListException: Duplicate id in list: 0011r00001tpjY6AAI

Trigger.AxtriaSalesIQTM.PositionAccountTrigger: line 76, column 1:--","Implicit","0011r00001tpvYMAAY","true","2019-04-28","2019-01-30","","","a2B1r00000BdBC8EAN","","","a2X1r000005JlG8EAK","a251r000005m5JkAAI"
"","CANNOT_INSERT_UPDATE_ACTIVATE_ENTITY:AxtriaSalesIQTM.PositionAccountTrigger: execution of BeforeUpdate

caused by: System.ListException: Duplicate id in list: 0011r00001tpjY6AAI

Trigger.AxtriaSalesIQTM.PositionAccountTrigger: line 76, column 1:--","Implicit","0011r00001tpvYMAAY","true","2019-04-28","2019-01-30","","","a2B1r00000BdBCAEA3","","","a2X1r000005JlG8EAK","a251r000005m5JlAAI"
"","CANNOT_INSERT_UPDATE_ACTIVATE_ENTITY:AxtriaSalesIQTM.PositionAccountTrigger: execution of BeforeUpdate

caused by: System.ListException: Duplicate id in list: 0011r00001tpjY6AAI

Trigger.AxtriaSalesIQTM.PositionAccountTrigger: line 76, column 1:--","Implicit","0011r00001tpm8pAAA","true","2019-04-28","2019-01-30","","","a2B1r00000BdBC1EAN","","","a2X1r000005JlG8EAK","a251r000005mDiXAAU"
"","CANNOT_INSERT_UPDATE_ACTIVATE_ENTITY:AxtriaSalesIQTM.PositionAccountTrigger: execution of BeforeUpdate

caused by: System.ListException: Duplicate id in list: 0011r00001tpjY6AAI

Trigger.AxtriaSalesIQTM.PositionAccountTrigger: line 76, column 1:--","Implicit","0011r00001tpm8pAAA","true","2019-04-28","2019-01-30","","","a2B1r00000BdBBvEAN","","","a2X1r000005JlG8EAK","a251r000005mDiYAAU"
"","CANNOT_INSERT_UPDATE_ACTIVATE_ENTITY:AxtriaSalesIQTM.PositionAccountTrigger: execution of BeforeUpdate

caused by: System.ListException: Duplicate id in list: 0011r00001tpjY6AAI

Trigger.AxtriaSalesIQTM.PositionAccountTrigger: line 76, column 1:--","Implicit","0011r00001tpm8pAAA","true","2019-04-28","2019-01-30","","","a2B1r00000BdBBzEAN","","","a2X1r000005JlG8EAK","a251r000005mDiZAAU"
"","CANNOT_INSERT_UPDATE_ACTIVATE_ENTITY:AxtriaSalesIQTM.PositionAccountTrigger: execution of BeforeUpdate

caused by: System.ListException: Duplicate id in list: 0011r00001tpjY6AAI

Trigger.AxtriaSalesIQTM.PositionAccountTrigger: line 76, column 1:--","Implicit","0011r00001tpofqAAA","true","2019-04-28","2019-01-30","","","a2B1r00000BdBEHEA3","","","a2X1r000005JlG8EAK","a251r000005mGE7AAM"
"","CANNOT_INSERT_UPDATE_ACTIVATE_ENTITY:AxtriaSalesIQTM.PositionAccountTrigger: execution of BeforeUpdate

caused by: System.ListException: Duplicate id in list: 0011r00001tpjY6AAI

Trigger.AxtriaSalesIQTM.PositionAccountTrigger: line 76, column 1:--","Implicit","0011r00001tpofqAAA","true","2019-04-28","2019-01-30","","","a2B1r00000BdBEOEA3","","","a2X1r000005JlG8EAK","a251r000005mGE8AAM"
"","CANNOT_INSERT_UPDATE_ACTIVATE_ENTITY:AxtriaSalesIQTM.PositionAccountTrigger: execution of BeforeUpdate

caused by: System.ListException: Duplicate id in list: 0011r00001tpjY6AAI

Trigger.AxtriaSalesIQTM.PositionAccountTrigger: line 76, column 1:--","Implicit","0011r00001tpofqAAA","true","2019-04-28","2019-01-30","","","a2B1r00000BdBEKEA3","","","a2X1r000005JlG8EAK","a251r000005mGE9AAM"
"","CANNOT_INSERT_UPDATE_ACTIVATE_ENTITY:AxtriaSalesIQTM.PositionAccountTrigger: execution of BeforeUpdate

caused by: System.ListException: Duplicate id in list: 0011r00001tpjY6AAI

Trigger.AxtriaSalesIQTM.PositionAccountTrigger: line 76, column 1:--","Implicit","0011r00001tpoLoAAI","true","2019-04-28","2019-01-30","","","a2B1r00000BdBCBEA3","","","a2X1r000005JlG8EAK","a251r000005mLBCAA2"
"","CANNOT_INSERT_UPDATE_ACTIVATE_ENTITY:AxtriaSalesIQTM.PositionAccountTrigger: execution of BeforeUpdate

caused by: System.ListException: Duplicate id in list: 0011r00001tpjY6AAI

Trigger.AxtriaSalesIQTM.PositionAccountTrigger: line 76, column 1:--","Implicit","0011r00001tpoLoAAI","true","2019-04-28","2019-01-30","","","a2B1r00000BdBC4EAN","","","a2X1r000005JlG8EAK","a251r000005mLBDAA2"
"","CANNOT_INSERT_UPDATE_ACTIVATE_ENTITY:AxtriaSalesIQTM.PositionAccountTrigger: execution of BeforeUpdate

caused by: System.ListException: Duplicate id in list: 0011r00001tpjY6AAI

Trigger.AxtriaSalesIQTM.PositionAccountTrigger: line 76, column 1:--","Implicit","0011r00001tpv5sAAA","true","2019-04-28","2019-01-30","","","a2B1r00000BdBE9EAN","","","a2X1r000005JlG8EAK","a251r000005mn9WAAQ"
"","CANNOT_INSERT_UPDATE_ACTIVATE_ENTITY:AxtriaSalesIQTM.PositionAccountTrigger: execution of BeforeUpdate

caused by: System.ListException: Duplicate id in list: 0011r00001tpjY6AAI

Trigger.AxtriaSalesIQTM.PositionAccountTrigger: line 76, column 1:--","Implicit","0011r00001tpv5sAAA","true","2019-04-28","2019-01-30","","","a2B1r00000BdBECEA3","","","a2X1r000005JlG8EAK","a251r000005mn9XAAQ"
"","CANNOT_INSERT_UPDATE_ACTIVATE_ENTITY:AxtriaSalesIQTM.PositionAccountTrigger: execution of BeforeUpdate

caused by: System.ListException: Duplicate id in list: 0011r00001tpjY6AAI

Trigger.AxtriaSalesIQTM.PositionAccountTrigger: line 76, column 1:--","Implicit","0011r00001tpv5sAAA","true","2019-04-28","2019-01-30","","","a2B1r00000BdBE5EAN","","","a2X1r000005JlG8EAK","a251r000005mn9YAAQ"
"","CANNOT_INSERT_UPDATE_ACTIVATE_ENTITY:AxtriaSalesIQTM.PositionAccountTrigger: execution of BeforeUpdate

caused by: System.ListException: Duplicate id in list: 0011r00001tpjY6AAI

Trigger.AxtriaSalesIQTM.PositionAccountTrigger: line 76, column 1:--","Implicit","0011r00001tpzsyAAA","true","2019-04-28","2019-01-30","","","a2B1r00000BdBBpEAN","","","a2X1r000005JlG8EAK","a251r000005n56uAAA"
"","CANNOT_INSERT_UPDATE_ACTIVATE_ENTITY:AxtriaSalesIQTM.PositionAccountTrigger: execution of BeforeUpdate

caused by: System.ListException: Duplicate id in list: 0011r00001tpjY6AAI

Trigger.AxtriaSalesIQTM.PositionAccountTrigger: line 76, column 1:--","Implicit","0011r00001tpzsyAAA","true","2019-04-28","2019-01-30","","","a2B1r00000BdBBtEAN","","","a2X1r000005JlG8EAK","a251r000005n56vAAA"
"","CANNOT_INSERT_UPDATE_ACTIVATE_ENTITY:AxtriaSalesIQTM.PositionAccountTrigger: execution of BeforeUpdate

caused by: System.ListException: Duplicate id in list: 0011r00001tpjY6AAI

Trigger.AxtriaSalesIQTM.PositionAccountTrigger: line 76, column 1:--","Implicit","0011r00001tpz0NAAQ","true","2019-04-28","2019-01-30","","","a2B1r00000BdBCVEA3","","","a2X1r000005JlG8EAK","a251r000005n9jFAAQ"
"","CANNOT_INSERT_UPDATE_ACTIVATE_ENTITY:AxtriaSalesIQTM.PositionAccountTrigger: execution of BeforeUpdate

caused by: System.ListException: Duplicate id in list: 0011r00001tpjY6AAI

Trigger.AxtriaSalesIQTM.PositionAccountTrigger: line 76, column 1:--","Implicit","0011r00001tpz0NAAQ","true","2019-04-28","2019-01-30","","","a2B1r00000BdBCZEA3","","","a2X1r000005JlG8EAK","a251r000005n9jGAAQ"
"","CANNOT_INSERT_UPDATE_ACTIVATE_ENTITY:AxtriaSalesIQTM.PositionAccountTrigger: execution of BeforeUpdate

caused by: System.ListException: Duplicate id in list: 0011r00001tpjY6AAI

Trigger.AxtriaSalesIQTM.PositionAccountTrigger: line 76, column 1:--","Implicit","0011r00001tpz0NAAQ","true","2019-04-28","2019-01-30","","","a2B1r00000BdBCdEAN","","","a2X1r000005JlG8EAK","a251r000005n9jHAAQ"
"","CANNOT_INSERT_UPDATE_ACTIVATE_ENTITY:AxtriaSalesIQTM.PositionAccountTrigger: execution of BeforeUpdate

caused by: System.ListException: Duplicate id in list: 0011r00001tpjY6AAI

Trigger.AxtriaSalesIQTM.PositionAccountTrigger: line 76, column 1:--","Implicit","0011r00001tpxUbAAI","true","2019-04-28","2019-01-30","","","a2B1r00000BdBBpEAN","","","a2X1r000005JlG8EAK","a251r000005nE4mAAE"
"","CANNOT_INSERT_UPDATE_ACTIVATE_ENTITY:AxtriaSalesIQTM.PositionAccountTrigger: execution of BeforeUpdate

caused by: System.ListException: Duplicate id in list: 0011r00001tpjY6AAI

Trigger.AxtriaSalesIQTM.PositionAccountTrigger: line 76, column 1:--","Implicit","0011r00001tpxUbAAI","true","2019-04-28","2019-01-30","","","a2B1r00000BdBBtEAN","","","a2X1r000005JlG8EAK","a251r000005nE4nAAE"
"","CANNOT_INSERT_UPDATE_ACTIVATE_ENTITY:AxtriaSalesIQTM.PositionAccountTrigger: execution of BeforeUpdate

caused by: System.ListException: Duplicate id in list: 0011r00001tpjY6AAI

Trigger.AxtriaSalesIQTM.PositionAccountTrigger: line 76, column 1:--","Implicit","0011r00001tpmZxAAI","true","2019-04-28","2019-01-31","","","a2B1r00000BdBDJEA3","","","a2X1r000005JlG8EAK","a251r000005xQrDAAU"
"","CANNOT_INSERT_UPDATE_ACTIVATE_ENTITY:AxtriaSalesIQTM.PositionAccountTrigger: execution of BeforeUpdate

caused by: System.ListException: Duplicate id in list: 0011r00001tpjY6AAI

Trigger.AxtriaSalesIQTM.PositionAccountTrigger: line 76, column 1:--","Implicit","0011r00001tpmZxAAI","true","2019-04-28","2019-01-31","","","a2B1r00000BdBDMEA3","","","a2X1r000005JlG8EAK","a251r000005xQrEAAU"
"","CANNOT_INSERT_UPDATE_ACTIVATE_ENTITY:AxtriaSalesIQTM.PositionAccountTrigger: execution of BeforeUpdate

caused by: System.ListException: Duplicate id in list: 0011r00001tpjY6AAI

Trigger.AxtriaSalesIQTM.PositionAccountTrigger: line 76, column 1:--","Implicit","0011r00001tpmZxAAI","true","2019-04-28","2019-01-31","","","a2B1r00000BdBDGEA3","","","a2X1r000005JlG8EAK","a251r000005xQrFAAU"
"","CANNOT_INSERT_UPDATE_ACTIVATE_ENTITY:AxtriaSalesIQTM.PositionAccountTrigger: execution of BeforeUpdate

caused by: System.ListException: Duplicate id in list: 0011r00001tpjY6AAI

Trigger.AxtriaSalesIQTM.PositionAccountTrigger: line 76, column 1:--","Implicit","0011r00001tqChLAAU","true","2019-04-28","2019-01-31","","","a2B1r00000BdBBmEAN","","","a2X1r000005JlG8EAK","a251r000005xUQWAA2"
"","CANNOT_INSERT_UPDATE_ACTIVATE_ENTITY:AxtriaSalesIQTM.PositionAccountTrigger: execution of BeforeUpdate

caused by: System.ListException: Duplicate id in list: 0011r00001tpjY6AAI

Trigger.AxtriaSalesIQTM.PositionAccountTrigger: line 76, column 1:--","Implicit","0011r00001tqChLAAU","true","2019-04-28","2019-01-31","","","a2B1r00000BdBBfEAN","","","a2X1r000005JlG8EAK","a251r000005xUQXAA2"
"","CANNOT_INSERT_UPDATE_ACTIVATE_ENTITY:AxtriaSalesIQTM.PositionAccountTrigger: execution of BeforeUpdate

caused by: System.ListException: Duplicate id in list: 0011r00001tpjY6AAI

Trigger.AxtriaSalesIQTM.PositionAccountTrigger: line 76, column 1:--","Implicit","0011r00001tqChLAAU","true","2019-04-28","2019-01-31","","","a2B1r00000BdBBkEAN","","","a2X1r000005JlG8EAK","a251r000005xUQYAA2"
"","CANNOT_INSERT_UPDATE_ACTIVATE_ENTITY:AxtriaSalesIQTM.PositionAccountTrigger: execution of BeforeUpdate

caused by: System.ListException: Duplicate id in list: 0011r00001tpjY6AAI

Trigger.AxtriaSalesIQTM.PositionAccountTrigger: line 76, column 1:--","Implicit","0011r00001tq3BrAAI","true","2019-04-28","2019-01-31","","","a2B1r00000BdBCAEA3","","","a2X1r000005JlG8EAK","a251r000005xUTIAA2"
"","CANNOT_INSERT_UPDATE_ACTIVATE_ENTITY:AxtriaSalesIQTM.PositionAccountTrigger: execution of BeforeUpdate

caused by: System.ListException: Duplicate id in list: 0011r00001tpjY6AAI

Trigger.AxtriaSalesIQTM.PositionAccountTrigger: line 76, column 1:--","Implicit","0011r00001tq3BrAAI","true","2019-04-28","2019-01-31","","","a2B1r00000BdBC8EAN","","","a2X1r000005JlG8EAK","a251r000005xUTJAA2"
"","CANNOT_INSERT_UPDATE_ACTIVATE_ENTITY:AxtriaSalesIQTM.PositionAccountTrigger: execution of BeforeUpdate

caused by: System.ListException: Duplicate id in list: 0011r00001tpjY6AAI

Trigger.AxtriaSalesIQTM.PositionAccountTrigger: line 76, column 1:--","Implicit","0011r00001tq3BrAAI","true","2019-04-28","2019-01-31","","","a2B1r00000BdBC7EAN","","","a2X1r000005JlG8EAK","a251r000005xUTKAA2"
"","CANNOT_INSERT_UPDATE_ACTIVATE_ENTITY:AxtriaSalesIQTM.PositionAccountTrigger: execution of BeforeUpdate

caused by: System.ListException: Duplicate id in list: 0011r00001tpjY6AAI

Trigger.AxtriaSalesIQTM.PositionAccountTrigger: line 76, column 1:--","Implicit","0011r00001tpxsUAAQ","true","2019-04-28","2019-01-31","","","a2B1r00000BdBCiEAN","","","a2X1r000005JlG8EAK","a251r000005xYKjAAM"
"","CANNOT_INSERT_UPDATE_ACTIVATE_ENTITY:AxtriaSalesIQTM.PositionAccountTrigger: execution of BeforeUpdate

caused by: System.ListException: Duplicate id in list: 0011r00001tpjY6AAI

Trigger.AxtriaSalesIQTM.PositionAccountTrigger: line 76, column 1:--","Implicit","0011r00001tpxsUAAQ","true","2019-04-28","2019-01-31","","","a2B1r00000BdBCmEAN","","","a2X1r000005JlG8EAK","a251r000005xYKkAAM"
"","CANNOT_INSERT_UPDATE_ACTIVATE_ENTITY:AxtriaSalesIQTM.PositionAccountTrigger: execution of BeforeUpdate

caused by: System.ListException: Duplicate id in list: 0011r00001tpjY6AAI

Trigger.AxtriaSalesIQTM.PositionAccountTrigger: line 76, column 1:--","Implicit","0011r00001tqDbeAAE","true","2019-04-28","2019-01-31","","","a2B1r00000BdBE9EAN","","","a2X1r000005JlG8EAK","a251r000005xZjaAAE"
"","CANNOT_INSERT_UPDATE_ACTIVATE_ENTITY:AxtriaSalesIQTM.PositionAccountTrigger: execution of BeforeUpdate

caused by: System.ListException: Duplicate id in list: 0011r00001tpjY6AAI

Trigger.AxtriaSalesIQTM.PositionAccountTrigger: line 76, column 1:--","Implicit","0011r00001tqDbeAAE","true","2019-04-28","2019-01-31","","","a2B1r00000BdBECEA3","","","a2X1r000005JlG8EAK","a251r000005xZjbAAE"
"","CANNOT_INSERT_UPDATE_ACTIVATE_ENTITY:AxtriaSalesIQTM.PositionAccountTrigger: execution of BeforeUpdate

caused by: System.ListException: Duplicate id in list: 0011r00001tpjY6AAI

Trigger.AxtriaSalesIQTM.PositionAccountTrigger: line 76, column 1:--","Implicit","0011r00001tqDbeAAE","true","2019-04-28","2019-01-31","","","a2B1r00000BdBE5EAN","","","a2X1r000005JlG8EAK","a251r000005xZjcAAE"
"","CANNOT_INSERT_UPDATE_ACTIVATE_ENTITY:AxtriaSalesIQTM.PositionAccountTrigger: execution of BeforeUpdate

caused by: System.ListException: Duplicate id in list: 0011r00001tpjY6AAI

Trigger.AxtriaSalesIQTM.PositionAccountTrigger: line 76, column 1:--","Implicit","0011r00001tqIOaAAM","true","2019-04-28","2019-01-31","","","a2B1r00000BdBDJEA3","","","a2X1r000005JlG8EAK","a251r000005xaA0AAI"
"","CANNOT_INSERT_UPDATE_ACTIVATE_ENTITY:AxtriaSalesIQTM.PositionAccountTrigger: execution of BeforeUpdate

caused by: System.ListException: Duplicate id in list: 0011r00001tpjY6AAI

Trigger.AxtriaSalesIQTM.PositionAccountTrigger: line 76, column 1:--","Implicit","0011r00001tqIOaAAM","true","2019-04-28","2019-01-31","","","a2B1r00000BdBDGEA3","","","a2X1r000005JlG8EAK","a251r000005xaA1AAI"
"","CANNOT_INSERT_UPDATE_ACTIVATE_ENTITY:AxtriaSalesIQTM.PositionAccountTrigger: execution of BeforeUpdate

caused by: System.ListException: Duplicate id in list: 0011r00001tpjY6AAI

Trigger.AxtriaSalesIQTM.PositionAccountTrigger: line 76, column 1:--","Implicit","0011r00001tqIOaAAM","true","2019-04-28","2019-01-31","","","a2B1r00000BdBDMEA3","","","a2X1r000005JlG8EAK","a251r000005xaA2AAI"
"","CANNOT_INSERT_UPDATE_ACTIVATE_ENTITY:AxtriaSalesIQTM.PositionAccountTrigger: execution of BeforeUpdate

caused by: System.ListException: Duplicate id in list: 0011r00001tpjY6AAI

Trigger.AxtriaSalesIQTM.PositionAccountTrigger: line 76, column 1:--","Implicit","0011r00001tq96xAAA","true","2019-04-28","2019-01-31","","","a2B1r00000BdBBzEAN","","","a2X1r000005JlG8EAK","a251r000005xbcyAAA"
"","CANNOT_INSERT_UPDATE_ACTIVATE_ENTITY:AxtriaSalesIQTM.PositionAccountTrigger: execution of BeforeUpdate

caused by: System.ListException: Duplicate id in list: 0011r00001tpjY6AAI

Trigger.AxtriaSalesIQTM.PositionAccountTrigger: line 76, column 1:--","Implicit","0011r00001tq96xAAA","true","2019-04-28","2019-01-31","","","a2B1r00000BdBC1EAN","","","a2X1r000005JlG8EAK","a251r000005xbczAAA"
"","CANNOT_INSERT_UPDATE_ACTIVATE_ENTITY:AxtriaSalesIQTM.PositionAccountTrigger: execution of BeforeUpdate

caused by: System.ListException: Duplicate id in list: 0011r00001tpjY6AAI

Trigger.AxtriaSalesIQTM.PositionAccountTrigger: line 76, column 1:--","Implicit","0011r00001tq96xAAA","true","2019-04-28","2019-01-31","","","a2B1r00000BdBBvEAN","","","a2X1r000005JlG8EAK","a251r000005xbd0AAA"
"","CANNOT_INSERT_UPDATE_ACTIVATE_ENTITY:AxtriaSalesIQTM.PositionAccountTrigger: execution of BeforeUpdate

caused by: System.ListException: Duplicate id in list: 0011r00001tpjY6AAI

Trigger.AxtriaSalesIQTM.PositionAccountTrigger: line 76, column 1:--","Implicit","0011r00001tq9uwAAA","true","2019-04-28","2019-01-31","","","a2B1r00000BdBDMEA3","","","a2X1r000005JlG8EAK","a251r000005xgDmAAI"
"","CANNOT_INSERT_UPDATE_ACTIVATE_ENTITY:AxtriaSalesIQTM.PositionAccountTrigger: execution of BeforeUpdate

caused by: System.ListException: Duplicate id in list: 0011r00001tpjY6AAI

Trigger.AxtriaSalesIQTM.PositionAccountTrigger: line 76, column 1:--","Implicit","0011r00001tq9uwAAA","true","2019-04-28","2019-01-31","","","a2B1r00000BdBDHEA3","","","a2X1r000005JlG8EAK","a251r000005xgDnAAI"
"","CANNOT_INSERT_UPDATE_ACTIVATE_ENTITY:AxtriaSalesIQTM.PositionAccountTrigger: execution of BeforeUpdate

caused by: System.ListException: Duplicate id in list: 0011r00001tpjY6AAI

Trigger.AxtriaSalesIQTM.PositionAccountTrigger: line 76, column 1:--","Implicit","0011r00001tq9uwAAA","true","2019-04-28","2019-01-31","","","a2B1r00000BdBDKEA3","","","a2X1r000005JlG8EAK","a251r000005xgDoAAI"
"","CANNOT_INSERT_UPDATE_ACTIVATE_ENTITY:AxtriaSalesIQTM.PositionAccountTrigger: execution of BeforeUpdate

caused by: System.ListException: Duplicate id in list: 0011r00001tpjY6AAI

Trigger.AxtriaSalesIQTM.PositionAccountTrigger: line 76, column 1:--","Implicit","0011r00001tqHoJAAU","true","2019-04-28","2019-01-31","","","a2B1r00000BdBDEEA3","","","a2X1r000005JlG8EAK","a251r000005xUquAAE"
"","CANNOT_INSERT_UPDATE_ACTIVATE_ENTITY:AxtriaSalesIQTM.PositionAccountTrigger: execution of BeforeUpdate

caused by: System.ListException: Duplicate id in list: 0011r00001tpjY6AAI

Trigger.AxtriaSalesIQTM.PositionAccountTrigger: line 76, column 1:--","Implicit","0011r00001tqHoJAAU","true","2019-04-28","2019-01-31","","","a2B1r00000BdBDFEA3","","","a2X1r000005JlG8EAK","a251r000005xUqvAAE"
"","CANNOT_INSERT_UPDATE_ACTIVATE_ENTITY:AxtriaSalesIQTM.PositionAccountTrigger: execution of BeforeUpdate

caused by: System.ListException: Duplicate id in list: 0011r00001tpjY6AAI

Trigger.AxtriaSalesIQTM.PositionAccountTrigger: line 76, column 1:--","Implicit","0011r00001tqHoJAAU","true","2019-04-28","2019-01-31","","","a2B1r00000BdBDAEA3","","","a2X1r000005JlG8EAK","a251r000005xUqwAAE"
"","CANNOT_INSERT_UPDATE_ACTIVATE_ENTITY:AxtriaSalesIQTM.PositionAccountTrigger: execution of BeforeUpdate

caused by: System.ListException: Duplicate id in list: 0011r00001tpjY6AAI

Trigger.AxtriaSalesIQTM.PositionAccountTrigger: line 76, column 1:--","Implicit","0011r00001tpn75AAA","true","2019-04-28","2019-02-20","","","a2B1r00000BdBBvEAN","","","a2X1r000005JlG8EAK","a251r000006BCyeAAG"
"","CANNOT_INSERT_UPDATE_ACTIVATE_ENTITY:AxtriaSalesIQTM.PositionAccountTrigger: execution of BeforeUpdate

caused by: System.ListException: Duplicate id in list: 0011r00001tpjY6AAI

Trigger.AxtriaSalesIQTM.PositionAccountTrigger: line 76, column 1:--","Implicit","0011r00001tpn75AAA","true","2019-04-28","2019-02-20","","","a2B1r00000BdBBzEAN","","","a2X1r000005JlG8EAK","a251r000006BCyfAAG"
"","CANNOT_INSERT_UPDATE_ACTIVATE_ENTITY:AxtriaSalesIQTM.PositionAccountTrigger: execution of BeforeUpdate

caused by: System.ListException: Duplicate id in list: 0011r00001tpjY6AAI

Trigger.AxtriaSalesIQTM.PositionAccountTrigger: line 76, column 1:--","Implicit","0011r00001tpn75AAA","true","2019-04-28","2019-02-20","","","a2B1r00000BdBC1EAN","","","a2X1r000005JlG8EAK","a251r000006BCygAAG"
"","CANNOT_INSERT_UPDATE_ACTIVATE_ENTITY:AxtriaSalesIQTM.PositionAccountTrigger: execution of BeforeUpdate

caused by: System.ListException: Duplicate id in list: 0011r00001tpjY6AAI

Trigger.AxtriaSalesIQTM.PositionAccountTrigger: line 76, column 1:--","Implicit","0011r00001tq52BAAQ","true","2019-04-28","2019-01-31","","","a2B1r00000BdBBvEAN","","","a2X1r000005JlG8EAK","a251r000005svf2AAA"
"","CANNOT_INSERT_UPDATE_ACTIVATE_ENTITY:AxtriaSalesIQTM.PositionAccountTrigger: execution of BeforeUpdate

caused by: System.ListException: Duplicate id in list: 0011r00001tpjY6AAI

Trigger.AxtriaSalesIQTM.PositionAccountTrigger: line 76, column 1:--","Implicit","0011r00001tq52BAAQ","true","2019-04-28","2019-01-31","","","a2B1r00000BdBBzEAN","","","a2X1r000005JlG8EAK","a251r000005svf3AAA"
"","CANNOT_INSERT_UPDATE_ACTIVATE_ENTITY:AxtriaSalesIQTM.PositionAccountTrigger: execution of BeforeUpdate

caused by: System.ListException: Duplicate id in list: 0011r00001tpjY6AAI

Trigger.AxtriaSalesIQTM.PositionAccountTrigger: line 76, column 1:--","Implicit","0011r00001tq52BAAQ","true","2019-04-28","2019-01-31","","","a2B1r00000BdBC1EAN","","","a2X1r000005JlG8EAK","a251r000005svf4AAA"
"","CANNOT_INSERT_UPDATE_ACTIVATE_ENTITY:AxtriaSalesIQTM.PositionAccountTrigger: execution of BeforeUpdate

caused by: System.ListException: Duplicate id in list: 0011r00001tpjY6AAI

Trigger.AxtriaSalesIQTM.PositionAccountTrigger: line 76, column 1:--","Implicit","0011r00001tpt2lAAA","true","2019-04-28","2019-01-31","","","a2B1r00000BdBE5EAN","","","a2X1r000005JlG8EAK","a251r000005sznTAAQ"
"","CANNOT_INSERT_UPDATE_ACTIVATE_ENTITY:AxtriaSalesIQTM.PositionAccountTrigger: execution of BeforeUpdate

caused by: System.ListException: Duplicate id in list: 0011r00001tpjY6AAI

Trigger.AxtriaSalesIQTM.PositionAccountTrigger: line 76, column 1:--","Implicit","0011r00001tpt2lAAA","true","2019-04-28","2019-01-31","","","a2B1r00000BdBE9EAN","","","a2X1r000005JlG8EAK","a251r000005sznUAAQ"
"","CANNOT_INSERT_UPDATE_ACTIVATE_ENTITY:AxtriaSalesIQTM.PositionAccountTrigger: execution of BeforeUpdate

caused by: System.ListException: Duplicate id in list: 0011r00001tpjY6AAI

Trigger.AxtriaSalesIQTM.PositionAccountTrigger: line 76, column 1:--","Implicit","0011r00001tpt2lAAA","true","2019-04-28","2019-01-31","","","a2B1r00000BdBECEA3","","","a2X1r000005JlG8EAK","a251r000005sznVAAQ"
"","CANNOT_INSERT_UPDATE_ACTIVATE_ENTITY:AxtriaSalesIQTM.PositionAccountTrigger: execution of BeforeUpdate

caused by: System.ListException: Duplicate id in list: 0011r00001tpjY6AAI

Trigger.AxtriaSalesIQTM.PositionAccountTrigger: line 76, column 1:--","Implicit","0011r00001tqKEZAA2","true","2019-04-28","2019-01-31","","","a2B1r00000BdBBnEAN","","","a2X1r000005JlG8EAK","a251r000005xEqpAAE"
"","CANNOT_INSERT_UPDATE_ACTIVATE_ENTITY:AxtriaSalesIQTM.PositionAccountTrigger: execution of BeforeUpdate

caused by: System.ListException: Duplicate id in list: 0011r00001tpjY6AAI

Trigger.AxtriaSalesIQTM.PositionAccountTrigger: line 76, column 1:--","Implicit","0011r00001tqKEZAA2","true","2019-04-28","2019-01-31","","","a2B1r00000BdBBiEAN","","","a2X1r000005JlG8EAK","a251r000005xEqqAAE"
"","CANNOT_INSERT_UPDATE_ACTIVATE_ENTITY:AxtriaSalesIQTM.PositionAccountTrigger: execution of BeforeUpdate

caused by: System.ListException: Duplicate id in list: 0011r00001tpjY6AAI

Trigger.AxtriaSalesIQTM.PositionAccountTrigger: line 76, column 1:--","Implicit","0011r00001tpv2nAAA","true","2019-04-28","2019-01-31","","","a2B1r00000BdBCfEAN","","","a2X1r000005JlG8EAK","a251r000005xKC2AAM"
"","CANNOT_INSERT_UPDATE_ACTIVATE_ENTITY:AxtriaSalesIQTM.PositionAccountTrigger: execution of BeforeUpdate

caused by: System.ListException: Duplicate id in list: 0011r00001tpjY6AAI

Trigger.AxtriaSalesIQTM.PositionAccountTrigger: line 76, column 1:--","Implicit","0011r00001tpv2nAAA","true","2019-04-28","2019-01-31","","","a2B1r00000BdBCjEAN","","","a2X1r000005JlG8EAK","a251r000005xKC3AAM"
"","CANNOT_INSERT_UPDATE_ACTIVATE_ENTITY:AxtriaSalesIQTM.PositionAccountTrigger: execution of BeforeUpdate

caused by: System.ListException: Duplicate id in list: 0011r00001tpjY6AAI

Trigger.AxtriaSalesIQTM.PositionAccountTrigger: line 76, column 1:--","Implicit","0011r00001tq7IMAAY","true","2019-04-28","2019-01-31","","","a2B1r00000BdBD0EAN","","","a2X1r000005JlG8EAK","a251r000005xQE6AAM"
"","CANNOT_INSERT_UPDATE_ACTIVATE_ENTITY:AxtriaSalesIQTM.PositionAccountTrigger: execution of BeforeUpdate

caused by: System.ListException: Duplicate id in list: 0011r00001tpjY6AAI

Trigger.AxtriaSalesIQTM.PositionAccountTrigger: line 76, column 1:--","Implicit","0011r00001tq7IMAAY","true","2019-04-28","2019-01-31","","","a2B1r00000BdBD4EAN","","","a2X1r000005JlG8EAK","a251r000005xQE7AAM"
"","CANNOT_INSERT_UPDATE_ACTIVATE_ENTITY:AxtriaSalesIQTM.PositionAccountTrigger: execution of BeforeUpdate

caused by: System.ListException: Duplicate id in list: 0011r00001tpjY6AAI

Trigger.AxtriaSalesIQTM.PositionAccountTrigger: line 76, column 1:--","Implicit","0011r00001tq7IMAAY","true","2019-04-28","2019-01-31","","","a2B1r00000BdBD6EAN","","","a2X1r000005JlG8EAK","a251r000005xQE8AAM"
"","CANNOT_INSERT_UPDATE_ACTIVATE_ENTITY:AxtriaSalesIQTM.PositionAccountTrigger: execution of BeforeUpdate

caused by: System.ListException: Duplicate id in list: 0011r00001tpjY6AAI

Trigger.AxtriaSalesIQTM.PositionAccountTrigger: line 76, column 1:--","Implicit","0011r00001tpmZfAAI","true","2019-04-28","2019-01-31","","","a2B1r00000BdBCdEAN","","","a2X1r000005JlG8EAK","a251r000005xQJoAAM"
"","CANNOT_INSERT_UPDATE_ACTIVATE_ENTITY:AxtriaSalesIQTM.PositionAccountTrigger: execution of BeforeUpdate

caused by: System.ListException: Duplicate id in list: 0011r00001tpjY6AAI

Trigger.AxtriaSalesIQTM.PositionAccountTrigger: line 76, column 1:--","Implicit","0011r00001tpmZfAAI","true","2019-04-28","2019-01-31","","","a2B1r00000BdBCVEA3","","","a2X1r000005JlG8EAK","a251r000005xQJpAAM"
"","CANNOT_INSERT_UPDATE_ACTIVATE_ENTITY:AxtriaSalesIQTM.PositionAccountTrigger: execution of BeforeUpdate

caused by: System.ListException: Duplicate id in list: 0011r00001tpjY6AAI

Trigger.AxtriaSalesIQTM.PositionAccountTrigger: line 76, column 1:--","Implicit","0011r00001tpmZfAAI","true","2019-04-28","2019-01-31","","","a2B1r00000BdBCZEA3","","","a2X1r000005JlG8EAK","a251r000005xQJqAAM"
"","CANNOT_INSERT_UPDATE_ACTIVATE_ENTITY:AxtriaSalesIQTM.PositionAccountTrigger: execution of BeforeUpdate

caused by: System.ListException: Duplicate id in list: 0011r00001tpjY6AAI

Trigger.AxtriaSalesIQTM.PositionAccountTrigger: line 76, column 1:--","Implicit","0011r00001tq1QsAAI","true","2019-04-28","2019-03-23","","","a2B1r00000BdBCPEA3","","","a2X1r000005JlG8EAK","a251r000006bmMCAAY"
"","CANNOT_INSERT_UPDATE_ACTIVATE_ENTITY:AxtriaSalesIQTM.PositionAccountTrigger: execution of BeforeUpdate

caused by: System.ListException: Duplicate id in list: 0011r00001tpjY6AAI

Trigger.AxtriaSalesIQTM.PositionAccountTrigger: line 76, column 1:--","Implicit","0011r00001tq1QsAAI","true","2019-04-28","2019-03-23","","","a2B1r00000BdBCTEA3","","","a2X1r000005JlG8EAK","a251r000006bmMDAAY"
"","CANNOT_INSERT_UPDATE_ACTIVATE_ENTITY:AxtriaSalesIQTM.PositionAccountTrigger: execution of BeforeUpdate

caused by: System.ListException: Duplicate id in list: 0011r00001tpjY6AAI

Trigger.AxtriaSalesIQTM.PositionAccountTrigger: line 76, column 1:--","Implicit","0011r00001tpxb0AAA","true","2019-04-28","2019-03-28","","","a2B1r00000BdBBvEAN","","","a2X1r000005JlG8EAK","a251r000006wOPuAAM"
"","CANNOT_INSERT_UPDATE_ACTIVATE_ENTITY:AxtriaSalesIQTM.PositionAccountTrigger: execution of BeforeUpdate

caused by: System.ListException: Duplicate id in list: 0011r00001tpxb0AAA

Trigger.AxtriaSalesIQTM.PositionAccountTrigger: line 76, column 1:--","Implicit","0011r00001tpxb0AAA","true","2019-04-28","2019-03-28","","","a2B1r00000BdBBzEAN","","","a2X1r000005JlG8EAK","a251r000006wOPvAAM"
"","CANNOT_INSERT_UPDATE_ACTIVATE_ENTITY:AxtriaSalesIQTM.PositionAccountTrigger: execution of BeforeUpdate

caused by: System.ListException: Duplicate id in list: 0011r00001tpxb0AAA

Trigger.AxtriaSalesIQTM.PositionAccountTrigger: line 76, column 1:--","Implicit","0011r00001tpxb0AAA","true","2019-04-28","2019-03-28","","","a2B1r00000BdBC1EAN","","","a2X1r000005JlG8EAK","a251r000006wOPwAAM"
"","CANNOT_INSERT_UPDATE_ACTIVATE_ENTITY:AxtriaSalesIQTM.PositionAccountTrigger: execution of BeforeUpdate

caused by: System.ListException: Duplicate id in list: 0011r00001tpxb0AAA

Trigger.AxtriaSalesIQTM.PositionAccountTrigger: line 76, column 1:--","Implicit","0011r00001tqEhKAAU","true","2019-04-28","2019-03-28","","","a2B1r00000BdBCOEA3","","","a2X1r000005JlG8EAK","a251r000006wOubAAE"
"","CANNOT_INSERT_UPDATE_ACTIVATE_ENTITY:AxtriaSalesIQTM.PositionAccountTrigger: execution of BeforeUpdate

caused by: System.ListException: Duplicate id in list: 0011r00001tpxb0AAA

Trigger.AxtriaSalesIQTM.PositionAccountTrigger: line 76, column 1:--","Implicit","0011r00001tqEhKAAU","true","2019-04-28","2019-03-28","","","a2B1r00000BdBCSEA3","","","a2X1r000005JlG8EAK","a251r000006wOucAAE"
"","CANNOT_INSERT_UPDATE_ACTIVATE_ENTITY:AxtriaSalesIQTM.PositionAccountTrigger: execution of BeforeUpdate

caused by: System.ListException: Duplicate id in list: 0011r00001tpxb0AAA

Trigger.AxtriaSalesIQTM.PositionAccountTrigger: line 76, column 1:--","Implicit","0011r00001tqFHBAA2","true","2019-04-28","2019-03-28","","","a2B1r00000BdBBpEAN","","","a2X1r000005JlG8EAK","a251r000006wOx5AAE"
"","CANNOT_INSERT_UPDATE_ACTIVATE_ENTITY:AxtriaSalesIQTM.PositionAccountTrigger: execution of BeforeUpdate

caused by: System.ListException: Duplicate id in list: 0011r00001tpxb0AAA

Trigger.AxtriaSalesIQTM.PositionAccountTrigger: line 76, column 1:--","Implicit","0011r00001tqFHBAA2","true","2019-04-28","2019-03-28","","","a2B1r00000BdBBtEAN","","","a2X1r000005JlG8EAK","a251r000006wOx6AAE"
