"sf__Id","sf__Error",AxtriaSalesIQTM__Account_Alignment_Type__c,AxtriaSalesIQTM__Account__c,AxtriaSalesIQTM__Affiliation_Based_Alignment__c,AxtriaSalesIQTM__Effective_End_Date__c,AxtriaSalesIQTM__Effective_Start_Date__c,AxtriaSalesIQTM__IsShared__c,AxtriaSalesIQTM__Metric1__c,AxtriaSalesIQTM__Position__c,AxtriaSalesIQTM__Segment_1__c,AxtriaSalesIQTM__SharedWith__c,AxtriaSalesIQTM__Team_Instance__c
"","INSUFFICIENT_ACCESS_ON_CROSS_REFERENCE_ENTITY:insufficient access rights on cross-reference id: 0011r00002HGcwb:--","Implicit","0011r00002HGcwbAAD","true","","2019-05-01","","","a2B1r00000BdBN0EAN","","","a2X1r000005JltXEAS"
"","INSUFFICIENT_ACCESS_ON_CROSS_REFERENCE_ENTITY:insufficient access rights on cross-reference id: 0011r00002HGcwB:--","Implicit","0011r00002HGcwBAAT","true","","2019-05-01","","","a2B1r00000BdBN0EAN","","","a2X1r000005JltXEAS"
"","INSUFFICIENT_ACCESS_ON_CROSS_REFERENCE_ENTITY:insufficient access rights on cross-reference id: 0011r00002HGcwd:--","Implicit","0011r00002HGcwdAAD","true","","2019-05-01","","","a2B1r00000BdBN1EAN","","","a2X1r000005JltXEAS"
"","INSUFFICIENT_ACCESS_ON_CROSS_REFERENCE_ENTITY:insufficient access rights on cross-reference id: 0011r00002HGcwg:--","Implicit","0011r00002HGcwgAAD","true","","2019-05-01","","","a2B1r00000BdBN1EAN","","","a2X1r000005JltXEAS"
"","INSUFFICIENT_ACCESS_ON_CROSS_REFERENCE_ENTITY:insufficient access rights on cross-reference id: 0011r00002HGcwi:--","Implicit","0011r00002HGcwiAAD","true","","2019-05-01","","","a2B1r00000BdBN1EAN","","","a2X1r000005JltXEAS"
"","INSUFFICIENT_ACCESS_ON_CROSS_REFERENCE_ENTITY:insufficient access rights on cross-reference id: 0011r00002HGcwk:--","Implicit","0011r00002HGcwkAAD","true","","2019-05-01","","","a2B1r00000BdBN1EAN","","","a2X1r000005JltXEAS"
"","INSUFFICIENT_ACCESS_ON_CROSS_REFERENCE_ENTITY:insufficient access rights on cross-reference id: 0011r00002HGcwm:--","Implicit","0011r00002HGcwmAAD","true","","2019-05-01","","","a2B1r00000BdBN1EAN","","","a2X1r000005JltXEAS"
"","INSUFFICIENT_ACCESS_ON_CROSS_REFERENCE_ENTITY:insufficient access rights on cross-reference id: 0011r00002HGcwo:--","Implicit","0011r00002HGcwoAAD","true","","2019-05-01","","","a2B1r00000BdBN0EAN","","","a2X1r000005JltXEAS"
"","INSUFFICIENT_ACCESS_ON_CROSS_REFERENCE_ENTITY:insufficient access rights on cross-reference id: 0011r00002HGcwP:--","Implicit","0011r00002HGcwPAAT","true","","2019-05-01","","","a2B1r00000BdBN1EAN","","","a2X1r000005JltXEAS"
"","INSUFFICIENT_ACCESS_ON_CROSS_REFERENCE_ENTITY:insufficient access rights on cross-reference id: 0011r00002HGcwq:--","Implicit","0011r00002HGcwqAAD","true","","2019-05-01","","","a2B1r00000BdBN1EAN","","","a2X1r000005JltXEAS"
"","INSUFFICIENT_ACCESS_ON_CROSS_REFERENCE_ENTITY:insufficient access rights on cross-reference id: 0011r00002HGcwQ:--","Implicit","0011r00002HGcwQAAT","true","","2019-05-01","","","a2B1r00000BdBN1EAN","","","a2X1r000005JltXEAS"
"","INSUFFICIENT_ACCESS_ON_CROSS_REFERENCE_ENTITY:insufficient access rights on cross-reference id: 0011r00002HGcwR:--","Implicit","0011r00002HGcwRAAT","true","","2019-05-01","","","a2B1r00000BdBMzEAN","","","a2X1r000005JltXEAS"
"","INSUFFICIENT_ACCESS_ON_CROSS_REFERENCE_ENTITY:insufficient access rights on cross-reference id: 0011r00002HGcws:--","Implicit","0011r00002HGcwsAAD","true","","2019-05-01","","","a2B1r00000BdBN0EAN","","","a2X1r000005JltXEAS"
"","INSUFFICIENT_ACCESS_ON_CROSS_REFERENCE_ENTITY:insufficient access rights on cross-reference id: 0011r00002HGcwt:--","Implicit","0011r00002HGcwtAAD","true","","2019-05-01","","","a2B1r00000BdBMzEAN","","","a2X1r000005JltXEAS"
"","INSUFFICIENT_ACCESS_ON_CROSS_REFERENCE_ENTITY:insufficient access rights on cross-reference id: 0011r00002HGcwV:--","Implicit","0011r00002HGcwVAAT","true","","2019-05-01","","","a2B1r00000BdBN0EAN","","","a2X1r000005JltXEAS"
"","INSUFFICIENT_ACCESS_ON_CROSS_REFERENCE_ENTITY:insufficient access rights on cross-reference id: 0011r00002HGcwW:--","Implicit","0011r00002HGcwWAAT","true","","2019-05-01","","","a2B1r00000BdBN0EAN","","","a2X1r000005JltXEAS"
"","INSUFFICIENT_ACCESS_ON_CROSS_REFERENCE_ENTITY:insufficient access rights on cross-reference id: 0011r00002HGcwx:--","Implicit","0011r00002HGcwxAAD","true","","2019-05-01","","","a2B1r00000BdBN1EAN","","","a2X1r000005JltXEAS"
"","INSUFFICIENT_ACCESS_ON_CROSS_REFERENCE_ENTITY:insufficient access rights on cross-reference id: 0011r00002HGcwX:--","Implicit","0011r00002HGcwXAAT","true","","2019-05-01","","","a2B1r00000BdBN1EAN","","","a2X1r000005JltXEAS"
"","INSUFFICIENT_ACCESS_ON_CROSS_REFERENCE_ENTITY:insufficient access rights on cross-reference id: 0011r00002HGcwY:--","Implicit","0011r00002HGcwYAAT","true","","2019-05-01","","","a2B1r00000BdBN1EAN","","","a2X1r000005JltXEAS"
"","INSUFFICIENT_ACCESS_ON_CROSS_REFERENCE_ENTITY:insufficient access rights on cross-reference id: 0011r00002HGcwZ:--","Implicit","0011r00002HGcwZAAT","true","","2019-05-01","","","a2B1r00000BdBN1EAN","","","a2X1r000005JltXEAS"
"","INSUFFICIENT_ACCESS_ON_CROSS_REFERENCE_ENTITY:insufficient access rights on cross-reference id: 0011r00002HGcx0:--","Implicit","0011r00002HGcx0AAD","true","","2019-05-01","","","a2B1r00000BdBN0EAN","","","a2X1r000005JltXEAS"
"","INSUFFICIENT_ACCESS_ON_CROSS_REFERENCE_ENTITY:insufficient access rights on cross-reference id: 0011r00002HGcx2:--","Implicit","0011r00002HGcx2AAD","true","","2019-05-01","","","a2B1r00000BdBN0EAN","","","a2X1r000005JltXEAS"
"","INSUFFICIENT_ACCESS_ON_CROSS_REFERENCE_ENTITY:insufficient access rights on cross-reference id: 0011r00002HGcxB:--","Implicit","0011r00002HGcxBAAT","true","","2019-05-01","","","a2B1r00000BdBN1EAN","","","a2X1r000005JltXEAS"
"","INSUFFICIENT_ACCESS_ON_CROSS_REFERENCE_ENTITY:insufficient access rights on cross-reference id: 0011r00002HGcxC:--","Implicit","0011r00002HGcxCAAT","true","","2019-05-01","","","a2B1r00000BdBN0EAN","","","a2X1r000005JltXEAS"
"","INSUFFICIENT_ACCESS_ON_CROSS_REFERENCE_ENTITY:insufficient access rights on cross-reference id: 0011r00002HGcxE:--","Implicit","0011r00002HGcxEAAT","true","","2019-05-01","","","a2B1r00000BdBMzEAN","","","a2X1r000005JltXEAS"
"","INSUFFICIENT_ACCESS_ON_CROSS_REFERENCE_ENTITY:insufficient access rights on cross-reference id: 0011r00002HGcxM:--","Implicit","0011r00002HGcxMAAT","true","","2019-05-01","","","a2B1r00000BdBN0EAN","","","a2X1r000005JltXEAS"
