{
    "src_name": "MMIT",
    "object_name": "Medical Benefit Prior Authorization",
    "decription": "MEDICALPA: Detailed, categorized information related to medical benefit Prior\nAuthorization criteria",
    "frequency": null,
    "attributes": [
        {
            "actual_col_name": "ClientId",
            "business_name": "Client Id",
            "description": "MMIT Client Identifier",
            "data_type": "Integer"
        },
        {
            "actual_col_name": "Period",
            "business_name": "Period",
            "description": "Activity Period",
            "data_type": "Integer"
        },
        {
            "actual_col_name": "ClassName",
            "business_name": "Class Name",
            "description": "Product Class related to drug",
            "data_type": "Varchar(500)"
        },
        {
            "actual_col_name": "IndicationId",
            "business_name": "Indication Id",
            "description": "Indication Identifier",
            "data_type": "Integer"
        },
        {
            "actual_col_name": "IndicationName",
            "business_name": "Indication Name",
            "description": "Indication related to drug",
            "data_type": "Varchar(50)"
        },
        {
            "actual_col_name": "ProductId",
            "business_name": "Product Id",
            "description": "MMIT Product Identifier",
            "data_type": "Integer"
        },
        {
            "actual_col_name": "MedId",
            "business_name": "Med Id",
            "description": "First Data Bank Drug Identifier",
            "data_type": "Integer"
        },
        {
            "actual_col_name": "DrugName",
            "business_name": "Drug Name",
            "description": "Name of Drug",
            "data_type": "Varchar(500)"
        },
        {
            "actual_col_name": "FormularyId",
            "business_name": "Formulary Id",
            "description": "ID of Formulary associated with plan",
            "data_type": "Integer"
        },
        {
            "actual_col_name": "AppropriateRestrictiveStatus",
            "business_name": "Appropriate Restrictive Status",
            "description": "Is Restriction Appropriate or Restrictive to label",
            "data_type": "Char(2)"
        },
        {
            "actual_col_name": "Gender",
            "business_name": "Gender",
            "description": "Gender related restriction",
            "data_type": "Char(1)"
        },
        {
            "actual_col_name": "Age",
            "business_name": "Age",
            "description": "Age restriction",
            "data_type": "Integer"
        },
        {
            "actual_col_name": "AgeCompare",
            "business_name": "Age Compare",
            "description": "Is Age restriction greater than (GT) or less than (LT)",
            "data_type": "Char(2)"
        },
        {
            "actual_col_name": "Duration",
            "business_name": "Duration",
            "description": "Duration",
            "data_type": "Integer"
        },
        {
            "actual_col_name": "DurationUnit",
            "business_name": "Duration Unit",
            "description": "Duration Unit Months (M) or Days (D)",
            "data_type": "Char(1)"
        },
        {
            "actual_col_name": "IsSpecialty",
            "business_name": "Is Specialty",
            "description": "Is a specialist required?",
            "data_type": "Integer"
        },
        {
            "actual_col_name": "IsStepWithinPA",
            "business_name": "Is Step Within PA",
            "description": "Does a Step within the PA exist?",
            "data_type": "Integer"
        },
        {
            "actual_col_name": "IsMedicareBvsD",
            "business_name": "Is Medicare B vs D",
            "description": "Is the PA only used to determine if the claim should process through the pharmacy or medical benefit based on patient location AND absolutely no other criteria exists",
            "data_type": "Integer"
        },
        {
            "actual_col_name": "ProcessingDate",
            "business_name": "Processing Date",
            "description": "Date Processed for Export",
            "data_type": "Timestamp"
        }
    ]
}