{
    "src_name": "LASH",
    "object_name": "Services",
    "decription": "This file will contain information about completed (closed) services provided to patients under the  Drug Ready and Corlanor Ready programs included in the Patient_Status file as well as any non-patient specific services provided to any providers or sites.",
    "frequency": "Weekly",
    "attributes": [
        {
            "actual_col_name": "Service_ID",
            "business_name": "Service ID",
            "description": "Unique identifier of the service.",
            "data_type": "Decimal(10,0)"
        },
        {
            "actual_col_name": "Service_Provided_To",
            "business_name": "Service Provided To",
            "description": "Indicates who the service was provided to.",
            "data_type": "Varchar(10)"
        },
        {
            "actual_col_name": "Record_ID",
            "business_name": "Record ID",
            "description": "Unique identifier of the patient or provider to whom the service was provided.",
            "data_type": "Varchar(8)"
        },
        {
            "actual_col_name": "Service_Name",
            "business_name": "Service Name",
            "description": "Description of the service.",
            "data_type": "Varchar(50)"
        },
        {
            "actual_col_name": "Payer_Name",
            "business_name": "Payer Name",
            "description": "Name of the insurance company associated with the service.",
            "data_type": "Varchar(50)"
        },
        {
            "actual_col_name": "Opened_Date",
            "business_name": "Opened Date",
            "description": "Date that the service was started.\nFormat: YYYY-MM-DD",
            "data_type": "Date"
        },
        {
            "actual_col_name": "Closed_Date",
            "business_name": "Closed Date",
            "description": "Date that the service was completed.\nFormat: YYYY-MM-DD",
            "data_type": "Date"
        },
        {
            "actual_col_name": "Program_Name",
            "business_name": "Program Name",
            "description": "Name of the program under which the service was provided.",
            "data_type": "Varchar(50)"
        },
        {
            "actual_col_name": "Product_Name",
            "business_name": "Product Name",
            "description": "Name of the product for which the service was provided.",
            "data_type": "Varchar(50)"
        },
        {
            "actual_col_name": "Outcome",
            "business_name": "Outcome",
            "description": "Outcome of the service.",
            "data_type": "Varchar(50)"
        },
        {
            "actual_col_name": "Outcome_Explanation_1",
            "business_name": "Outcome Explanation 1",
            "description": "Additional information about the service outccome.",
            "data_type": "Varchar(50)"
        },
        {
            "actual_col_name": "Outcome_Explanation_2",
            "business_name": "Outcome Explanation 2",
            "description": "Additional information about the service Outcome_Explanation_1.",
            "data_type": "Varchar(50)"
        },
        {
            "actual_col_name": "Site_Of_Service",
            "business_name": "Site Of Service",
            "description": "Location where the service was provided.",
            "data_type": "Varchar(50)"
        }
    ]
}