{
    "src_name": "HCOS",
    "object_name": "Class of Trade",
    "decription": "This dimension table contains a list of all possible classes of trade (COT) that a business could have. The class of trade structure consists of three tiers -- Classification, Facility Type and Specialty.",
    "frequency": "Weekly",
    "attributes": [
        {
            "actual_col_name": "cot_id",
            "business_name": "Cot Id",
            "description": "A cot_id is the unique numeric identifier for a full class-of-trade record, including the COT business classification, facility type and specialty type.",
            "data_type": "Integer"
        },
        {
            "actual_col_name": "classification_id",
            "business_name": "Classification Id",
            "description": "A classification_id is the numeric identifier corresponding to a class-of-trade business classification.",
            "data_type": "Integer"
        },
        {
            "actual_col_name": "classification",
            "business_name": "Classification",
            "description": "Classification displays the description of a broad grouping of class-of-trade business classifications.",
            "data_type": "Varchar(2)"
        },
        {
            "actual_col_name": "facility_type_id",
            "business_name": "Facility Type Id",
            "description": "A facility_type_id is the numeric identifier corresponding to the class-of-trade business facility type.",
            "data_type": "Integer"
        },
        {
            "actual_col_name": "facility_type",
            "business_name": "Facility Type",
            "description": "Facility_type displays the description of a class-of-trade business facility type.",
            "data_type": "Varchar(2)"
        },
        {
            "actual_col_name": "specialty_id",
            "business_name": "Specialty Id",
            "description": "A specialty_id is the numeric identifier corresponding to a class-of-trade business specialty.",
            "data_type": "Integer"
        },
        {
            "actual_col_name": "specialty",
            "business_name": "Specialty",
            "description": "Specialty displays the description of the class-of-trade business specialty.",
            "data_type": "Varchar(2)"
        },
        {
            "actual_col_name": "record_type",
            "business_name": "Record Type",
            "description": "A record_type is a numeric indicator for a kind of",
            "data_type": "Varchar(2)"
        }
    ]
}