{
    "src_name": "HCOS",
    "object_name": "Business Detail Fact",
    "decription": "This fact table contains information about a business in addition to what is stored in the core Business table. Depending on the type of business detail being queried, this table will store the result in the detail_value field if it is a text value or in the detail_count field if it is a numeric value.",
    "frequency": "Weekly",
    "attributes": [
        {
            "actual_col_name": "ims_org_id",
            "business_name": "Ims Org Id",
            "description": "The unique alphanumeric identifier for a business.",
            "data_type": "Varchar(11)"
        },
        {
            "actual_col_name": "detail_id",
            "business_name": "Detail Id",
            "description": "A detail_id is the numeric identifier for a detail record.",
            "data_type": "Integer"
        },
        {
            "actual_col_name": "detail_value",
            "business_name": "Detail Value",
            "description": "Detail_value displays the value for the detail if it is a text, non-numeric value, such as a year, Y, or N.",
            "data_type": "Varchar(100)"
        },
        {
            "actual_col_name": "detail_count",
            "business_name": "Detail Count",
            "description": "Detail_count displays the numeric value for the detail, such as a count.",
            "data_type": "Decimal"
        }
    ]
}