{
    "src_name": "Axtria SalesIQ",
    "object_name": "Team",
    "decription": "This file will contain Team details.",
    "frequency": "Weekly",
    "attributes": [
        {
            "actual_col_name": "name",
            "business_name": "Name",
            "description": "Name",
            "data_type": "Varchar(150)"
        },
        {
            "actual_col_name": "base_team_name_c",
            "business_name": "Base Team Name ",
            "description": "Base Team Name ",
            "data_type": "Varchar(150)"
        },
        {
            "actual_col_name": "business_unit_c",
            "business_name": "Business Unit ",
            "description": "Business Unit ",
            "data_type": "Varchar(150)"
        },
        {
            "actual_col_name": "controlling_team_c",
            "business_name": "Controlling Team ",
            "description": "Controlling Team ",
            "data_type": "Varchar(150)"
        },
        {
            "actual_col_name": "effective_end_date_c",
            "business_name": "Effective End Date ",
            "description": "Effective End Date ",
            "data_type": "Date"
        },
        {
            "actual_col_name": "effective_start_date_c",
            "business_name": "Effective Start Date ",
            "description": "Effective Start Date ",
            "data_type": "Date"
        },
        {
            "actual_col_name": "type_c",
            "business_name": "Type ",
            "description": "Type ",
            "data_type": "Varchar(100)"
        },
        {
            "actual_col_name": "ismirror_c",
            "business_name": "Is Mirror ",
            "description": "Is Mirror ",
            "data_type": "Integer"
        },
        {
            "actual_col_name": "issales_c",
            "business_name": "Is sales ",
            "description": "Is sales ",
            "data_type": "Integer"
        },
        {
            "actual_col_name": "isfootprintapplicable_c",
            "business_name": "Is Footprint Applicable ",
            "description": "Is Footprint Applicable ",
            "data_type": "Integer"
        }
    ]
}