{
    "src_name": "Veeva",
    "object_name": "Zip to Terr",
    "decription": "zip to terr alignment information",
    "frequency": null,
    "attributes": [
        {
            "actual_col_name": "CreatedById",
            "business_name": "Created By ID",
            "description": "Created By ID",
            "data_type": "Varchar(256)"
        },
        {
            "actual_col_name": "CreatedDate",
            "business_name": "Created Date",
            "description": "Created Date",
            "data_type": "Timestamp"
        },
        {
            "actual_col_name": "Id",
            "business_name": "Record ID",
            "description": "Record ID",
            "data_type": "Varchar(18)"
        },
        {
            "actual_col_name": "IsDeleted",
            "business_name": "Deleted",
            "description": "Deleted",
            "data_type": "Char(4)"
        },
        {
            "actual_col_name": "IsLocked",
            "business_name": "Is Locked",
            "description": "Is Locked",
            "data_type": "Char(4)"
        },
        {
            "actual_col_name": "LastModifiedById",
            "business_name": "Last Modified By ID",
            "description": "Last Modified By ID",
            "data_type": "Varchar(18)"
        },
        {
            "actual_col_name": "LastModifiedDate",
            "business_name": "Last Modified Date",
            "description": "Last Modified Date",
            "data_type": "Timestamp"
        },
        {
            "actual_col_name": "MayEdit",
            "business_name": "May Edit",
            "description": "May Edit",
            "data_type": "Char(4)"
        },
        {
            "actual_col_name": "Name",
            "business_name": "Zip Code",
            "description": "Zip Code",
            "data_type": "Varchar(256)"
        },
        {
            "actual_col_name": "OwnerId",
            "business_name": "Owner ID",
            "description": "Owner ID",
            "data_type": "Varchar(18)"
        },
        {
            "actual_col_name": "SystemModstamp",
            "business_name": "System Modstamp",
            "description": "System Modstamp",
            "data_type": "Timestamp"
        },
        {
            "actual_col_name": "Territory_vod__c",
            "business_name": "Territories",
            "description": "Territories",
            "data_type": "Varchar(256)"
        },
        {
            "actual_col_name": "Zip_ID_vod__c",
            "business_name": "Zip ID",
            "description": "Zip ID",
            "data_type": "Varchar(80)"
        },
        {
            "actual_col_name": "Territory_MASTER_HER__c",
            "business_name": "Territory MASTER",
            "description": "Territory MASTER",
            "data_type": "Varchar(256)"
        },
        {
            "actual_col_name": "External_ID_HER__c",
            "business_name": "External ID",
            "description": "External ID",
            "data_type": "Varchar(25)"
        },
        {
            "actual_col_name": "MarketAccess_Territory_HER__c",
            "business_name": "MarketAccess Territory",
            "description": "MarketAccess Territory",
            "data_type": "Varchar(25)"
        },
        {
            "actual_col_name": "MSL_Territory_HER__c",
            "business_name": "MSL Territory",
            "description": "MSL Territory",
            "data_type": "Varchar(25)"
        },
        {
            "actual_col_name": "Sales_Territory_HER__c",
            "business_name": "Sales Territory",
            "description": "Sales Territory",
            "data_type": "Varchar(25)"
        }
    ]
}