<?xml version="1.0" encoding="UTF-8"?>
<svg width="60px" height="60px" viewBox="0 0 60 60" version="1.1" xmlns="http://www.w3.org/2000/svg" xmlns:xlink="http://www.w3.org/1999/xlink">
    <!-- Generator: Sketch 62 (91390) - https://sketch.com -->
    <title>Compass</title>
    <desc>Created with Sketch.</desc>
    <g id="Compass" stroke="none" stroke-width="1" fill="none" fill-rule="evenodd">
        <path d="M8.5,29.9994759 C8.5,24.0720037 10.9113183,18.6971876 14.8043734,14.8041944 C18.6973187,10.9113109 24.0720852,8.5 29.9998253,8.5 C35.9275922,8.5 41.3024658,10.9113319 45.1955022,14.8042447 C49.0886144,18.6972332 51.5,24.0720282 51.5,29.9994759 C51.5,35.9272166 49.088573,41.3022296 45.1954785,45.1953859 C41.3023927,49.0885336 35.9274765,51.5 29.9998253,51.5 C24.0722009,51.5 18.6973918,49.0885546 14.804397,45.1954362 C10.9113597,41.3022752 8.5,35.9272412 8.5,29.9994759 Z M51.1304481,29.9994759 C51.1304481,24.1737698 48.760894,18.8912153 44.9346925,15.0651393 C41.1084062,11.2389786 35.8255747,8.86953018 29.9998253,8.86953018 C24.1741416,8.86953018 18.891452,11.239012 15.0652633,15.0651399 C11.2390717,18.8912706 8.86955193,24.1738808 8.86955193,29.9994759 C8.86955193,35.8252268 11.2390558,41.1079062 15.0652217,44.9340761 C18.891414,48.7602725 24.1741207,51.1297711 29.9998253,51.1297711 C35.8255511,51.1297711 41.1083646,48.7602544 44.9346481,44.9340317 C48.760876,41.1078646 51.1304481,35.8252033 51.1304481,29.9994759 Z M46.5811425,29.9722251 C46.5811425,34.5435617 44.721274,38.6888044 41.7188064,41.6912857 C38.7163706,44.6937353 34.5711863,46.5536203 29.9998253,46.5536203 C25.4284672,46.5536203 21.2833687,44.6938239 18.2810189,41.6914604 C15.2786374,38.6890652 13.4188575,34.5439083 13.4188575,29.9725745 C13.4188575,25.4012682 15.278616,21.2562185 18.2809678,18.2539143 C21.2833225,15.2516073 25.4284424,13.3918779 29.9998253,13.3918779 C34.5712605,13.3918779 38.7165089,15.2515615 41.7189596,18.2538417 C44.7213383,21.2560499 46.5811425,25.4009711 46.5811425,29.9722251 Z M30.1199668,46.1800512 C34.5415675,46.1473144 38.5472886,44.3365549 41.4556119,41.4282777 C44.3639478,38.519988 46.1746404,34.5144087 46.2071805,30.0930555 L42.8394183,29.8527922 L46.2071806,29.8527922 C46.174621,25.4310687 44.3640185,21.4253227 41.4557397,18.5169553 C38.5474681,15.6085951 34.5417584,13.797841 30.1199668,13.7650978 L29.8796838,17.8535783 L29.8796838,13.7650978 C25.4578779,13.797841 21.4520563,15.608614 18.5436894,18.5170021 C15.6353461,21.4253667 13.8246729,25.4310939 13.7921211,29.8527922 L17.1602323,30.0930555 L13.7920986,30.0930555 C13.8248421,34.514625 15.6355541,38.5202124 18.5439076,41.4284523 C21.4522204,44.3366515 25.4579114,46.147301 29.8796838,46.1800515 L30.1199668,42.7986954 L30.1199668,46.1800512 Z M33.3477103,33.29663 L24.0624733,35.7840696 L26.5502721,26.4986392 L35.835509,24.0111996 L33.3477103,33.29663 Z M32.8394843,33.0497391 L26.796439,27.007228 L24.5849062,35.261675 L32.8394843,33.0497391 Z M27.0578087,26.7459332 L33.100889,32.7880412 L35.3119965,24.5335463 L27.0578087,26.7459332 Z" id="Combined-Shape" stroke="#000000" fill="#000000"></path>
    </g>
</svg>