<svg xmlns="http://www.w3.org/2000/svg" xmlns:xlink="http://www.w3.org/1999/xlink" width="54" height="54" viewBox="0 0 54 54">
  <defs>
    <clipPath id="clip-path">
      <path id="Mask" d="M27,54A26.935,26.935,0,0,1,0,27,27.027,27.027,0,0,1,46.11,7.889,27,27,0,0,1,27,54ZM27,6.749A20.25,20.25,0,1,0,47.249,27,20.273,20.273,0,0,0,27,6.749Zm4.5,31.5h-9a1.032,1.032,0,0,1-1.124-1.012v-2.25A1.22,1.22,0,0,1,22.5,33.75a1.033,1.033,0,0,0,1.126-1.012v-4.5A1.22,1.22,0,0,0,22.5,27a1.032,1.032,0,0,1-1.124-1.012v-2.25A1.22,1.22,0,0,1,22.5,22.5h6.749a1.233,1.233,0,0,1,1.126,1.237v9A1.038,1.038,0,0,0,31.5,33.75a1.232,1.232,0,0,1,1.124,1.237v2.25A1.037,1.037,0,0,1,31.5,38.25ZM27,20.363a3.376,3.376,0,1,1,3.376-3.376A3.3,3.3,0,0,1,27,20.363Z" transform="translate(-0.44 0)"/>
    </clipPath>
  </defs>
  <g id="Icons_z-embedded_icon_glyphs_utility_info_alt" data-name="Icons / z-embedded / icon glyphs / utility /info_alt" transform="translate(0.44 0.4)" opacity="0.55">
    <path id="Mask-2" data-name="Mask" d="M27,54A26.935,26.935,0,0,1,0,27,27.027,27.027,0,0,1,46.11,7.889,27,27,0,0,1,27,54ZM27,6.749A20.25,20.25,0,1,0,47.249,27,20.273,20.273,0,0,0,27,6.749Zm4.5,31.5h-9a1.032,1.032,0,0,1-1.124-1.012v-2.25A1.22,1.22,0,0,1,22.5,33.75a1.033,1.033,0,0,0,1.126-1.012v-4.5A1.22,1.22,0,0,0,22.5,27a1.032,1.032,0,0,1-1.124-1.012v-2.25A1.22,1.22,0,0,1,22.5,22.5h6.749a1.233,1.233,0,0,1,1.126,1.237v9A1.038,1.038,0,0,0,31.5,33.75a1.232,1.232,0,0,1,1.124,1.237v2.25A1.037,1.037,0,0,1,31.5,38.25ZM27,20.363a3.376,3.376,0,1,1,3.376-3.376A3.3,3.3,0,0,1,27,20.363Z" transform="translate(-0.44 -0.4)"/>
    <g id="Group_3065" data-name="Group 3065" transform="translate(0 -0.4)" clip-path="url(#clip-path)">
      <g id="Color" transform="translate(-4.869 0)">
        <rect id="Rectangle" width="58" height="58" transform="translate(0.429 0)" fill="#706e6b"/>
      </g>
    </g>
  </g>
</svg>
