{
    "src_name": "MDM Product",
    "object_name": "Product",
    "decription": "Contains Product Details",
    "frequency": "Weekly",
    "attributes": [
        {
            "actual_col_name": "prod_id",
            "business_name": "Product Identifier",
            "description": "MDM Surrogate Key for Product",
            "data_type": "Varchar(20)"
        },
        {
            "actual_col_name": "prod_mstr_id",
            "business_name": "Product Master Identifier",
            "description": "Reltio Surrogate Key for Product",
            "data_type": "Varchar(20)"
        },
        {
            "actual_col_name": "brnd_nm",
            "business_name": "Brand Name",
            "description": "Brand Name\nHALDOL",
            "data_type": "Varchar(50)"
        },
        {
            "actual_col_name": "chem_nm",
            "business_name": "Chemical Name",
            "description": "Chemical Name\nHaloperidol",
            "data_type": "Varchar(100)"
        },
        {
            "actual_col_name": "prod_fmly_cd",
            "business_name": "Product Family Code",
            "description": "Product Family Code\n73",
            "data_type": "Varchar(5)"
        },
        {
            "actual_col_name": "prod_fmly_nm",
            "business_name": "Product Family Name",
            "description": "Product Family Name\nHALDOL",
            "data_type": "Varchar(20)"
        },
        {
            "actual_col_name": "prod_cd",
            "business_name": "Product Code",
            "description": "Product Code\nHALDL",
            "data_type": "Varchar(10)"
        },
        {
            "actual_col_name": "prod_desc",
            "business_name": "Product Description",
            "description": "Product Description\nHALDOL INJECTION 10X1CC",
            "data_type": "Varchar(100)"
        },
        {
            "actual_col_name": "prod_strn_cd",
            "business_name": "Product Strength Code",
            "description": "Product Strength Code\n948",
            "data_type": "Varchar(5)"
        },
        {
            "actual_col_name": "prod_strn",
            "business_name": "Product Strength",
            "description": "Product Strength\n5MG/ML AMP WET",
            "data_type": "Varchar(20)"
        },
        {
            "actual_col_name": "prod_gnrc_nm",
            "business_name": "Product Generic Name",
            "description": "Product Generic Name\nHALOPERIdentifierOL LACTATE,5 MG,INJECTABLE",
            "data_type": "Varchar(100)"
        },
        {
            "actual_col_name": "prod_lbl_cd",
            "business_name": "Product Label Code",
            "description": "Product Label Code\n780",
            "data_type": "Varchar(5)"
        },
        {
            "actual_col_name": "prod_lbl_desc",
            "business_name": "Product Label Description",
            "description": "Product Label Description\nHALDOL LACTATE 5MG 5MG/ML AMP WET",
            "data_type": "Varchar(100)"
        },
        {
            "actual_col_name": "prod_form",
            "business_name": "Product Form",
            "description": "Product Form\nTAB,CAP",
            "data_type": "Varchar(20)"
        },
        {
            "actual_col_name": "prod_frmltn_cd",
            "business_name": "Product Formulation Code",
            "description": "Product Formulation Code\nDDA",
            "data_type": "Varchar(5)"
        },
        {
            "actual_col_name": "prod_frmltn_desc",
            "business_name": "Product Formulation Description",
            "description": "Product Formulation Description\nDDA DERM,SOAP",
            "data_type": "Varchar(20)"
        },
        {
            "actual_col_name": "prod_frmltn_lvl",
            "business_name": "Product Formulation Level",
            "description": "Product Formulation Level\n1,2,3",
            "data_type": "Integer"
        },
        {
            "actual_col_name": "prod_pkg_sz_cd",
            "business_name": "Product Package Size Code",
            "description": "Product Package Size Code\n120",
            "data_type": "Varchar(5)"
        },
        {
            "actual_col_name": "prod_pkg_sz_desc",
            "business_name": "Product Package Size Description",
            "description": "Product Package Size Description\n30 tablets,7 capsules",
            "data_type": "Varchar(20)"
        },
        {
            "actual_col_name": "prod_pkg_typ_cd",
            "business_name": "Product Package Type Code",
            "description": "Product Package Type Code\n130",
            "data_type": "Varchar(5)"
        },
        {
            "actual_col_name": "prod_pkg_typ_desc",
            "business_name": "Product Package Type Description",
            "description": "Product Package Type Description\nVIAL,BOX,BOTTLE etc",
            "data_type": "Varchar(20)"
        },
        {
            "actual_col_name": "prod_pkg_qty",
            "business_name": "Product Package Quantity",
            "description": "Product Package Quantity\n10,20",
            "data_type": "Integer"
        },
        {
            "actual_col_name": "prod_typ",
            "business_name": "Product Type",
            "description": "Product Type\nPromotional, Detail Group,Market etc",
            "data_type": "Varchar(20)"
        },
        {
            "actual_col_name": "repkg_flg",
            "business_name": "Repackage Flag",
            "description": "Indicates product repackaged or not.\nY-Repackaged, N-Not Repackaged",
            "data_type": "Char(1)"
        },
        {
            "actual_col_name": "ndc",
            "business_name": "National Drug Code",
            "description": "National Drug Code, is a unique 10-digit, 3-segment number. It is a universal product identifier for human drugs in the United States.",
            "data_type": "Varchar(10)"
        },
        {
            "actual_col_name": "injctbl_dlvr_sys_cd",
            "business_name": "Injectable Delivery System Code",
            "description": "Injectable Delivery System Code\n013",
            "data_type": "Varchar(5)"
        },
        {
            "actual_col_name": "injctbl_dlvr_sys_nm",
            "business_name": "Injectable Delivery System Name",
            "description": "Injectable Delivery System Name\nCARTRIDGES,BOTTLES/BAGS, LARGE VOLUME,AMPOULES",
            "data_type": "Varchar(20)"
        },
        {
            "actual_col_name": "injectbl_dlvr_sys_lvl",
            "business_name": "Injectable Delivery System Level",
            "description": "Injectable Delivery System Level\n1,2,3",
            "data_type": "Integer"
        },
        {
            "actual_col_name": "actv_ind",
            "business_name": "Active Indicator",
            "description": "Indicates whether product is active or Inactive.",
            "data_type": "Char(1)"
        },
        {
            "actual_col_name": "src_cd",
            "business_name": "Source Code",
            "description": "Product Source Code\nCARS,FIA etc",
            "data_type": "Varchar(20)"
        },
        {
            "actual_col_name": "cmmnt",
            "business_name": "Comments",
            "description": "Comments",
            "data_type": "Varchar(200)"
        },
        {
            "actual_col_name": "efftv_dt",
            "business_name": "Effective Date",
            "description": "Product Effective Date",
            "data_type": "Date"
        },
        {
            "actual_col_name": "end_dt",
            "business_name": "End Date",
            "description": "Product End Date",
            "data_type": "Date"
        },
        {
            "actual_col_name": "last_updt_dt",
            "business_name": "Last Update Date",
            "description": "Last Update Date",
            "data_type": "Date"
        },
        {
            "actual_col_name": "trans_set_ctrl_num",
            "business_name": "Transaction Set Control Number",
            "description": "Transaction set ctrl num",
            "data_type": "Integer"
        },
        {
            "actual_col_name": "trans_set_purp_code",
            "business_name": "Transaction Set Purpose Code",
            "description": "Transaction set purp code",
            "data_type": "Varchar(100)"
        },
        {
            "actual_col_name": "trans_type_code",
            "business_name": "Transaction Type Code",
            "description": "Transaction type code",
            "data_type": "Varchar(100)"
        },
        {
            "actual_col_name": "trans_date",
            "business_name": "Transaction Date",
            "description": "Transaction date",
            "data_type": "Timestamp"
        },
        {
            "actual_col_name": "trans_memo_id_qual",
            "business_name": "Transaction Memo ID Qual",
            "description": "Transaction memo Identifier qual",
            "data_type": "Integer"
        },
        {
            "actual_col_name": "trans_memo_id",
            "business_name": "Transaction Memo ID",
            "description": "Transaction memo Identifier",
            "data_type": "Integer"
        },
        {
            "actual_col_name": "cb_num",
            "business_name": "Cb Number",
            "description": "cb num",
            "data_type": "Integer"
        },
        {
            "actual_col_name": "mbr_cust_num",
            "business_name": "Mbr Customer Number",
            "description": "mbr cust num",
            "data_type": "Varchar(100)"
        },
        {
            "actual_col_name": "grp_num",
            "business_name": "Group Number",
            "description": "grp num",
            "data_type": "Varchar(100)"
        },
        {
            "actual_col_name": "con_seq_num",
            "business_name": "Con Sequence Number",
            "description": "con seq num",
            "data_type": "Integer"
        },
        {
            "actual_col_name": "con_exp_date",
            "business_name": "Con Expiry Date",
            "description": "con exp date",
            "data_type": "Timestamp"
        },
        {
            "actual_col_name": "con_eff_date",
            "business_name": "Con Effective Date",
            "description": "con eff date",
            "data_type": "Timestamp"
        },
        {
            "actual_col_name": "wh_memo_num",
            "business_name": "Wh Memo Number",
            "description": "wh memo num",
            "data_type": "Integer"
        },
        {
            "actual_col_name": "ship_from_bustype",
            "business_name": "Ship From Bustype",
            "description": "ship from bustype",
            "data_type": "Varchar(100)"
        },
        {
            "actual_col_name": "ship_from_id_qual",
            "business_name": "Ship From Id Qual",
            "description": "ship from Identifier qual",
            "data_type": "Varchar(100)"
        },
        {
            "actual_col_name": "ship_from_id",
            "business_name": "Ship From ID",
            "description": "ship from Identifier",
            "data_type": "Varchar(100)"
        },
        {
            "actual_col_name": "ship_from_name",
            "business_name": "Ship From Name",
            "description": "ship from name",
            "data_type": "Varchar(150)"
        },
        {
            "actual_col_name": "ship_from_address1",
            "business_name": "Ship From Address1",
            "description": "ship from address1",
            "data_type": "Varchar(150)"
        },
        {
            "actual_col_name": "ship_from_address2",
            "business_name": "Ship From Address2",
            "description": "ship from address2",
            "data_type": "Varchar(150)"
        },
        {
            "actual_col_name": "ship_from_city",
            "business_name": "Ship From City",
            "description": "ship from city",
            "data_type": "Varchar(150)"
        },
        {
            "actual_col_name": "ship_from_state",
            "business_name": "Ship From State",
            "description": "ship from state",
            "data_type": "Varchar(10)"
        },
        {
            "actual_col_name": "ship_from_zip",
            "business_name": "Ship From Zip",
            "description": "ship from zip",
            "data_type": "Varchar(10)"
        },
        {
            "actual_col_name": "rdate_start",
            "business_name": "Rdate Start",
            "description": "rdate start",
            "data_type": "Timestamp"
        },
        {
            "actual_col_name": "rdate_end",
            "business_name": "Rdate End",
            "description": "rdate end",
            "data_type": "Varchar(150)"
        },
        {
            "actual_col_name": "con_num",
            "business_name": "Con Number",
            "description": "con num",
            "data_type": "Integer"
        },
        {
            "actual_col_name": "con_num_qual",
            "business_name": "Con Number Qual",
            "description": "con num qual",
            "data_type": "Integer"
        },
        {
            "actual_col_name": "con_status",
            "business_name": "Con Status",
            "description": "con status",
            "data_type": "Decimal(10,5)"
        },
        {
            "actual_col_name": "cb_paid_unit_mon_amt",
            "business_name": "Cb Paid Unit Mon Amount",
            "description": "cb paIdentifier unit mon amt",
            "data_type": "Decimal(10,5)"
        },
        {
            "actual_col_name": "cb_qty_sold",
            "business_name": "Cb Quantity Sold",
            "description": "cb qty sold",
            "data_type": "Decimal(10,5)"
        },
        {
            "actual_col_name": "wh_unit_price",
            "business_name": "Wh Unit Price",
            "description": "wh unit price",
            "data_type": "Decimal(10,5)"
        },
        {
            "actual_col_name": "con_unit_price",
            "business_name": "Con Unit Price",
            "description": "con unit price",
            "data_type": "Varchar(50)"
        },
        {
            "actual_col_name": "mfg_prod_id_qual",
            "business_name": "Manufacturing Prod ID Qual",
            "description": "Manufacturer Prodcuct Identifier qual",
            "data_type": "Varchar(50)"
        },
        {
            "actual_col_name": "mfg_prod_id",
            "business_name": "Manufacturing Prod ID",
            "description": "Manufacturer Prodcuct Identifier",
            "data_type": "Varchar(50)"
        },
        {
            "actual_col_name": "mfg_prod_uom",
            "business_name": "Manufacturing Prod UOM",
            "description": "Manufacturer Prodcuct uom",
            "data_type": "Varchar(50)"
        },
        {
            "actual_col_name": "ship_to_bustype",
            "business_name": "Ship To Bustype",
            "description": "ship to bustype",
            "data_type": "Varchar(150)"
        },
        {
            "actual_col_name": "ship_to_id_qual",
            "business_name": "Ship To ID Qual",
            "description": "ship to Identifier qual",
            "data_type": "Varchar(150)"
        },
        {
            "actual_col_name": "ship_to_id",
            "business_name": "Ship To ID",
            "description": "ship to Identifier",
            "data_type": "Varchar(150)"
        },
        {
            "actual_col_name": "ship_to_name1",
            "business_name": "Ship To Name1",
            "description": "ship to name1",
            "data_type": "Varchar(150)"
        },
        {
            "actual_col_name": "ship_to_address1",
            "business_name": "Ship To Address1",
            "description": "ship to address1",
            "data_type": "Varchar(150)"
        },
        {
            "actual_col_name": "ship_to_address2",
            "business_name": "Ship To Address2",
            "description": "ship to address2",
            "data_type": "Varchar(150)"
        },
        {
            "actual_col_name": "ship_to_city",
            "business_name": "Ship To City",
            "description": "ship to city",
            "data_type": "Varchar(150)"
        },
        {
            "actual_col_name": "ship_to_state",
            "business_name": "Ship To State",
            "description": "ship to state",
            "data_type": "Varchar(150)"
        },
        {
            "actual_col_name": "ship_to_zip",
            "business_name": "Ship To Zip",
            "description": "ship to zip",
            "data_type": "Varchar(150)"
        },
        {
            "actual_col_name": "ship_to_country",
            "business_name": "Ship To Country",
            "description": "ship to country",
            "data_type": "Varchar(150)"
        },
        {
            "actual_col_name": "invoice_number",
            "business_name": "Invoice Number",
            "description": "invoice number",
            "data_type": "Timestamp"
        },
        {
            "actual_col_name": "invoice_date",
            "business_name": "Invoice Date",
            "description": "invoice date",
            "data_type": "Timestamp"
        }
    ]
}