<svg xmlns="http://www.w3.org/2000/svg" xmlns:xlink="http://www.w3.org/1999/xlink" width="25" height="24" viewBox="0 0 25 24">
    <defs>
        <path id="prefix__a" d="M0 0L15 0 15 18 0 18z"/>
    </defs>
    <g fill="none" fill-rule="evenodd" transform="translate(5 3)">
        <mask id="prefix__b" fill="#fff">
            <use xlink:href="#prefix__a"/>
        </mask>
        <path fill="#FFF" d="M13.447 16.594H1.391V5.625h1.39v2.11c0 .388.311.702.696.702.384 0 .695-.314.695-.703V5.625h6.675v2.11c0 .388.311.702.695.702.384 0 .695-.314.695-.703V5.625h1.21v10.969zM10.8 4.219H4.218c.266-1.594 1.64-2.813 3.291-2.813S10.535 2.625 10.8 4.22zm1.404 0C11.928 1.846 9.928 0 7.51 0 5.09 0 3.09 1.846 2.814 4.219H.695c-.384 0-.695.315-.695.703v12.375c0 .388.311.703.695.703h13.61c.384 0 .695-.315.695-.703V4.922c0-.388-.311-.703-.695-.703h-2.1z" mask="url(#prefix__b)"/>
    </g>
</svg>
