{
    "src_name": "LASH",
    "object_name": "Diagnoses",
    "decription": "This file will contain diagnosis information related to products in scope of this data feed for patients included in the Patient_Status file.",
    "frequency": "Weekly",
    "attributes": [
        {
            "actual_col_name": "Diagnosis_ID",
            "business_name": "Diagnosis ID",
            "description": "Unique identifier of the diagnosis record associated with the patient. ",
            "data_type": "Decimal(10,0)"
        },
        {
            "actual_col_name": "Patient_Record_ID",
            "business_name": "Patient Record ID",
            "description": "Unique identifier of the patient associated with the diagnosis. ",
            "data_type": "Varchar(8)"
        },
        {
            "actual_col_name": "Product_Name",
            "business_name": "Product Name",
            "description": "Product associated with the Diagnosis_Code.",
            "data_type": "Varchar(50)"
        },
        {
            "actual_col_name": "Diagnosis_Code",
            "business_name": "Diagnosis Code",
            "description": "Patient's diagnosis code.",
            "data_type": "Varchar(50)"
        },
        {
            "actual_col_name": "Diagnosis_Code_Standard",
            "business_name": "Diagnosis Code Standard",
            "description": "Diagonsis coding standard description",
            "data_type": "Varchar(25)"
        },
        {
            "actual_col_name": "Diagnosis_Description",
            "business_name": "Diagnosis Description",
            "description": "Diagnosis description.",
            "data_type": "Varchar(300)"
        },
        {
            "actual_col_name": "Diagnosis_Indicator",
            "business_name": "Diagnosis Indicator",
            "description": "Diagnosis code indicator.",
            "data_type": "Varchar(15)"
        },
        {
            "actual_col_name": "Diagnosis_Start_Date",
            "business_name": "Diagnosis Start Date",
            "description": "Start date of current diagnosis.",
            "data_type": "Date"
        },
        {
            "actual_col_name": "Diagnosis_End_Date",
            "business_name": "Diagnosis End Date",
            "description": "End date of current diagnosis.",
            "data_type": "Date"
        }
    ]
}