<?xml version="1.0" encoding="UTF-8"?>
<svg width="60px" height="60px" viewBox="0 0 60 60" version="1.1" xmlns="http://www.w3.org/2000/svg" xmlns:xlink="http://www.w3.org/1999/xlink">
    <!-- Generator: Sketch 62 (91390) - https://sketch.com -->
    <title>Distribution</title>
    <desc>Created with Sketch.</desc>
    <g id="Distribution" stroke="none" stroke-width="1" fill="none" fill-rule="evenodd">
        <path d="M50.5,46.4172135 C50.5,47.8182334 49.9270134,49.0884755 49.0025832,50.0086062 C48.077335,50.9295512 46.7999117,51.5 45.391127,51.5 C43.9823423,51.5 42.704919,50.9295512 41.7796708,50.0086062 C40.8552406,49.0884755 40.282254,47.8182334 40.282254,46.4172135 C40.282254,45.5023407 40.5332406,44.6473638 40.9575257,43.9030459 L23.7011434,33.4417163 C22.3552065,35.1901189 20.2426367,36.3250172 17.8627349,36.3250172 C15.8324709,36.3250172 13.991568,35.5031097 12.6582151,34.1760957 C11.3257039,32.8499193 10.5,31.019042 10.5,28.9996624 C10.5,26.9799859 11.325673,25.1489598 12.6581554,23.8226976 C13.9915112,22.4955662 15.8324396,21.6736322 17.8627349,21.6736322 C20.2429581,21.6736322 22.3551279,22.808519 23.7011079,24.5572923 L40.9574032,14.0960154 C40.5337888,13.3521676 40.282254,12.4971002 40.282254,11.5821112 C40.282254,10.1812726 40.8552316,8.91121114 41.7796408,7.99121262 C42.7048953,7.07037278 43.9823312,6.5 45.391127,6.5 C46.7999227,6.5 48.0773587,7.07037278 49.0026132,7.99121262 C49.9270224,8.91121114 50.5,10.1812726 50.5,11.5821112 C50.5,12.9829499 49.9270224,14.2530113 49.0026132,15.1730099 C48.0773587,16.0938497 46.7999227,16.6642225 45.391127,16.6642225 C43.6006297,16.6642225 42.0270017,15.7389481 41.1133897,14.3491073 L23.8816833,24.7952849 C24.6952289,25.9492808 25.1879834,27.3445758 25.2177744,28.8520794 L40.287119,28.8520794 C40.3292154,27.4028322 40.9834449,26.1039218 42.0001508,25.20279 C42.9022623,24.403226 44.0901532,23.9168759 45.3907878,23.9168759 C46.7996457,23.9168759 48.0772095,24.4872976 49.0025539,25.4082827 C49.9269892,26.3283629 50.5,27.5985534 50.5,28.9996624 C50.5,30.4004758 49.9269583,31.6705131 49.0025004,32.5905045 C48.0771576,33.5113765 46.7996171,34.0817736 45.3907878,34.0817736 C44.0901388,34.0817736 42.9022328,33.5954966 42.0001128,32.7960346 C40.9834193,31.8950371 40.3291972,30.5963129 40.2871174,29.1472453 L25.2177752,29.1472453 C25.1879765,30.654756 24.6952792,32.0501318 23.8811328,33.2035706 L41.113355,43.6501996 C42.0274651,42.2600301 43.6006672,41.3347646 45.391127,41.3347646 C46.7998974,41.3347646 48.077309,41.9052011 49.0025564,42.8260895 C49.9269979,43.7461759 50.5,45.0163414 50.5,46.4172135 Z M50.1983642,28.9996624 C50.1983642,27.6793726 49.659202,26.4820534 48.7880416,25.6149288 C47.917636,24.7485556 46.7159094,24.2120418 45.3907878,24.2120418 C44.0656661,24.2120418 42.8639396,24.7485556 41.9935339,25.6149288 C41.1223735,26.4820534 40.5832113,27.6793726 40.5832113,28.9996624 C40.5832113,30.3196927 41.122356,31.5169262 41.9935932,32.3839906 C42.8639312,33.2501601 44.0655732,33.7866077 45.3907878,33.7866077 C46.7158591,33.7866077 47.9175447,33.2501327 48.7879387,32.3839074 C49.659171,31.5168479 50.1983642,30.3196468 50.1983642,28.9996624 Z M10.8012965,28.9996624 C10.8012965,30.9381997 11.5932206,32.6962052 12.8725425,33.9694343 C14.1510301,35.241833 15.9161774,36.0298513 17.8627349,36.0298513 C19.8092923,36.0298513 21.5744396,35.241833 22.8529273,33.9694343 C24.1322492,32.6962052 24.9241732,30.9381997 24.9241732,28.9996624 C24.9241732,27.061096 24.1322204,25.3028849 22.8528534,24.0294794 C21.5743672,22.7569504 19.8092489,21.9687982 17.8627349,21.9687982 C15.9162209,21.9687982 14.1511025,22.7569504 12.8726163,24.0294794 C11.5932493,25.3028849 10.8012965,27.061096 10.8012965,28.9996624 Z M50.1983642,11.5821112 C50.1983642,10.2619841 49.6591985,9.0648264 48.7880223,8.19782273 C47.9176233,7.33159253 46.7159051,6.79516595 45.3907878,6.79516595 C44.0656704,6.79516595 42.8639522,7.33159253 41.9935533,8.19782273 C41.1223771,9.0648264 40.5832113,10.2619841 40.5832113,11.5821112 C40.5832113,12.9021416 41.122356,14.099375 41.9935932,14.9664394 C42.8639312,15.832609 44.0655732,16.3690565 45.3907878,16.3690565 C46.7158591,16.3690565 47.9175447,15.8325816 48.7879387,14.9663563 C49.659171,14.0992968 50.1983642,12.9020957 50.1983642,11.5821112 Z M50.1983642,46.4168759 C50.1983642,45.0967487 49.6591985,43.899591 48.7880223,43.0325873 C47.9176233,42.1663571 46.7159051,41.6299306 45.3907878,41.6299306 C44.0656704,41.6299306 42.8639522,42.1663571 41.9935533,43.0325873 C41.1223771,43.899591 40.5832113,45.0967487 40.5832113,46.4168759 C40.5832113,47.7372115 41.1223249,48.9345631 41.9934903,49.8016925 C42.8638399,50.66801 44.0655229,51.2044964 45.3907878,51.2044964 C46.7159094,51.2044964 47.917636,50.6679826 48.7880416,49.8016094 C49.659202,48.9344848 50.1983642,47.7371656 50.1983642,46.4168759 Z" id="Combined-Shape" stroke="#000000" fill="#000000"></path>
    </g>
</svg>