<svg xmlns="http://www.w3.org/2000/svg" width="90.51" height="90.51" viewBox="0 0 90.51 90.51">
  <g id="Group_3051" data-name="Group 3051" transform="translate(-654 -403)">
    <g id="Rectangle_801" data-name="Rectangle 801" transform="translate(699.255 403) rotate(45)" fill="#fff" stroke="#4d698c" stroke-width="1.5">
      <rect width="64" height="64" rx="8" stroke="none"/>
      <rect x="0.75" y="0.75" width="62.5" height="62.5" rx="7.25" fill="none"/>
    </g>
    <path id="Mask" d="M14.413,29.94c-.529,0-1.062-.028-1.586-.081A14.131,14.131,0,0,1,.086,17.728,13.23,13.23,0,0,1,2.581,8.4,14.59,14.59,0,0,1,10.593,2.97a.856.856,0,0,1,.26-.04,1.009,1.009,0,0,1,.989.978v15.32A1.311,1.311,0,0,0,13.19,20.5a1.44,1.44,0,0,0,.623-.143l13.464-7.066a1.054,1.054,0,0,1,.489-.122.955.955,0,0,1,.955.748,13.111,13.111,0,0,1,.2,2.251,13.347,13.347,0,0,1-4.244,9.749,14.813,14.813,0,0,1-10.26,4.026h0Zm.8-13.689a.711.711,0,0,1-.74-.713V1.407A1.439,1.439,0,0,1,15.936,0a1.533,1.533,0,0,1,.306.031,20.043,20.043,0,0,1,12.808,7.5,1.334,1.334,0,0,1,.23,1.147,1.4,1.4,0,0,1-.756.917L15.586,16.164A.874.874,0,0,1,15.209,16.251Z" transform="translate(684.998 433)" fill="#4d698c"/>
  </g>
</svg>
