{
    "src_name": "Veeva",
    "object_name": "Call Details",
    "decription": null,
    "frequency": null,
    "attributes": [
        {
            "actual_col_name": "Call2_vod__c",
            "business_name": "Call",
            "description": "Lookup to Call2. All call details need to refer to a call.",
            "data_type": "Varchar(256)"
        },
        {
            "actual_col_name": "CreatedById",
            "business_name": "Created By ID",
            "description": "Created By ID",
            "data_type": "Varchar(18)"
        },
        {
            "actual_col_name": "CreatedDate",
            "business_name": "Created Date",
            "description": "Created Date",
            "data_type": "Timestamp"
        },
        {
            "actual_col_name": "Detail_Group_vod__c",
            "business_name": "Detail Group",
            "description": "Detail Group",
            "data_type": "Varchar(256)"
        },
        {
            "actual_col_name": "Detail_Priority_vod__c",
            "business_name": "Detail Priority",
            "description": "A whole number representing the order in which the detail was delivered.",
            "data_type": "Integer"
        },
        {
            "actual_col_name": "Id",
            "business_name": "Record ID",
            "description": "Record ID",
            "data_type": "Varchar(18)"
        },
        {
            "actual_col_name": "IsDeleted",
            "business_name": "Deleted",
            "description": "Deleted",
            "data_type": "Char(4)"
        },
        {
            "actual_col_name": "IsLocked",
            "business_name": "Is Locked",
            "description": "Is Locked",
            "data_type": "Char(4)"
        },
        {
            "actual_col_name": "Is_Parent_Call_vod__c",
            "business_name": "Is Parent Call?",
            "description": "Formula Field to determine if the Call Detail record is part of the Parent Call or of an Attendee Call record.  1 indicates that the record is associated with the Parent Call.  0 indicates that it is associated with an Attendee Call.",
            "data_type": "Integer"
        },
        {
            "actual_col_name": "LastModifiedById",
            "business_name": "Last Modified By ID",
            "description": "Last Modified By ID",
            "data_type": "Varchar(18)"
        },
        {
            "actual_col_name": "LastModifiedDate",
            "business_name": "Last Modified Date",
            "description": "Last Modified Date",
            "data_type": "Timestamp"
        },
        {
            "actual_col_name": "MayEdit",
            "business_name": "May Edit",
            "description": "May Edit",
            "data_type": "Char(4)"
        },
        {
            "actual_col_name": "Mobile_ID_vod__c",
            "business_name": "Mobile ID",
            "description": "System field used by mobile products.",
            "data_type": "Varchar(100)"
        },
        {
            "actual_col_name": "Name",
            "business_name": "Call Detail Name",
            "description": "Call Detail Name",
            "data_type": "Varchar(80)"
        },
        {
            "actual_col_name": "Override_Lock_vod__c",
            "business_name": "Override Lock",
            "description": "Helper field for data loads",
            "data_type": "Char(4)"
        },
        {
            "actual_col_name": "Product_vod__c",
            "business_name": "Product",
            "description": "Lookup to the product detailed in the Product Catalog.",
            "data_type": "Varchar(256)"
        },
        {
            "actual_col_name": "SystemModstamp",
            "business_name": "System Modstamp",
            "description": "System Modstamp",
            "data_type": "Timestamp"
        },
        {
            "actual_col_name": "Type_vod__c",
            "business_name": "Type",
            "description": "Type of the detail.",
            "data_type": "Varchar(256)"
        }
    ]
}