{
    "src_name": "Veeva",
    "object_name": "Sample Inventory Item",
    "decription": null,
    "frequency": null,
    "attributes": [
        {
            "actual_col_name": "ID",
            "business_name": "Id",
            "description": "Id",
            "data_type": "Varchar(256)"
        },
        {
            "actual_col_name": "ISDELETED",
            "business_name": "Is deleted",
            "description": "Is Deleted record indicator",
            "data_type": "Char(4)"
        },
        {
            "actual_col_name": "NAME",
            "business_name": "Name",
            "description": "Name of Account",
            "data_type": "Varchar(256)"
        },
        {
            "actual_col_name": "CREATEDDATE",
            "business_name": "Created Date",
            "description": "Created Date of Account",
            "data_type": "Varchar(256)"
        },
        {
            "actual_col_name": "CREATEDBYID",
            "business_name": "Created By Id",
            "description": "Created By Id of Account",
            "data_type": "Varchar(256)"
        },
        {
            "actual_col_name": "LASTMODIFIEDDATE",
            "business_name": "Last Modified Date",
            "description": "Last Modified Date of Account",
            "data_type": "Varchar(256)"
        },
        {
            "actual_col_name": "LASTMODIFIEDBYID",
            "business_name": "Last Modified By Id",
            "description": "Last Modified By Id of Account",
            "data_type": "Varchar(256)"
        },
        {
            "actual_col_name": "SYSTEMMODSTAMP",
            "business_name": "System Modified Stamp",
            "description": "System Modified Stamp",
            "data_type": "Varchar(256)"
        },
        {
            "actual_col_name": "MAYEDIT",
            "business_name": "May Edit",
            "description": "May Edit",
            "data_type": "Char(4)"
        },
        {
            "actual_col_name": "ISLOCKED",
            "business_name": "Is locked",
            "description": "Is locked",
            "data_type": "Char(4)"
        },
        {
            "actual_col_name": "UNLOCK_VOD__C",
            "business_name": "Unlock",
            "description": "If this field is updated to true on a submitted call report, the call status will changed to Saved by the call trigger. Note that the value True is never actually saved in the unlock field. It is simply a way to unlock submitted calls. Normally only administrators will have field level security to the Unlock field.",
            "data_type": "Char(4)"
        },
        {
            "actual_col_name": "LOT_VOD__C",
            "business_name": "Lot Vod C",
            "description": "Lot Vod C",
            "data_type": "Varchar(256)"
        },
        {
            "actual_col_name": "SAMPLE_VOD__C",
            "business_name": "Sample Vod C",
            "description": "Sample Vod C",
            "data_type": "Varchar(256)"
        },
        {
            "actual_col_name": "DIFFERENCE_VOD__C",
            "business_name": "Difference Vod C",
            "description": "Difference Vod C",
            "data_type": "Varchar(256)"
        },
        {
            "actual_col_name": "COUNT_VOD__C",
            "business_name": "Count Vod C",
            "description": "Count Vod C",
            "data_type": "Varchar(256)"
        },
        {
            "actual_col_name": "INVENTORY_NAME_VOD__C",
            "business_name": "Inventory Name Vod C",
            "description": "Inventory Name Vod C",
            "data_type": "Varchar(256)"
        },
        {
            "actual_col_name": "EXPECTED_QUANTITY_VOD__C",
            "business_name": "Expected Quantity Vod C",
            "description": "Expected Quantity Vod C",
            "data_type": "Varchar(256)"
        },
        {
            "actual_col_name": "EXPIRATION_DATE_VOD__C",
            "business_name": "Expiration Date Vod C",
            "description": "Expiration Date Vod C",
            "data_type": "Varchar(256)"
        },
        {
            "actual_col_name": "U_M_VOD__C",
            "business_name": "U M Vod C",
            "description": "U M Vod C",
            "data_type": "Varchar(256)"
        },
        {
            "actual_col_name": "MOBILE_ID_VOD__C",
            "business_name": "Mobile Id",
            "description": "System field used by mobile products to aid synchronization.",
            "data_type": "Varchar(256)"
        },
        {
            "actual_col_name": "SUBMITTED_DATE_VOD__C",
            "business_name": "Submitted Date Vod C",
            "description": "Submitted Date Vod C",
            "data_type": "Varchar(256)"
        },
        {
            "actual_col_name": "NO_SAMPLE_LOTS_VOD__C",
            "business_name": "No Sample Lots Vod C",
            "description": "No Sample Lots Vod C",
            "data_type": "Varchar(256)"
        },
        {
            "actual_col_name": "PREVIOUS_INVENTORY_DATE_TIME_VOD__C",
            "business_name": "Previous Inventory Date Time Vod C",
            "description": "Previous Inventory Date Time Vod C",
            "data_type": "Timestamp"
        },
        {
            "actual_col_name": "INVENTORY_DATE_TIME_VOD__C",
            "business_name": "Inventory Date Time Vod C",
            "description": "Inventory Date Time Vod C",
            "data_type": "Timestamp"
        },
        {
            "actual_col_name": "MOBILE_ID_VOD__C",
            "business_name": "Mobile Id",
            "description": "System field used by mobile products to aid synchronization.",
            "data_type": "Varchar(255)"
        },
        {
            "actual_col_name": "MOBILE_CREATED_DATETIME_VOD__C",
            "business_name": "Mobile Created Date Time",
            "description": "Date and time the Call was created on the mobile device.",
            "data_type": "Varchar(255)"
        },
        {
            "actual_col_name": "MOBILE_LAST_MODIFIED_DATETIME_VOD__C",
            "business_name": "Mobile Last Modified Date Time",
            "description": "Date and time the Call was last saved or submitted on the mobile device.",
            "data_type": "Varchar(255)"
        }
    ]
}