{
    "src_name": "Speciality Pharma",
    "object_name": "Inventory",
    "decription": "Contains Inventory Details",
    "frequency": "Weekly",
    "attributes": [
        {
            "actual_col_name": "Pharmacy_Name",
            "business_name": "Pharmacy Name",
            "description": "Name of Pharmacy -- E.g. XYZ Pharmacy",
            "data_type": "Varchar(255)"
        },
        {
            "actual_col_name": "Pharmacy_Location_Name",
            "business_name": "Pharmacy Location Name",
            "description": "Name of Location e.g. XYZ Pharmacy Philadelphia",
            "data_type": "Varchar(255)"
        },
        {
            "actual_col_name": "Location_DEA",
            "business_name": "Location DEA",
            "description": "DEA number of dispensing location",
            "data_type": "Varchar(255)"
        },
        {
            "actual_col_name": "Location_NPI_Number",
            "business_name": "Location NPI Number",
            "description": "NPI number of dispensing location",
            "data_type": "Decimal(10,0)"
        },
        {
            "actual_col_name": "Location_NCPDP_Number",
            "business_name": "Location NCPDP Number",
            "description": "NCPDP number of dispensing location",
            "data_type": "Decimal(10,0)"
        },
        {
            "actual_col_name": "Inventory_Date",
            "business_name": "Inventory Date",
            "description": "Data inventory record was generated",
            "data_type": "Date"
        },
        {
            "actual_col_name": "NDC",
            "business_name": "NDC",
            "description": "11 Digit 5-4-2 Format e.g. 99999-9999-99",
            "data_type": "Varchar(255)"
        },
        {
            "actual_col_name": "Product_SKU",
            "business_name": "Product SKU",
            "description": "Stock Keeping Units for the Product",
            "data_type": "Varchar(255)"
        },
        {
            "actual_col_name": "Quantity_Received",
            "business_name": "Quantity Received",
            "description": "Quantity of product received in the current inventory period",
            "data_type": "Decimal(10,0)"
        },
        {
            "actual_col_name": "Quantity_On_Order",
            "business_name": "Quantity On Order",
            "description": "Quantity of product ordered but not yet received",
            "data_type": "Decimal(10,0)"
        },
        {
            "actual_col_name": "Beginning_Quantity_On_Hand",
            "business_name": "Beginning Quantity On Hand",
            "description": "Quantity of product available on hand at end of reporting period",
            "data_type": "Decimal(10,0)"
        },
        {
            "actual_col_name": "Quantity_UOM",
            "business_name": "Quantity UOM",
            "description": "Units Of Measure for all reported quantities.",
            "data_type": "Varchar(255)"
        },
        {
            "actual_col_name": "Quantity_Dispensed",
            "business_name": "Quantity Dispensed",
            "description": "Total quantity dispensed in period",
            "data_type": "Decimal(10,0)"
        },
        {
            "actual_col_name": "Quantity_Adjusted",
            "business_name": "Quantity Adjusted",
            "description": "Quantity of Units adjusted for transfers product at this location.",
            "data_type": "Decimal(10,0)"
        },
        {
            "actual_col_name": "Quantity_Returned",
            "business_name": "Quantity Returned",
            "description": "Quantity of Units Returned due to disposals at this location.",
            "data_type": "Decimal(10,0)"
        },
        {
            "actual_col_name": "Ending_Quantity_on_hand",
            "business_name": "Ending Quantity on hand",
            "description": "Ending Quantity on Hand for current reporting month.",
            "data_type": "Decimal(10,0)"
        }
    ]
}