{
    "src_name": "Veeva",
    "object_name": "Analytics Market",
    "decription": "Analytic Market information",
    "frequency": null,
    "attributes": [
        {
            "actual_col_name": "Id",
            "business_name": "Id",
            "description": "Id",
            "data_type": "Varchar(256)"
        },
        {
            "actual_col_name": "ownerid",
            "business_name": "Owner Id",
            "description": "Owner Id of call",
            "data_type": "Varchar(255)"
        },
        {
            "actual_col_name": "IsDeleted",
            "business_name": "Is Deleted",
            "description": "Is Deleted",
            "data_type": "Char(4)"
        },
        {
            "actual_col_name": "Name",
            "business_name": "Name",
            "description": "Name",
            "data_type": "Varchar(256)"
        },
        {
            "actual_col_name": "Createddate",
            "business_name": "Created Date",
            "description": "Created Date",
            "data_type": "Varchar(256)"
        },
        {
            "actual_col_name": "Createdbyid",
            "business_name": "CREATEDBYID",
            "description": "CREATEDBYID",
            "data_type": "Varchar(256)"
        },
        {
            "actual_col_name": "LastModifiedDate",
            "business_name": "Last Modified Date",
            "description": "Last Modified Date",
            "data_type": "Timestamp"
        },
        {
            "actual_col_name": "LastModifiedById",
            "business_name": "Last Modified By ID",
            "description": "Last Modified By ID",
            "data_type": "Varchar(18)"
        },
        {
            "actual_col_name": "SystemModstamp",
            "business_name": "System Modstamp",
            "description": "System Modstamp",
            "data_type": "Timestamp"
        },
        {
            "actual_col_name": "MayEdit",
            "business_name": "May Edit",
            "description": "May Edit indicator",
            "data_type": "Char(4)"
        },
        {
            "actual_col_name": "Islocked",
            "business_name": "Is Locked",
            "description": "Is Locked indicator",
            "data_type": "Char(4)"
        }
    ]
}