{
    "src_name": "ICS",
    "object_name": "Warehouse Balance",
    "decription": "This file contains an overview of total products on hand by warehouse.",
    "frequency": "Weekly",
    "attributes": [
        {
            "actual_col_name": "CostCenter",
            "business_name": " Cost Center",
            "description": "The cost center number used to uniquely identify ICS clients.",
            "data_type": "Varchar(100)"
        },
        {
            "actual_col_name": "Status",
            "business_name": " Status",
            "description": "The status of the record. Blank = Active; 'D' = Deactivated or Inactive.",
            "data_type": "Varchar(100)"
        },
        {
            "actual_col_name": "ICS Internal (ProductcodeSK)",
            "business_name": "ICS Internal ( Product CodeSK)",
            "description": "ICS internal - do not use",
            "data_type": "Decimal(20,0)"
        },
        {
            "actual_col_name": "Productcode",
            "business_name": " Product Code",
            "description": "The code of the product included in the warehouse balance.",
            "data_type": "Varchar(100)"
        },
        {
            "actual_col_name": "ICS Internal (WarehouseSK)",
            "business_name": "ICS Internal (WarehouseSK)",
            "description": "ICS internal - do not use",
            "data_type": "Decimal(20,0)"
        },
        {
            "actual_col_name": "Warehousenumber",
            "business_name": "Warehouse Number",
            "description": "The code of the warehouse where a product resides.",
            "data_type": "Varchar(100)"
        },
        {
            "actual_col_name": "Optionnumber",
            "business_name": "Option Number",
            "description": "Option number",
            "data_type": "Decimal(20,0)"
        },
        {
            "actual_col_name": "DefaultID",
            "business_name": "Default ID",
            "description": "Default ID",
            "data_type": "Varchar(100)"
        },
        {
            "actual_col_name": "Binlocation1",
            "business_name": "Bin Location1",
            "description": "Location where the product is stored.",
            "data_type": "Varchar(100)"
        },
        {
            "actual_col_name": "Binlocation2",
            "business_name": "Bin Location2",
            "description": "Binlocation2",
            "data_type": "Varchar(100)"
        },
        {
            "actual_col_name": "Quantityonhand",
            "business_name": " Quantity on Hand",
            "description": "The quantity existing in the warehouse.",
            "data_type": "Decimal(20,3)"
        },
        {
            "actual_col_name": "Quantityonpurchaseorder",
            "business_name": " Quantityon Purchase  Order",
            "description": "The quantity received on a purchase order.",
            "data_type": "Decimal(20,3)"
        },
        {
            "actual_col_name": "Quantityonreturnorder",
            "business_name": " Quantity on Return  Order",
            "description": "The quantity received on a return order.",
            "data_type": "Decimal(20,3)"
        },
        {
            "actual_col_name": "Quantityonsalesorder",
            "business_name": " Quantityon Sales  Order",
            "description": "The quantity delivered on a sales order.",
            "data_type": "Decimal(20,3)"
        },
        {
            "actual_col_name": "Quantityonpicklist",
            "business_name": " Quantity on Picklist",
            "description": "The quantity listed on a pick list.",
            "data_type": "Decimal(20,3)"
        },
        {
            "actual_col_name": "Quantitydeliverednotinvoiced",
            "business_name": " Quantity Delivered not Invoiced",
            "description": "The quantity delivered and not invoiced.",
            "data_type": "Decimal(20,3)"
        },
        {
            "actual_col_name": "NumberofissuesYTD",
            "business_name": " Number Of  Issues  YTD",
            "description": "The year to date number of issues (sold) for the product.",
            "data_type": "Decimal(20,0)"
        },
        {
            "actual_col_name": "Numberofissueslastyear",
            "business_name": " Number Of  Issues  Last Year",
            "description": "The number of issues (sold) last year.",
            "data_type": "Decimal(20,0)"
        },
        {
            "actual_col_name": "QuantityissuedYTD",
            "business_name": " Quantityissued YTD",
            "description": "The year to date quantity issued (sold) for the product.",
            "data_type": "Decimal(20,3)"
        },
        {
            "actual_col_name": "Quantityissuedlastyear",
            "business_name": " Quantityissued Last Year",
            "description": "The quantity of the product issued (sold) last year.",
            "data_type": "Decimal(20,3)"
        },
        {
            "actual_col_name": "Invoicedate",
            "business_name": " Invoice Date",
            "description": "The date the invoice is received from the supplier",
            "data_type": "Timestamp"
        },
        {
            "actual_col_name": "NumberofreceiptsYTD",
            "business_name": " Number Of  Receipts YTD",
            "description": "The year to date number of receipts for the product.",
            "data_type": "Decimal(20,0)"
        },
        {
            "actual_col_name": "Numberofreceiptslastyear",
            "business_name": " Number Of  Receipts Last Year",
            "description": "The number of receipts last year.",
            "data_type": "Decimal(20,0)"
        },
        {
            "actual_col_name": "QuantityreceivedYTD",
            "business_name": " Quantity  Received YTD",
            "description": "The year to date amount of product that has been received.",
            "data_type": "Decimal(20,3)"
        },
        {
            "actual_col_name": "Quantityreceivedlastyear",
            "business_name": " Quantity  Receivedlast Year",
            "description": "The quantity received last year.",
            "data_type": "Decimal(20,3)"
        },
        {
            "actual_col_name": "Receptiondate",
            "business_name": "Reception Date",
            "description": "The date the product was received from the supplier and entered into the warehouse.",
            "data_type": "Timestamp"
        },
        {
            "actual_col_name": "NumberofreturnsYTD",
            "business_name": " Number Of  Returns YTD",
            "description": "The year to date number of returns for the product.",
            "data_type": "Decimal(20,0)"
        },
        {
            "actual_col_name": "Numberofreturnslastyear",
            "business_name": " Number Of  Returns Last Year",
            "description": "The number of returns last year.",
            "data_type": "Decimal(20,0)"
        },
        {
            "actual_col_name": "QuantityreturnedYTD",
            "business_name": " Quantity Returned YTD",
            "description": "The year to date amount of product that has been returned.",
            "data_type": "Decimal(20,3)"
        },
        {
            "actual_col_name": "Quantityreturnedlastyear",
            "business_name": " Quantity Returned Last Year",
            "description": "The quantity returned last year.",
            "data_type": "Decimal(20,3)"
        },
        {
            "actual_col_name": "QuantityadjustedYTD",
            "business_name": " Quantity Adjusted YTD",
            "description": "The year to date amount of product that has been adjusted.",
            "data_type": "Decimal(20,3)"
        },
        {
            "actual_col_name": "Quantityadjustedlastyear",
            "business_name": " Quantity Adjusted Last Year",
            "description": "Amount of the product adjusted last year.",
            "data_type": "Decimal(20,3)"
        },
        {
            "actual_col_name": "QuantityinQualityControl",
            "business_name": " Quantity in Quality Control",
            "description": "Quantity of the product included in quality control.",
            "data_type": "Decimal(20,3)"
        },
        {
            "actual_col_name": "Lastpurchasecost",
            "business_name": "Last Purchase Cost",
            "description": "The cost to purchase the product most recently. The cost for clients' products is $1.00.",
            "data_type": "Decimal(20,0)"
        },
        {
            "actual_col_name": "Averagepurchasecost",
            "business_name": "Average Purchase Cost",
            "description": "The average cost of the product. The cost for clients' products is $1.00.",
            "data_type": "Decimal(20,0)"
        },
        {
            "actual_col_name": "Standardcost",
            "business_name": "Standard Cost",
            "description": "The standard cost of the product. The cost for clients' products is $1.00.",
            "data_type": "Decimal(20,0)"
        },
        {
            "actual_col_name": "ICS Internal (InvoiceDate_TimeCdSK)",
            "business_name": "ICS Internal ( Invoice Date  TimeCdSK)",
            "description": "ICS internal - do not use",
            "data_type": "Decimal(20,0)"
        },
        {
            "actual_col_name": "ICS Internal (ReceptionDate_TimeCdSK)",
            "business_name": "ICS Internal (Reception Date  TimeCdSK)",
            "description": "ICS internal - do not use",
            "data_type": "Decimal(20,0)"
        },
        {
            "actual_col_name": "DMDate",
            "business_name": "DM Date",
            "description": " Fields Not for use",
            "data_type": "Timestamp"
        },
        {
            "actual_col_name": "DMLIB",
            "business_name": "DMLIB",
            "description": " Fields Not for use",
            "data_type": "Char(10)"
        },
        {
            "actual_col_name": "DMOBJ",
            "business_name": "DMOBJ",
            "description": " Fields Not for use",
            "data_type": "Char(10)"
        },
        {
            "actual_col_name": "DMSYS",
            "business_name": "DMSYS",
            "description": " Fields Not for use",
            "data_type": "Char(10)"
        },
        {
            "actual_col_name": "DMUSER",
            "business_name": "DMUSER",
            "description": " Fields Not for use",
            "data_type": "Char(10)"
        },
        {
            "actual_col_name": "DMACTIVITY",
            "business_name": "DM ACTIVITY",
            "description": null,
            "data_type": "Char(2)"
        },
        {
            "actual_col_name": "STAGE_LOADDATE",
            "business_name": "STAGE LOAD Date",
            "description": null,
            "data_type": "Timestamp"
        },
        {
            "actual_col_name": "STAGE_INSERTDATE",
            "business_name": "STAGE INSERT Date",
            "description": null,
            "data_type": "Timestamp"
        }
    ]
}