{
    "src_name": "MMIT",
    "object_name": "Medical Status & Coverage",
    "decription": "Medical status and related coverage information for each relevant product\nand formulary",
    "frequency": null,
    "attributes": [
        {
            "actual_col_name": "ClientId",
            "business_name": "Client Id",
            "description": "MMIT Client Identifier",
            "data_type": "Integer"
        },
        {
            "actual_col_name": "Period",
            "business_name": "Period",
            "description": "Activity Period",
            "data_type": "Integer"
        },
        {
            "actual_col_name": "ClassName",
            "business_name": "Class Name",
            "description": "Product Class related to drug",
            "data_type": "Varchar(500)"
        },
        {
            "actual_col_name": "IndicationId",
            "business_name": "Indication Id",
            "description": "Indication Identifier",
            "data_type": "Integer"
        },
        {
            "actual_col_name": "IndicationName",
            "business_name": "Indication Name",
            "description": "Indication related to drug",
            "data_type": "Varchar(50)"
        },
        {
            "actual_col_name": "ProductId",
            "business_name": "Product Id",
            "description": "MMIT Product Identifier",
            "data_type": "Integer"
        },
        {
            "actual_col_name": "MedId",
            "business_name": "Med Id",
            "description": "First Data Bank Drug Identifier",
            "data_type": "Integer"
        },
        {
            "actual_col_name": "DrugName",
            "business_name": "Drug Name",
            "description": "Name of Drug",
            "data_type": "Varchar(500)"
        },
        {
            "actual_col_name": "FormularyId",
            "business_name": "Formulary Id",
            "description": "ID of Formulary associated with plan",
            "data_type": "Integer"
        },
        {
            "actual_col_name": "IsCovered",
            "business_name": "Is Covered",
            "description": "Is product covered under the medical benefit?",
            "data_type": "Integer"
        },
        {
            "actual_col_name": "MedicalPolicy",
            "business_name": "Medical Policy",
            "description": "Does Medical Policy exist?",
            "data_type": "Integer"
        },
        {
            "actual_col_name": "MedicalPolicyNote",
            "business_name": "Medical Policy Note",
            "description": "Medical Policy Detail",
            "data_type": "Varchar(8000)"
        },
        {
            "actual_col_name": "PA",
            "business_name": "PA",
            "description": "Does Medical PA Exist?",
            "data_type": "Integer"
        },
        {
            "actual_col_name": "PANote",
            "business_name": "PA Note",
            "description": "Medical PA Detail",
            "data_type": "Varchar(8000)"
        },
        {
            "actual_col_name": "ST",
            "business_name": "ST",
            "description": "Does Medical Step Exist?",
            "data_type": "Integer"
        },
        {
            "actual_col_name": "STNote",
            "business_name": "ST Note",
            "description": "Medical Step Detail",
            "data_type": "Varchar(8000)"
        },
        {
            "actual_col_name": "BuyAndBill",
            "business_name": "Buy And Bill",
            "description": "Is Buy & Bill Allowed?",
            "data_type": "Varchar(11)"
        },
        {
            "actual_col_name": "Specialty",
            "business_name": "Specialty",
            "description": "Is product considered Specialty?",
            "data_type": "Integer"
        },
        {
            "actual_col_name": "SpecialtyPharmacy",
            "business_name": "Specialty Pharmacy",
            "description": "Specialty Pharmacy Names",
            "data_type": "Varchar(8000)"
        },
        {
            "actual_col_name": "ProcessingDate",
            "business_name": "Processing Date",
            "description": "Date Processed for Export",
            "data_type": "Timestamp"
        }
    ]
}