{
    "src_name": "Veeva",
    "object_name": "Call Discussion",
    "decription": null,
    "frequency": null,
    "attributes": [
        {
            "actual_col_name": "Account_Tactic_vod__c",
            "business_name": "Account Tactic",
            "description": "Account Tactic that is applied for this call discussion",
            "data_type": "Varchar(256)"
        },
        {
            "actual_col_name": "Account_vod__c",
            "business_name": "Account",
            "description": "Lookup to the account for which the call discussion was delivered.",
            "data_type": "Varchar(256)"
        },
        {
            "actual_col_name": "Activity__c",
            "business_name": "Activity",
            "description": "Denotes the type of activity (Dinner, Email, Discussion...).",
            "data_type": "Varchar(256)"
        },
        {
            "actual_col_name": "Attendee_Type_vod__c",
            "business_name": "Attendee Type",
            "description": "Type of attendee.",
            "data_type": "Varchar(256)"
        },
        {
            "actual_col_name": "Call2_Mobile_ID_vod__c",
            "business_name": "Call Mobile ID",
            "description": "Mobile ID of the parent Call object",
            "data_type": "Varchar(100)"
        },
        {
            "actual_col_name": "Call2_vod__c",
            "business_name": "Call",
            "description": "Master-Detail Lookup to the call_header record for which this discussion was performed.",
            "data_type": "Varchar(256)"
        },
        {
            "actual_col_name": "Call_Date_vod__c",
            "business_name": "Date",
            "description": "The date of the call. This is denormalized into the call discussion for usability purposes.",
            "data_type": "Date"
        },
        {
            "actual_col_name": "Comments__c",
            "business_name": "Comments",
            "description": "Text area to save comments about the discussion.",
            "data_type": "Varchar(256)"
        },
        {
            "actual_col_name": "Contact_vod__c",
            "business_name": "Contact",
            "description": "Lookup to the contact for which the call discussion was delivered.",
            "data_type": "Varchar(256)"
        },
        {
            "actual_col_name": "CreatedById",
            "business_name": "Created By ID",
            "description": "Created By ID",
            "data_type": "Varchar(18)"
        },
        {
            "actual_col_name": "CreatedDate",
            "business_name": "Created Date",
            "description": "Created Date",
            "data_type": "Timestamp"
        },
        {
            "actual_col_name": "Detail_Group_vod__c",
            "business_name": "Detail Group",
            "description": "Detail Group",
            "data_type": "Varchar(256)"
        },
        {
            "actual_col_name": "Discussion_Topics__c",
            "business_name": "Discussion Topics",
            "description": "Picklist of discussion topics.",
            "data_type": "Varchar(256)"
        },
        {
            "actual_col_name": "Entity_Reference_Id_vod__c",
            "business_name": "Entity Reference Id",
            "description": "For Internal Use",
            "data_type": "Varchar(100)"
        },
        {
            "actual_col_name": "Id",
            "business_name": "Record ID",
            "description": "Record ID",
            "data_type": "Varchar(18)"
        },
        {
            "actual_col_name": "Indication__c",
            "business_name": "Indication",
            "description": "Intended use of the product.",
            "data_type": "Varchar(256)"
        },
        {
            "actual_col_name": "IsDeleted",
            "business_name": "Deleted",
            "description": "Deleted",
            "data_type": "Char(4)"
        },
        {
            "actual_col_name": "IsLocked",
            "business_name": "Is Locked",
            "description": "Is Locked",
            "data_type": "Char(4)"
        },
        {
            "actual_col_name": "Is_Parent_Call_vod__c",
            "business_name": "Is Parent Call?",
            "description": "Formula Field to determine if the Call Discussion record is part of the Parent Call or of an Attendee Call record.  1 indicates that the record is associated with the Parent Call.  0 indicates that it is associated with an Attendee Call.",
            "data_type": "Char(4)"
        },
        {
            "actual_col_name": "LastModifiedById",
            "business_name": "Last Modified By ID",
            "description": "Last Modified By ID",
            "data_type": "Varchar(18)"
        },
        {
            "actual_col_name": "LastModifiedDate",
            "business_name": "Last Modified Date",
            "description": "Last Modified Date",
            "data_type": "Timestamp"
        },
        {
            "actual_col_name": "MayEdit",
            "business_name": "May Edit",
            "description": "May Edit",
            "data_type": "Char(4)"
        },
        {
            "actual_col_name": "Medical_Event_vod__c",
            "business_name": "Medical Event",
            "description": "The Medical Event associated to the Call Discussion.",
            "data_type": "Varchar(256)"
        },
        {
            "actual_col_name": "Mobile_ID_vod__c",
            "business_name": "Mobile ID",
            "description": "System field used for mobile integration.",
            "data_type": "Varchar(100)"
        },
        {
            "actual_col_name": "Name",
            "business_name": "Call Discussion",
            "description": "Call Discussion",
            "data_type": "Varchar(80)"
        },
        {
            "actual_col_name": "Override_Lock_vod__c",
            "business_name": "Override Lock",
            "description": "Helper field for data loads.",
            "data_type": "Char(4)"
        },
        {
            "actual_col_name": "Presentation__c",
            "business_name": "Presentation",
            "description": "Picklist containing the available presentations.",
            "data_type": "Varchar(256)"
        },
        {
            "actual_col_name": "Product_Strategy_vod__c",
            "business_name": "Product Strategy",
            "description": "A lookup to the product strategy used in this call discussion.",
            "data_type": "Varchar(256)"
        },
        {
            "actual_col_name": "Product_Tactic_vod__c",
            "business_name": "Product Tactic",
            "description": "Lookup to the product tactic used in this discussion.",
            "data_type": "Varchar(256)"
        },
        {
            "actual_col_name": "Product_vod__c",
            "business_name": "Product",
            "description": "Lookup to the product in the product catalog. This product is the topic of the call discussion.",
            "data_type": "Varchar(256)"
        },
        {
            "actual_col_name": "RecordTypeId",
            "business_name": "Record Type ID",
            "description": "Record Type ID",
            "data_type": "Varchar(18)"
        },
        {
            "actual_col_name": "Restricted_Comments__c",
            "business_name": "Restricted Comments",
            "description": "Text area to save restricted comments about the discussion.",
            "data_type": "Varchar(256)"
        },
        {
            "actual_col_name": "Slides__c",
            "business_name": "Slides",
            "description": "Used to capture the slides presented during the discussion.",
            "data_type": "Varchar(20)"
        },
        {
            "actual_col_name": "SystemModstamp",
            "business_name": "System Modstamp",
            "description": "System Modstamp",
            "data_type": "Timestamp"
        },
        {
            "actual_col_name": "User_vod__c",
            "business_name": "User",
            "description": "Lookup to the user for which the call discussion was delivered.",
            "data_type": "Varchar(256)"
        },
        {
            "actual_col_name": "zvod_Product_Map_vod__c",
            "business_name": "Product",
            "description": "Special field to create dependency relationships on call discussion fields based on product.  The picklist values for this field are the textual names of detailed products.  The values must be an exact match.  This field should not be placed on any of the call discussion layouts.",
            "data_type": "Varchar(256)"
        },
        {
            "actual_col_name": "Topic_Details_APP__c",
            "business_name": "Topic Details",
            "description": "Topic Details",
            "data_type": "Varchar(256)"
        }
    ]
}