{
    "src_name": "MMIT",
    "object_name": "Medical Benefit Step Therapy",
    "decription": "MEDICALST: Detailed, categorized information related to medical benefit Step\nTherapy criteria",
    "frequency": null,
    "attributes": [
        {
            "actual_col_name": "ClientId",
            "business_name": "Client Id",
            "description": "MMIT Client Identifier",
            "data_type": "Integer"
        },
        {
            "actual_col_name": "Period",
            "business_name": "Period",
            "description": "Activity Period",
            "data_type": "Integer"
        },
        {
            "actual_col_name": "ClassName",
            "business_name": "Class Name",
            "description": "Product Class related to drug",
            "data_type": "Varchar(500)"
        },
        {
            "actual_col_name": "IndicationId",
            "business_name": "Indication Id",
            "description": "Indication Identifier",
            "data_type": "Integer"
        },
        {
            "actual_col_name": "IndicationName",
            "business_name": "Indication Name",
            "description": "Indication related to drug",
            "data_type": "Varchar(50)"
        },
        {
            "actual_col_name": "ProductId",
            "business_name": "Product Id",
            "description": "MMIT Product Identifier",
            "data_type": "Integer"
        },
        {
            "actual_col_name": "MedId",
            "business_name": "Med Id",
            "description": "First Data Bank Drug Identifier",
            "data_type": "Integer"
        },
        {
            "actual_col_name": "DrugName",
            "business_name": "Drug Name",
            "description": "Name of Drug",
            "data_type": "Varchar(500)"
        },
        {
            "actual_col_name": "FormularyId",
            "business_name": "Formulary Id",
            "description": "ID of Formulary associated with plan",
            "data_type": "Integer"
        },
        {
            "actual_col_name": "IsStepGeneric",
            "business_name": "Is Step Generic",
            "description": "Does a Generic ST exist?",
            "data_type": "Integer"
        },
        {
            "actual_col_name": "StepStatus",
            "business_name": "Step Status",
            "description": "Step Status Description",
            "data_type": "Varchar(100)"
        },
        {
            "actual_col_name": "StepProducts",
            "business_name": "Step Products",
            "description": "Names of brands & generics needed to step through",
            "data_type": "Varchar(4000)"
        },
        {
            "actual_col_name": "StepBrandsCount",
            "business_name": "Step Brands Count",
            "description": "Minimum # of brands needed to step through",
            "data_type": "Integer"
        },
        {
            "actual_col_name": "StepGenericsCount",
            "business_name": "Step Generics Count",
            "description": "Minimum # of generics needed to step through",
            "data_type": "Integer"
        },
        {
            "actual_col_name": "ProcessingDate",
            "business_name": "Processing Date",
            "description": "Date Processed for Export",
            "data_type": "Timestamp"
        }
    ]
}