<svg xmlns="http://www.w3.org/2000/svg" width="90.51" height="90.51" viewBox="0 0 90.51 90.51">
  <g id="Group_3056" data-name="Group 3056" transform="translate(-654 -403)">
    <g id="Rectangle_801" data-name="Rectangle 801" transform="translate(699.255 403) rotate(45)" fill="#fff" stroke="#4d698c" stroke-width="1.5">
      <rect width="64" height="64" rx="8" stroke="none"/>
      <rect x="0.75" y="0.75" width="62.5" height="62.5" rx="7.25" fill="none"/>
    </g>
    <path id="Mask" d="M14.875,24.994A12.316,12.316,0,0,1,3,13V1.666A1.734,1.734,0,0,1,4.786,0H6.571A1.734,1.734,0,0,1,8.357,1.666V13.08A7.034,7.034,0,0,0,15.054,20a6.916,6.916,0,0,0,7.589-6.665V1.666A1.734,1.734,0,0,1,24.429,0h1.786A1.734,1.734,0,0,1,28,1.666V13.33C28,20,22.018,25.327,14.875,24.994Z" transform="translate(683 437)" fill="#4d698c"/>
  </g>
</svg>
