{
    "src_name": "Axtria SalesIQ",
    "object_name": "Hierarchy",
    "decription": "This file will contain Employee hierarchy details.",
    "frequency": "Weekly",
    "attributes": [
        {
            "actual_col_name": "lookup_team_name",
            "business_name": "Lookup Team Name",
            "description": "Lookup Team Name",
            "data_type": "Varchar(150)"
        },
        {
            "actual_col_name": "lookup_team_instance_name",
            "business_name": "Lookup Team Instance Name",
            "description": "Lookup Team Instance Name",
            "data_type": "Varchar(150)"
        },
        {
            "actual_col_name": "team_id_c",
            "business_name": "Team Id ",
            "description": " Team Id ",
            "data_type": "Varchar(255)"
        },
        {
            "actual_col_name": "team_instance_c",
            "business_name": "Team Instance ",
            "description": "Team Instance ",
            "data_type": "Varchar(255)"
        },
        {
            "actual_col_name": "effective_end_date_c",
            "business_name": "Effective End Date ",
            "description": "Effective End Date ",
            "data_type": "Date"
        },
        {
            "actual_col_name": "effective_start_date_c",
            "business_name": "Effective Start Date ",
            "description": "Effective Start Date ",
            "data_type": "Date"
        },
        {
            "actual_col_name": "client_position_code_c",
            "business_name": "Client Position Code ",
            "description": "Client Position Code ",
            "data_type": "Varchar(8)"
        },
        {
            "actual_col_name": "hierarchy_level_c",
            "business_name": "Hierarchy Level ",
            "description": "Hierarchy Level ",
            "data_type": "Varchar(10)"
        },
        {
            "actual_col_name": "related_position_type_c",
            "business_name": "Related Position Type ",
            "description": "Related Position Type ",
            "data_type": "Varchar(50)"
        },
        {
            "actual_col_name": "name",
            "business_name": "Name",
            "description": "Name",
            "data_type": "Varchar(150)"
        },
        {
            "actual_col_name": "parent_position_code_c",
            "business_name": "Parent Position Code ",
            "description": "Parent Position Code ",
            "data_type": "Varchar(8)"
        },
        {
            "actual_col_name": "parent_position_r.name",
            "business_name": "Parent Position R. Name",
            "description": "Parent Position R. Name",
            "data_type": "Varchar(150)"
        },
        {
            "actual_col_name": "rgb_c",
            "business_name": "Rgb ",
            "description": "Rgb value",
            "data_type": "Varchar(50)"
        },
        {
            "actual_col_name": "position_type_c",
            "business_name": "Position Type ",
            "description": "Position Type ",
            "data_type": "Varchar(50)"
        },
        {
            "actual_col_name": "assignment_status_c",
            "business_name": "Assignment Status ",
            "description": "Assignment Status ",
            "data_type": "Varchar(50)"
        }
    ]
}