{
    "src_name": "MDM Product",
    "object_name": "Product Source Bridge",
    "decription": "Contains Product Source Bridge details",
    "frequency": "Weekly",
    "attributes": [
        {
            "actual_col_name": "prod_id",
            "business_name": "Product Identifier",
            "description": "MDM Surrogate Key for Product",
            "data_type": "Varchar(20)"
        },
        {
            "actual_col_name": "src_prod_id",
            "business_name": "Source Product Identifier",
            "description": "Source Product Identifier",
            "data_type": "Varchar(20)"
        },
        {
            "actual_col_name": "actv_ind",
            "business_name": "Active Indicator",
            "description": "Indicates whether Product Source is active or Inactive.",
            "data_type": "Char(1)"
        },
        {
            "actual_col_name": "src_cd",
            "business_name": "Source Code",
            "description": "Source Code",
            "data_type": "Varchar(20)"
        },
        {
            "actual_col_name": "last_updt_dt",
            "business_name": "Last Update Date",
            "description": "Last Update Date",
            "data_type": "Date"
        }
    ]
}