<?xml version="1.0" encoding="UTF-8"?>
<svg width="24px" height="24px" viewBox="0 0 24 24" version="1.1" xmlns="http://www.w3.org/2000/svg" xmlns:xlink="http://www.w3.org/1999/xlink">
    <!-- Generator: Sketch 62 (91390) - https://sketch.com -->
    <title>Icons/24px/alert/success</title>
    <desc>Created with Sketch.</desc>
    <g id="Icons/24px/alert/success" stroke="none" stroke-width="1" fill="none" fill-rule="evenodd">
        <path d="M11,16.4142136 L6.29289322,11.7071068 L7.70710678,10.2928932 L11,13.5857864 L17,7.58578644 L17,10.4142136 L11,16.4142136 Z M21,12 C21,7.02943725 16.9705627,3 12,3 C7.02943725,3 3,7.02943725 3,12 C3,16.9705627 7.02943725,21 12,21 C16.9705627,21 21,16.9705627 21,12 Z M1,12 C1,5.92486775 5.92486775,1 12,1 C18.0751322,1 23,5.92486775 23,12 C23,18.0751322 18.0751322,23 12,23 C5.92486775,23 1,18.0751322 1,12 Z" id="Shape" fill="#252525"></path>
        <path d="M0,0 L24,0 L24,24 L0,24 L0,0 Z" id="Path" stroke-opacity="0.01" stroke="#000000" stroke-width="0.01"></path>
    </g>
</svg>