{
   "zip_territory": {
      "displayname_to_adapter": {
         "zip_territory": {
            "Geo_Code": {
               "Geo_Code": "varchar"
            },
            "Geo_Type": {
               "Geo_Type": "varchar"
            },
            "End_Date": {
               "End_Date": "date"
            },
            "Start_Date": {
               "Start_Date": "date"
            },
            "BU": {
               "BU": "varchar"
            },
            "Parent_Geo_Code": {
               "Parent_Geo_Code": "varchar"
            }
         }
      },
      "ART_to_IC": {
         "connector": "salesforce_to_s3",
         "processing_order": ["zip_territory", "routine"],
         "validation": {
            "zip_territory": {
               "id": "647d23a0f6344c6ca3cad2da7df67573",
               "error_threshold": 20
            }
         },
         "etl": {
            "workflow_id": "",
            "output": [
               "output_3"
            ],
            "processing_order" : ["output_3"]
         },
         "source_to_adapter": {
            "zip_territory": {
               "is_master": "no",
               "key_columns": [],
               "object": "Position_Geography__c",
               "filters": {
                  "End_Date": {
                  	"source" : "Effective_End_Date__c",
                  	"dest" : "effective_end_date"
                  },
                  "Start_Date": {
                  	"source" : "Effective_Start_Date__c",
                  	"dest" : "effective_start_date"
                  },
				  "Geo_Code": {
				  "source" : "Geography__r.Name",
                  	"dest" : "Geo_code"
					},
				  "Parent_Geo_Code": {
				  "source" : "Position_Team_Instance__r.Position_ID__r.Client_Position_Code__c",
                  	"dest" : "Parent_Geo_Code"
					},
				  "BU": {
				  "source" : "Team_Instance__r.Team__r.Name",
                  	"dest" : "BU"
					},
				  "Geo_Type": {
				  "source" : "Geography__r.Geography_Type__r.Name",
                  	"dest" : "Geo_Type"
					}

               },
               "_comment1": "you can leave source_to_adapter blank in case of inbound (S3_to_.......). User mapping will be provided through URL.",
               "mapping": {
                  "Geography__r.Name": "Geo_Code",
                  "Geography__r.Geography_Type__r.Name": "Geo_Type",
                  "Position_Team_Instance__r.Position_ID__r.Client_Position_Code__c": "Parent_Geo_Code",
                  "Team_Instance__r.Team__r.Name": "BU",
                  "Effective_End_Date__c": "End_Date",
                  "Effective_Start_Date__c": "Start_Date"
               }
            }
         },
         "adapter_to_destination": {
            "zip_territory": {
               "key_columns": [],
               "filters": {
                  "End_Date": {
                     "source" : "Effective_End_Date__c",
                     "dest" : "effective_end_date"
                  }
               },
               "mapping": {
                  "Geo_Code": "Geo_Code",
                  "Geo_Type": "Geo_Type",
                  "Parent_Geo_Code": "Parent_Geo_Code",
                  "BU": "BU",
                  "Start_Date": "Start_Date",
                  "End_Date": "End_Date"
               },
               "object": "zip_territory.csv"
            }
         },
         "etl_to_destination": {
            "output_3": {
               "key_columns": [],
               "object": "zip_territory.csv",
               "mapping": {
                  "Geo_Code": "Geo_Code",
                  "Geo_Type": "Geo_Type",
                  "Parent_Geo_Code": "Parent_Geo_Code",
                  "BU": "BU",
                  "Start_Date": "Start_Date",
                  "End_Date": "End_Date"
               }
            }
         }
      }
   }
}