UpdatePositionAutoApprove__c,AccountMovementAutoApprove__c,CreatePositionAutoApprove__c,HierarchyChangeBaseAutoApprove__c,SetupOwnerId,Name,DeleteOverlayPosAutoApprove__c,Id,EmployeeAssignmentAutoApprove__c,HierarchyChangeOverlayAutoApprove__c,DeletePositionAutoApprove__c,UpdateOverlayBaseMappingPosAutoApprove__c,CreateOverlayPosAutoApproval__c,CallPlanChangeAutoApprove__c,ZIPMovementAutoApprove__c,UpdateOverlayPosAutoApprove__c
True,False,True,True,00ef40000011jzuAAA,AutoApproval (Profile),False,a092F000001dAHXQA2,False,False,True,False,False,False,True,False
False,False,True,False,00ef40000011jzqAAA,AutoApproval (Profile),False,a092F000001dKw5QAE,False,False,False,False,False,False,False,False
