seq_no,table_name,where_clause
1,t_br_expr,business_rules in (SELECT sfdc_id FROM t_business_rule WHERE scenario_rule_instance_details IN (SELECT sfdc_id FROM t_scn_rule_instance_details WHERE scenario_id = VAR_SCENARIO )) 
2,t_business_rule_field_map_details,business_rule in (SELECT sfdc_id FROM t_business_rule WHERE scenario_rule_instance_details IN (SELECT sfdc_id FROM t_scn_rule_instance_details WHERE scenario_id = VAR_SCENARIO )) 
3,t_br_joinrule,business_rules in (SELECT sfdc_id FROM t_business_rule WHERE scenario_rule_instance_details IN (SELECT sfdc_id FROM t_scn_rule_instance_details WHERE scenario_id = VAR_SCENARIO )) 
4,t_ds_col_detail,dataset_id in (select distinct dataset_id from t_dataset_rule_map where scenario_rule_instance_id in (SELECT sfdc_id FROM t_scn_rule_instance_details WHERE scenario_id = VAR_SCENARIO )) 
5,t_dataset,sfdc_id in (select distinct dataset_id from t_dataset_rule_map where scenario_rule_instance_id in (SELECT sfdc_id FROM t_scn_rule_instance_details WHERE scenario_id = VAR_SCENARIO )) 
6,t_call_balancing_expression_data_detail,business_rules in (SELECT sfdc_id FROM t_business_rule WHERE scenario_rule_instance_details IN (SELECT sfdc_id FROM t_scn_rule_instance_details WHERE scenario_id = VAR_SCENARIO )) 
7,t_config_call_balancing_constraint_detail,scenario = VAR_SCENARIO 
8,t_config_call_balancing_constraint_rule_map,scenario = VAR_SCENARIO 
9,t_config_call_balancing_map,scenario_id = VAR_SCENARIO
10,t_business_rule,scenario_rule_instance_details in (SELECT sfdc_id FROM t_scn_rule_instance_details WHERE scenario_id = VAR_SCENARIO ) 
11,t_dataset_rule_map,scenario_rule_instance_id in (SELECT sfdc_id FROM t_scn_rule_instance_details WHERE scenario_id = VAR_SCENARIO ) 
12,t_scn_rule_instance_details,scenario_id = VAR_SCENARIO 
13,t_scn_data_object_map,scenario = VAR_SCENARIO 
14,t_scenario,sfdc_id = VAR_SCENARIO 
