{
  "employee": [
    {
      "id": 1,
      "username": "adipanca",
      "firstName": "Adi",
      "lastName": "Panca",
      "email": "adipancaiskandar@gmail.com",
      "birthDate": "2000-01-01",
      "basicSalary": "12500000",
      "status": "Active",
      "group": "Frontend Development",
      "description": "Natural lead-in to additional content. This content is a little bit longer."
    },
    {
      "id": 2,
      "username": "lelymeilina",
      "firstName": "Lely",
      "lastName": "Meilina",
      "email": "lely@gmail.com",
      "birthDate": "2000-01-01",
      "basicSalary": "12500000",
      "status": "Active",
      "group": "Backend Development",
      "description": "Natural lead-in to additional content. This content is a little bit longer."
    },
    {
      "id": 3,
      "username": "minerva",
      "firstName": "Natasha",
      "lastName": "Minerva",
      "email": "natashaminerva@gmail.com",
      "birthDate": "2000-01-01",
      "basicSalary": "12500000",
      "status": "Active",
      "group": "Scrum Master",
      "description": "Natural lead-in to additional content. This content is a little bit longer."
    },
    {
      "id": 4,
      "username": "guinevere",
      "firstName": "Luxio",
      "lastName": "Guinevere",
      "email": "guinever@gmail.com",
      "birthDate": "2000-01-01",
      "basicSalary": "12500000",
      "status": "Not Active",
      "group": "Fullstack Development",
      "description": "Natural lead-in to additional content. This content is a little bit longer."
    },
    {
      "id": 5,
      "username": "john",
      "firstName": "John",
      "lastName": "Doe",
      "email": "john@gmail.com",
      "birthDate": "2000-01-01",
      "basicSalary": "12500000",
      "status": "Active",
      "group": "Backend Development",
      "description": "Natural lead-in to additional content. This content is a little bit longer."
    },
    {
      "id": 6,
      "username": "catarina",
      "firstName": "Catarina",
      "lastName": "Doe",
      "email": "catarina@gmail.com",
      "birthDate": "2000-01-01",
      "basicSalary": "12500000",
      "status": "Active",
      "group": "Frontend Development",
      "description": "Natural lead-in to additional content. This content is a little bit longer."
    },
    {
      "id": 7,
      "username": "vincent",
      "firstName": "Vincent",
      "lastName": "Minerva",
      "email": "vincent@gmail.com",
      "birthDate": "2000-01-01",
      "basicSalary": "12500000",
      "status": "Active",
      "group": "Fullstack Development",
      "description": "Natural lead-in to additional content. This content is a little bit longer."
    },
    {
      "id": 8,
      "username": "james",
      "firstName": "James",
      "lastName": "Guinevere",
      "email": "james@gmail.com",
      "birthDate": "2000-01-01",
      "basicSalary": "12500000",
      "status": "Active",
      "group": "Scrum Master",
      "description": "Natural lead-in to additional content. This content is a little bit longer."
    },
    {
      "id": 9,
      "username": "jackie",
      "firstName": "Jackie",
      "lastName": "Drunk",
      "email": "jackie@gmail.com",
      "birthDate": "2000-01-01",
      "basicSalary": "12500000",
      "status": "Not Active",
      "group": "Fullstack Development",
      "description": "Natural lead-in to additional content. This content is a little bit longer."
    },
    {
      "id": 10,
      "username": "sheila",
      "firstName": "Sheila",
      "lastName": "Lee",
      "email": "sheila@gmail.com",
      "birthDate": "2000-01-01",
      "basicSalary": "12500000",
      "status": "Not Active",
      "group": "Fullstack Development",
      "description": "Natural lead-in to additional content. This content is a little bit longer."
    },
    {
      "id": 11,
      "username": "rambo",
      "firstName": "Rambo",
      "lastName": "Boy",
      "email": "rambo@gmail.com",
      "birthDate": "2000-01-01",
      "basicSalary": "12500000",
      "status": "Active",
      "group": "Frontend Development",
      "description": "Natural lead-in to additional content. This content is a little bit longer."
    },
    {
      "id": 12,
      "username": "bento",
      "firstName": "Bento",
      "lastName": "Boy",
      "email": "bento@gmail.com",
      "birthDate": "2000-01-01",
      "basicSalary": "12500000",
      "status": "Active",
      "group": "Backend Development",
      "description": "Natural lead-in to additional content. This content is a little bit longer."
    },
    {
      "id": 13,
      "username": "bernard",
      "firstName": "Bernard",
      "lastName": "Boy",
      "email": "bernard@gmail.com",
      "birthDate": "2000-01-01",
      "basicSalary": "12500000",
      "status": "Active",
      "group": "Backend Development",
      "description": "Natural lead-in to additional content. This content is a little bit longer."
    },
    {
      "id": 14,
      "username": "selpi",
      "firstName": "Selpi",
      "lastName": "Nath",
      "email": "Selpid@gmail.com",
      "birthDate": "2000-01-01",
      "basicSalary": "12500000",
      "status": "Active",
      "group": "Fullstack Development",
      "description": "Natural lead-in to additional content. This content is a little bit longer."
    }
  ]
}