module gitlab.com/axiomat.io/recipes

go 1.19

require (
	github.com/grpc-ecosystem/grpc-gateway/v2 v2.16.2
	google.golang.org/genproto/googleapis/api v0.0.0-20230726155614-23370e0ffb3e
	google.golang.org/grpc v1.57.0
	google.golang.org/protobuf v1.31.0
)

require (
	github.com/golang/protobuf v1.5.3 // indirect
	golang.org/x/net v0.12.0 // indirect
	golang.org/x/sys v0.10.0 // indirect
	golang.org/x/text v0.11.0 // indirect
	google.golang.org/genproto v0.0.0-20230706204954-ccb25ca9f130 // indirect
	google.golang.org/genproto/googleapis/rpc v0.0.0-20230726155614-23370e0ffb3e // indirect
)
