{
  "name": "Zitch",
  "race": "Kenku",
  "experience": 65000,
  "inspiration": 0,
  "speed": 0,
  "hit_point_base": 0,
  "temporary_hit_points": 0,
  "hit_points": 0,
  "hit_dice": 0,
  "hit_die_size": 0,
  "death_save_successes": 0,
  "death_save_failures": 0,
  "spellcasting_ability": "",
  "spell_slots": [
    0,
    0,
    0,
    0,
    0,
    0,
    0,
    0,
    0,
    0
  ],
  "spent_spell_slots": [
    0,
    0,
    0,
    0,
    0,
    0,
    0,
    0,
    0,
    0
  ],
  "alignment": "ChaoticGood",
  "body_weight": 0.0,
  "abilities": [
    {
      "id": "strength",
      "name": "Strength",
      "score": 10,
      "skills": [
        {
          "id": "athletics",
          "name": "Athletics"
        }
      ]
    },
    {
      "id": "dexterity",
      "name": "Dexterity",
      "score": 12,
      "skills": [
        {
          "id": "acrobatics",
          "name": "Acrobatics"
        },
        {
          "id": "sleight_of_hand",
          "name": "Sleight of Hand"
        },
        {
          "id": "stealth",
          "name": "Stealth"
        }
      ]
    },
    {
      "id": "constitution",
      "name": "Constitution",
      "score": 10,
      "skills": []
    },
    {
      "id": "intelligence",
      "name": "Intelligence",
      "score": 10,
      "skills": [
        {
          "id": "arcana",
          "name": "Arcana"
        },
        {
          "id": "history",
          "name": "History"
        },
        {
          "id": "investigation",
          "name": "Investigation"
        },
        {
          "id": "nature",
          "name": "Nature"
        },
        {
          "id": "religion",
          "name": "Religion"
        }
      ]
    },
    {
      "id": "wisdom",
      "name": "Wisdom",
      "score": 10,
      "skills": [
        {
          "id": "animal_handling",
          "name": "Animal Handling"
        },
        {
          "id": "insight",
          "name": "Insight"
        },
        {
          "id": "medicine",
          "name": "Medicine"
        },
        {
          "id": "perception",
          "name": "Perception"
        },
        {
          "id": "survival",
          "name": "Survival"
        }
      ]
    },
    {
      "id": "charisma",
      "name": "Charisma",
      "score": 10,
      "skills": [
        {
          "id": "deception",
          "name": "Deception"
        },
        {
          "id": "intimidation",
          "name": "Intimidation"
        },
        {
          "id": "performance",
          "name": "Performance"
        },
        {
          "id": "persuasion",
          "name": "Persuasion"
        }
      ]
    }
  ],
  "background": "Sage",
  "class": "Alchemist",
  "details": [],
  "features": [],
  "proficiencies": {},
  "traits": [],
  "items": []
}
