<svg width="23" height="16" viewBox="0 0 23 16" fill="none" xmlns="http://www.w3.org/2000/svg">
<path fill-rule="evenodd" clip-rule="evenodd" d="M7.58223 14.8286C8.28518 15.5316 9.42487 15.5316 10.1278 14.8286L21.5829 3.3735C22.2859 2.67056 22.2859 1.53086 21.5829 0.827917C20.88 0.124973 19.7403 0.124974 19.0374 0.827917L8.85502 11.0103L3.12746 5.28269C2.42451 4.57975 1.28482 4.57975 0.581874 5.28269C-0.121069 5.98563 -0.12107 7.12533 0.581874 7.82827L7.58223 14.8286Z" fill="white"/>
</svg>
