,TP,FN,NI,1,2,3,5,6,7,8,9,10,11,13,14,17,18,20,21,,4,12,15,16,19
CAT-QuickHeal,1,15,0,Trojan.JS.Downloder.30778,Clean,Clean,Clean,Clean,Clean,Clean,Clean,Clean,Clean,Clean,Clean,Clean,Clean,Clean,Clean, ,n/a,n/a,n/a,n/a,n/a
DrWeb,1,15,0,JS.BackDoor.7,Clean,Clean,Clean,Clean,Clean,Clean,Clean,Clean,Clean,Clean,Clean,Clean,Clean,Clean,Clean, ,n/a,n/a,n/a,n/a,n/a
ESET-NOD32,1,15,0,JS/Exploit.Agent.NNJ,Clean,Clean,Clean,Clean,Clean,Clean,Clean,Clean,Clean,Clean,Clean,Clean,Clean,Clean,Clean, ,n/a,n/a,n/a,n/a,n/a
Fortinet,1,15,0,JS/Agent.NNJ!tr,Clean,Clean,Clean,Clean,Clean,Clean,Clean,Clean,Clean,Clean,Clean,Clean,Clean,Clean,Clean, ,n/a,n/a,n/a,n/a,n/a
Ikarus,1,15,0,Trojan.Js.Exploit,Clean,Clean,Clean,Clean,Clean,Clean,Clean,Clean,Clean,Clean,Clean,Clean,Clean,Clean,Clean, ,n/a,n/a,n/a,n/a,n/a
Kaspersky,1,15,0,HEUR:Trojan-Downloader.Script.Generic,Clean,Clean,Clean,Clean,Clean,Clean,Clean,Clean,Clean,Clean,Clean,Clean,Clean,Clean,Clean, ,n/a,n/a,n/a,n/a,n/a
Rising,1,14,1,Trojan.Downloader!1.A525 (CLASSIC),Clean,Clean,Clean,Clean,Clean,Clean,Clean,Clean,Clean,Clean,Clean,Timeout,Clean,Clean,Clean, ,n/a,n/a,n/a,n/a,n/a
ZoneAlarm,1,15,0,HEUR:Trojan-Downloader.Script.Generic,Clean,Clean,Clean,Clean,Clean,Clean,Clean,Clean,Clean,Clean,Clean,Clean,Clean,Clean,Clean, ,n/a,n/a,n/a,n/a,n/a
Ad-Aware,0,16,0,Clean,Clean,Clean,Clean,Clean,Clean,Clean,Clean,Clean,Clean,Clean,Clean,Clean,Clean,Clean,Clean, ,n/a,n/a,n/a,n/a,n/a
AegisLab,0,16,0,Clean,Clean,Clean,Clean,Clean,Clean,Clean,Clean,Clean,Clean,Clean,Clean,Clean,Clean,Clean,Clean, ,n/a,n/a,n/a,n/a,n/a
AhnLab-V3,0,16,0,Clean,Clean,Clean,Clean,Clean,Clean,Clean,Clean,Clean,Clean,Clean,Clean,Clean,Clean,Clean,Clean, ,n/a,n/a,n/a,n/a,n/a
ALYac,0,16,0,Clean,Clean,Clean,Clean,Clean,Clean,Clean,Clean,Clean,Clean,Clean,Clean,Clean,Clean,Clean,Clean, ,n/a,n/a,n/a,n/a,n/a
Antiy-AVL,0,16,0,Clean,Clean,Clean,Clean,Clean,Clean,Clean,Clean,Clean,Clean,Clean,Clean,Clean,Clean,Clean,Clean, ,n/a,n/a,n/a,n/a,n/a
Arcabit,0,16,0,Clean,Clean,Clean,Clean,Clean,Clean,Clean,Clean,Clean,Clean,Clean,Clean,Clean,Clean,Clean,Clean, ,n/a,n/a,n/a,n/a,n/a
Avast,1,15,0,Clean,Clean,Clean,PHP:BackDoor-Y [Trj],Clean,Clean,Clean,Clean,Clean,Clean,Clean,Clean,Clean,Clean,Clean,Clean, ,n/a,n/a,n/a,n/a,n/a
Avast Mobile Security,0,16,0,Clean,Clean,Clean,Clean,Clean,Clean,Clean,Clean,Clean,Clean,Clean,Clean,Clean,Clean,Clean,Clean, ,n/a,n/a,n/a,n/a,n/a
AVG,1,15,0,Clean,Clean,Clean,PHP:BackDoor-Y [Trj],Clean,Clean,Clean,Clean,Clean,Clean,Clean,Clean,Clean,Clean,Clean,Clean, ,n/a,n/a,n/a,n/a,n/a
Avira,0,16,0,Clean,Clean,Clean,Clean,Clean,Clean,Clean,Clean,Clean,Clean,Clean,Clean,Clean,Clean,Clean,Clean, ,n/a,n/a,n/a,n/a,n/a
Babable,0,16,0,Clean,Clean,Clean,Clean,Clean,Clean,Clean,Clean,Clean,Clean,Clean,Clean,Clean,Clean,Clean,Clean, ,n/a,n/a,n/a,n/a,n/a
Baidu,0,16,0,Clean,Clean,Clean,Clean,Clean,Clean,Clean,Clean,Clean,Clean,Clean,Clean,Clean,Clean,Clean,Clean, ,n/a,n/a,n/a,n/a,n/a
BitDefender,0,16,0,Clean,Clean,Clean,Clean,Clean,Clean,Clean,Clean,Clean,Clean,Clean,Clean,Clean,Clean,Clean,Clean, ,n/a,n/a,n/a,n/a,n/a
Bkav,1,15,0,Clean,Clean,Clean,VEX.Webshell,Clean,Clean,Clean,Clean,Clean,Clean,Clean,Clean,Clean,Clean,Clean,Clean, ,n/a,n/a,n/a,n/a,n/a
ClamAV,0,16,0,Clean,Clean,Clean,Clean,Clean,Clean,Clean,Clean,Clean,Clean,Clean,Clean,Clean,Clean,Clean,Clean, ,n/a,n/a,n/a,n/a,n/a
CMC,0,16,0,Clean,Clean,Clean,Clean,Clean,Clean,Clean,Clean,Clean,Clean,Clean,Clean,Clean,Clean,Clean,Clean, ,n/a,n/a,n/a,n/a,n/a
Comodo,0,16,0,Clean,Clean,Clean,Clean,Clean,Clean,Clean,Clean,Clean,Clean,Clean,Clean,Clean,Clean,Clean,Clean, ,n/a,n/a,n/a,n/a,n/a
Cyren,0,16,0,Clean,Clean,Clean,Clean,Clean,Clean,Clean,Clean,Clean,Clean,Clean,Clean,Clean,Clean,Clean,Clean, ,n/a,n/a,n/a,n/a,n/a
Emsisoft,0,16,0,Clean,Clean,Clean,Clean,Clean,Clean,Clean,Clean,Clean,Clean,Clean,Clean,Clean,Clean,Clean,Clean, ,n/a,n/a,n/a,n/a,n/a
eScan,0,16,0,Clean,Clean,Clean,Clean,Clean,Clean,Clean,Clean,Clean,Clean,Clean,Clean,Clean,Clean,Clean,Clean, ,n/a,n/a,n/a,n/a,n/a
F-Prot,0,16,0,Clean,Clean,Clean,Clean,Clean,Clean,Clean,Clean,Clean,Clean,Clean,Clean,Clean,Clean,Clean,Clean, ,n/a,n/a,n/a,n/a,n/a
F-Secure,0,16,0,Clean,Clean,Clean,Clean,Clean,Clean,Clean,Clean,Clean,Clean,Clean,Clean,Clean,Clean,Clean,Clean, ,n/a,n/a,n/a,n/a,n/a
GData,0,16,0,Clean,Clean,Clean,Clean,Clean,Clean,Clean,Clean,Clean,Clean,Clean,Clean,Clean,Clean,Clean,Clean, ,n/a,n/a,n/a,n/a,n/a
Jiangmin,0,16,0,Clean,Clean,Clean,Clean,Clean,Clean,Clean,Clean,Clean,Clean,Clean,Clean,Clean,Clean,Clean,Clean, ,n/a,n/a,n/a,n/a,n/a
K7AntiVirus,0,16,0,Clean,Clean,Clean,Clean,Clean,Clean,Clean,Clean,Clean,Clean,Clean,Clean,Clean,Clean,Clean,Clean, ,n/a,n/a,n/a,n/a,n/a
K7GW,0,16,0,Clean,Clean,Clean,Clean,Clean,Clean,Clean,Clean,Clean,Clean,Clean,Clean,Clean,Clean,Clean,Clean, ,n/a,n/a,n/a,n/a,n/a
Kingsoft,0,16,0,Clean,Clean,Clean,Clean,Clean,Clean,Clean,Clean,Clean,Clean,Clean,Clean,Clean,Clean,Clean,Clean, ,n/a,n/a,n/a,n/a,n/a
Malwarebytes,0,16,0,Clean,Clean,Clean,Clean,Clean,Clean,Clean,Clean,Clean,Clean,Clean,Clean,Clean,Clean,Clean,Clean, ,n/a,n/a,n/a,n/a,n/a
MAX,0,16,0,Clean,Clean,Clean,Clean,Clean,Clean,Clean,Clean,Clean,Clean,Clean,Clean,Clean,Clean,Clean,Clean, ,n/a,n/a,n/a,n/a,n/a
McAfee,0,16,0,Clean,Clean,Clean,Clean,Clean,Clean,Clean,Clean,Clean,Clean,Clean,Clean,Clean,Clean,Clean,Clean, ,n/a,n/a,n/a,n/a,n/a
McAfee-GW-Edition,0,16,0,Clean,Clean,Clean,Clean,Clean,Clean,Clean,Clean,Clean,Clean,Clean,Clean,Clean,Clean,Clean,Clean, ,n/a,n/a,n/a,n/a,n/a
Microsoft,1,15,0,Clean,Clean,Clean,Clean,Clean,Program:Win32/Unwaders.C!ml,Clean,Clean,Clean,Clean,Clean,Clean,Clean,Clean,Clean,Clean, ,n/a,n/a,n/a,n/a,n/a
NANO-Antivirus,0,16,0,Clean,Clean,Clean,Clean,Clean,Clean,Clean,Clean,Clean,Clean,Clean,Clean,Clean,Clean,Clean,Clean, ,n/a,n/a,n/a,n/a,n/a
Panda,0,16,0,Clean,Clean,Clean,Clean,Clean,Clean,Clean,Clean,Clean,Clean,Clean,Clean,Clean,Clean,Clean,Clean, ,n/a,n/a,n/a,n/a,n/a
Qihoo-360,0,16,0,Clean,Clean,Clean,Clean,Clean,Clean,Clean,Clean,Clean,Clean,Clean,Clean,Clean,Clean,Clean,Clean, ,n/a,n/a,n/a,n/a,n/a
Sophos AV,0,16,0,Clean,Clean,Clean,Clean,Clean,Clean,Clean,Clean,Clean,Clean,Clean,Clean,Clean,Clean,Clean,Clean, ,n/a,n/a,n/a,n/a,n/a
SUPERAntiSpyware,0,16,0,Clean,Clean,Clean,Clean,Clean,Clean,Clean,Clean,Clean,Clean,Clean,Clean,Clean,Clean,Clean,Clean, ,n/a,n/a,n/a,n/a,n/a
Symantec,1,15,0,Clean,Clean,Clean,Backdoor.Trojan,Clean,Clean,Clean,Clean,Clean,Clean,Clean,Clean,Clean,Clean,Clean,Clean, ,n/a,n/a,n/a,n/a,n/a
TACHYON,0,16,0,Clean,Clean,Clean,Clean,Clean,Clean,Clean,Clean,Clean,Clean,Clean,Clean,Clean,Clean,Clean,Clean, ,n/a,n/a,n/a,n/a,n/a
Tencent,0,16,0,Clean,Clean,Clean,Clean,Clean,Clean,Clean,Clean,Clean,Clean,Clean,Clean,Clean,Clean,Clean,Clean, ,n/a,n/a,n/a,n/a,n/a
TheHacker,0,16,0,Clean,Clean,Clean,Clean,Clean,Clean,Clean,Clean,Clean,Clean,Clean,Clean,Clean,Clean,Clean,Clean, ,n/a,n/a,n/a,n/a,n/a
TrendMicro,0,14,2,Clean,Clean,Clean,Clean,Clean,Clean,Clean,Clean,Clean,error,Clean,Clean,Timeout,Clean,Clean,Clean, ,n/a,n/a,n/a,n/a,n/a
TrendMicro-HouseCall,0,16,0,Clean,Clean,Clean,Clean,Clean,Clean,Clean,Clean,Clean,Clean,Clean,Clean,Clean,Clean,Clean,Clean, ,n/a,n/a,n/a,n/a,n/a
VBA32,1,15,0,Clean,Clean,Clean,Clean,Clean,BScope.Trojan.Skeeyah,Clean,Clean,Clean,Clean,Clean,Clean,Clean,Clean,Clean,Clean, ,n/a,n/a,n/a,n/a,n/a
VIPRE,0,6,10,Clean,Engine failure,Engine failure,Clean,Clean,Engine failure,Engine failure,Engine failure,Engine failure,Clean,Engine failure,Engine failure,Engine failure,Engine failure,Engine failure,Engine failure, ,n/a,n/a,n/a,n/a,n/a
ViRobot,0,16,0,Clean,Clean,Clean,Clean,Clean,Clean,Clean,Clean,Clean,Clean,Clean,Clean,Clean,Clean,Clean,Clean, ,n/a,n/a,n/a,n/a,n/a
Yandex,0,16,0,Clean,Clean,Clean,Clean,Clean,Clean,Clean,Clean,Clean,Clean,Clean,Clean,Clean,Clean,Clean,Clean, ,n/a,n/a,n/a,n/a,n/a
Zillya,0,15,1,Clean,Clean,Clean,Clean,Clean,Clean,Clean,Clean,Clean,Clean,Clean,Clean,Clean,error,Clean,Clean, ,n/a,n/a,n/a,n/a,n/a
Zoner,0,16,0,Clean,Clean,Clean,Clean,Clean,Clean,Clean,Clean,Clean,Clean,Clean,Clean,Clean,Clean,Clean,Clean, ,n/a,n/a,n/a,n/a,n/a
Acronis,0,5,11,Unable to process file type,Unable to process file type,Unable to process file type,Unable to process file type,Unable to process file type,Clean,Clean,Clean,Clean,Unable to process file type,Clean,Unable to process file type,Unable to process file type,Unable to process file type,Unable to process file type,Unable to process file type, ,n/a,n/a,n/a,n/a,n/a
Alibaba,0,5,11,Unable to process file type,Unable to process file type,Unable to process file type,Unable to process file type,Unable to process file type,Clean,Clean,Clean,Clean,Unable to process file type,Clean,Unable to process file type,Unable to process file type,Unable to process file type,Unable to process file type,Unable to process file type, ,n/a,n/a,n/a,n/a,n/a
CrowdStrike Falcon,0,5,11,Unable to process file type,Unable to process file type,Unable to process file type,Unable to process file type,Unable to process file type,Clean,Clean,Clean,Clean,Unable to process file type,Clean,Unable to process file type,Unable to process file type,Unable to process file type,Unable to process file type,Unable to process file type, ,n/a,n/a,n/a,n/a,n/a
Cybereason,0,5,11,Unable to process file type,Unable to process file type,Unable to process file type,Unable to process file type,Unable to process file type,Clean,Clean,Clean,Clean,Unable to process file type,Clean,Unable to process file type,Unable to process file type,Unable to process file type,Unable to process file type,Unable to process file type, ,n/a,n/a,n/a,n/a,n/a
Cylance,2,3,11,Unable to process file type,Unable to process file type,Unable to process file type,Unable to process file type,Unable to process file type,Unsafe,Clean,Clean,Clean,Unable to process file type,Unsafe,Unable to process file type,Unable to process file type,Unable to process file type,Unable to process file type,Unable to process file type, ,n/a,n/a,n/a,n/a,n/a
eGambit,0,5,11,Unable to process file type,Unable to process file type,Unable to process file type,Unable to process file type,Unable to process file type,Clean,Clean,Clean,Clean,Unable to process file type,Clean,Unable to process file type,Unable to process file type,Unable to process file type,Unable to process file type,Unable to process file type, ,n/a,n/a,n/a,n/a,n/a
Endgame,1,4,11,Unable to process file type,Unable to process file type,Unable to process file type,Unable to process file type,Unable to process file type,malicious (moderate confidence),Clean,Clean,Clean,Unable to process file type,Clean,Unable to process file type,Unable to process file type,Unable to process file type,Unable to process file type,Unable to process file type, ,n/a,n/a,n/a,n/a,n/a
Palo Alto Networks,0,6,10,Unable to process file type,Unable to process file type,Unable to process file type,Clean,Unable to process file type,Clean,Clean,Clean,Clean,Unable to process file type,Clean,Unable to process file type,Unable to process file type,Unable to process file type,Unable to process file type,Unable to process file type, ,n/a,n/a,n/a,n/a,n/a
SentinelOne,1,4,11,Unable to process file type,Unable to process file type,Unable to process file type,Unable to process file type,Unable to process file type,static engine - malicious,Clean,Clean,Clean,Unable to process file type,Clean,Unable to process file type,Unable to process file type,Unable to process file type,Unable to process file type,Unable to process file type, ,n/a,n/a,n/a,n/a,n/a
Sophos ML,0,5,11,Unable to process file type,Unable to process file type,Unable to process file type,Unable to process file type,Unable to process file type,Clean,Clean,Clean,Clean,Unable to process file type,Clean,Unable to process file type,Unable to process file type,Unable to process file type,Unable to process file type,Unable to process file type, ,n/a,n/a,n/a,n/a,n/a
Trapmine,1,4,11,Unable to process file type,Unable to process file type,Unable to process file type,Unable to process file type,Unable to process file type,malicious.moderate.ml.score,Clean,Clean,Clean,Unable to process file type,Clean,Unable to process file type,Unable to process file type,Unable to process file type,Unable to process file type,Unable to process file type, ,n/a,n/a,n/a,n/a,n/a
Trustlook,0,5,11,Unable to process file type,Unable to process file type,Unable to process file type,Unable to process file type,Unable to process file type,Clean,Clean,Clean,Clean,Unable to process file type,Clean,Unable to process file type,Unable to process file type,Unable to process file type,Unable to process file type,Unable to process file type, ,n/a,n/a,n/a,n/a,n/a
Webroot,0,5,11,Unable to process file type,Unable to process file type,Unable to process file type,Unable to process file type,Unable to process file type,Clean,Clean,Clean,Clean,Unable to process file type,Clean,Unable to process file type,Unable to process file type,Unable to process file type,Unable to process file type,Unable to process file type, ,n/a,n/a,n/a,n/a,n/a
Symantec Mobile Insight,0,0,16,error,Engine failure,Engine failure,Engine failure,Engine failure,Engine failure,Engine failure,Engine failure,Engine failure,Engine failure,Engine failure,Engine failure,Engine failure,Engine failure,Engine failure,Engine failure, ,n/a,n/a,n/a,n/a,n/a
AVware,0,1,15,error,error,error,error,Clean,error,error,error,error,error,error,error,error,error,error,error, ,n/a,n/a,n/a,n/a,n/a
