<?xml version="1.0" encoding="UTF-8"?><svg xmlns="http://www.w3.org/2000/svg" xmlns:xlink="http://www.w3.org/1999/xlink"
  viewBox="0 0 50 50" version="1.1">
  <path
    stroke = '#FFFFFF00'
    fill = '#FFFFFF'
    d="M25 1.984L8 5.172v13.183c0 .774.156 19.098 16.465 29.489l.535.343.54-.343C41.812 37.402 42 19.125 42 18.352V5.172zm0 2.032l15 2.812v1.969L25 5.984 10 8.797V6.828zm0 4l15 2.812v2.45A46.406 46.406 0 0 0 25 10.8c-6.707 0-11.91 1.36-15 2.445v-2.418zm0 4.785c5.164 0 10.207.867 15 2.586v2.965c0 .718-.176 17.546-15 27.457-14.855-9.864-15-26.73-15-27.457v-2.98c2.82-1.06 8.063-2.571 15-2.571zm.5 3.297c-.2.203-.402.5-.402 1-1.2 0-1.297.703-1.598.902-1.5.602-1.7.2-2.098.598-.203.203-.304.402-.304.601-.098.5.101.899.703.899.199 0 .597-.297.898-.297.5 0 1 .5 1.801.5.3 0 .598-.2 1.098-1-.2 1.101-.5 1.5-1.399 1.5-.101.699-.8 3.199-1.5 3.797-1.199.902-1.8 1.101-2.5 1.203-.101.101-.797 0-.898.297-.102.3-.102.504 0 .902 0 .398.199 1.098.5 2.098 0 .203.199.402.297.402.203.102.203.2.203.2.101 1 .601 1.5.601 1.5s.996-1.2.797-1.602c-.101-.2-.699-.399-.699-.399v-.398c-.102-.2-.602-1.602-.5-1.602h1.7s1.1 1.903 3.202 3.203c.297-.3.797-.804 1.598-.703-2 .2-2 2.403-1.5 3.301.7 1.398.7 1.7.598 2-.5.8-.598.898-.797 1.2-.102.198.097.3-.102.398-1 .5-1.199 1.304-1.199 1.304s1.7.2 2-.101c.102-.102.098-.602.098-.602s.402.102.5.102c.101-.102.304-.102.304-.203 0-.098.196-.496.196-.598.101-.398.601-1.3.902-1.5 0-.102-.5-.7-.5-1-.102-1.3 1-1.2 2.402-2.902.098-.2.297-.098.399-.098 2.601 0 2.3-2.102 2.699-4.402-.8.902-.8.402-.8.402-.102-.898.6-2.402.6-2.402s-1 .601-1.1 1.402c-.4-.8.3-2 .3-2-.398.2-.902.602-.902 2 0 3.602-.098 3.398-.399 4-.101.102-.398.102-.297-.2-.101-.398.098-1.3-2.304-2.702-1.098-.7-1.7-1.797-1.5-2.297.3.3 1.004.297 1.402.297-.3-.2-1-.7-1.2-1 .302.203 1.602.504 2 .304-.698-.3-1.6-1.004-1.8-1.402.2.2 1.3.398 1.8.2-.5-.2-1.3-.598-1.5-1.2.4.102.7.2 1.7 0-.8-.3-1.398-.902-1.7-1.3.302 0 1.302.1 1.7.398-.2-.598-1.102-1.098-1.8-1.598.198 0 1 .102 1.398 0-.399-.398-1.297-.8-1.399-1 .301 0 .7-.2.899-.402-1.297 0-1.5-1-2-1-.2-.098-.496-.797-.598-1zM20.7 21.3c-.2 0-2.2 1.797-2.2 1.898-.102.2-.098.301-.098.301-1 .3-1.304.902-1.304.902s1.3.797 1.601.5c.2-.203.301-.804.301-.804s.3.004.402-.098l.297-.3c.301-.302.899-.798.899-.798.203.2.8 1 1.101 1.399.2-.102.7-.5 1-1.102-.699-.8-1.5-1.898-2-1.898zm3.398 8.797C24 31.699 24.199 32.898 24 33c-.898.3-1.402-.102-1.8 0-.2.102-.098.3-.298.2-1.101-.2-1.703.398-1.703.398s1.203 1.402 1.602 1.304c.101 0 .5-.402.5-.402s.097.398.297.5c.101 0 .3.102.402 0 .102-.102.398-.3.5-.3.3-.2 1.402-.4 1.8-.4.102-.198.2-.402.102-.6 0 0-1-1-.5-2.9-.101-.1-.703-.6-.804-.702z"
    id="surface1" />
  <metadata>
    <rdf:RDF xmlns:rdf="http://www.w3.org/1999/02/22-rdf-syntax-ns#" xmlns:rdfs="http://www.w3.org/2000/01/rdf-schema#"
      xmlns:dc="http://purl.org/dc/elements/1.1/">
      <rdf:Description about="https://iconscout.com/legal#licenses" dc:title="ferrari" dc:description="ferrari"
        dc:publisher="Iconscout" dc:date="2017-12-09" dc:format="image/svg+xml" dc:language="en">
        <dc:creator>
          <rdf:Bag>
            <rdf:li>Icons8</rdf:li>
          </rdf:Bag>
        </dc:creator>
      </rdf:Description>
    </rdf:RDF>
  </metadata>
</svg>
