/Users/axelkefas/IdeaProjects/books/src/main/java/com/axel/books/web/rest/BooksController.java
/Users/axelkefas/IdeaProjects/books/src/main/java/com/axel/books/BooksApplication.java
/Users/axelkefas/IdeaProjects/books/src/main/java/com/axel/books/model/Books.java
/Users/axelkefas/IdeaProjects/books/src/main/java/com/axel/books/service/impl/BooksServiceImpl.java
/Users/axelkefas/IdeaProjects/books/src/main/java/com/axel/books/repository/BooksRepository.java
/Users/axelkefas/IdeaProjects/books/src/main/java/com/axel/books/dto/BooksDto.java
/Users/axelkefas/IdeaProjects/books/src/main/java/com/axel/books/service/BooksService.java
