Tier	Number of Files	Number of Annotations	Minimal Duration	Maximal Duration	Average Duration	Median Duration	Total Annotation Duration	Latency	
2_Answer	1	85	0.2	5.861	1.237	0.743	105.174	35.915	
2_Question	1	137	0.271	5.905	1.591	1.22	217.929	26.627	
1_Question	1	109	0.083	6.146	1.47	1.115	160.2	34.801	
1_Answer	1	126	0.206	8.851	1.217	0.826	153.352	27.742	
