annotator,item-22,item-53
../preprocessing/output/amy_axel_2020.json,,
../preprocessing/output/amy_alena_2020.json,TMP,TH
text,it's &sa +/. ,he just told me a little bit [/] uhm [/] I don't know.
time,290138.0,5387085.0
