Tier	Number of Files	Number of Annotations	Minimal Duration	Maximal Duration	Average Duration	Median Duration	Total Annotation Duration	Latency	
2_Answer	1	85	0.2	5.861	1.237	0.743	105.174	35.915	
2_Question	1	138	0.002	5.905	1.579	1.217	217.929	26.627	
1_Question	1	109	0.083	6.146	1.47	1.115	160.2	34.801	
1_Answer	1	126	0.206	8.851	1.217	0.826	153.352	27.742	
2_A_Type	1	85	0.2	5.861	1.237	0.743	105.174	35.915	
2_A_Form	1	55	0.2	5.861	1.184	0.593	65.107	91.233	
2_A_Feature	1	8	0.743	5.861	3.156	3.279	25.25	91.233	
2_A_Quoted	1	2	3.261	5.035	4.148	4.148	8.296	2056.321	
2_A_Multiple	1	0	0.0	0.0	0.0	0.0	0.0	0.0	
2_A_Implied_Form	1	10	0.66	5.284	1.976	1.814	19.758	86.675	
2_A_Mismatch	1	1	0.949	0.949	0.949	0.949	0.949	5319.219	
2_A_Phatic	1	34	0.267	2.768	0.79	0.568	26.869	35.915	
1_Q_Form	1	109	0.083	6.146	1.47	1.115	160.2	34.801	
2_Q_DISJ	1	3	2.312	3.943	3.076	2.972	9.227	286.833	
2_Q_Form	1	137	0.271	5.905	1.591	1.22	217.927	26.627	
2_Q_Feature	1	27	0.372	5.905	2.104	1.47	56.81	286.833	
2_Q_Quoted	1	7	1.486	5.905	2.958	2.909	20.703	1747.654	
2_Q_Phatic	1	71	0.271	4.178	1.272	0.864	90.294	30.92	
2_Q_Multiple	1	0	0.0	0.0	0.0	0.0	0.0	0.0	
2_Q_Implied_Form	1	19	0.372	5.286	1.649	1.402	31.332	246.338	
2_Q_Clarification	1	3	0.827	4.087	2.111	1.42	6.334	2185.877	
1_Q_DISJ	1	1	3.427	3.427	3.427	3.427	3.427	1261.966	
1_Q_Feature	1	23	0.118	6.146	1.972	1.486	45.362	90.612	
1_Q_Quoted	1	10	0.118	6.146	3.208	3.074	32.076	34.801	
1_Q_Phatic	1	48	0.083	5.118	1.205	0.845	57.836	152.944	
1_Q_Multiple	1	2	2.517	3.632	3.075	3.074	6.149	2378.643	
1_Q_Implied_Form	1	11	0.118	4.913	1.435	1.403	15.786	260.993	
1_Q_Clarification	1	3	0.118	1.319	0.658	0.538	1.975	2120.268	
1_A_Type	1	126	0.206	8.851	1.217	0.826	153.352	27.742	
1_A_Form	1	81	0.283	8.851	1.321	0.865	107.032	27.742	
1_A_Feature	1	18	0.371	8.851	2.055	1.231	36.997	290.138	
1_A_Quoted	1	3	0.387	2.516	1.175	0.622	3.525	38.804	
1_A_Multiple	1	0	0.0	0.0	0.0	0.0	0.0	0.0	
1_A_Implied_Form	1	12	0.288	3.222	1.357	1.115	16.287	171.026	
1_A_Mismatch	1	0	0.0	0.0	0.0	0.0	0.0	0.0	
1_A_Phatic	1	56	0.206	3.138	0.701	0.558	39.265	31.829	
