annotator,item-15,item-16,item-17,item-25,item-26,item-27,item-31,item-38,item-47,item-51,item-9
../preprocessing/output/amy_alena.json,PQ,YN,YN,DQ,PQ,,PQ,PQ,PQ,PQ,PQ
../preprocessing/output/amy_andrea.json,YN,PQ,PQ,CS,,PQ,YN,YN,YN,YN,YN
text,are they? ,go? ,"yeah, do you really? ",you go through four years of regular school and then to art school or ⌈what⌉? ,that would be great.  you know? ,you know? ,no? ,really? ,⌊did you⌋ really? ,really? ,"+, and then everybody had to get it? "
time,252077.0,260993.0,273725.0,1261966.0,1275462.0,1276743.0,5055807.0,5196945.0,5346690.0,5355962.0,179421.0
