annotator,item-28,item-29,item-49,item-50,item-51,item-55,item-56,item-57,item-58,item-59
../preprocessing/output/amy_andrea.json,SQ,,SQ,SQ,,SQ,SQ,,SQ,
../preprocessing/output/amy_aria.json,,SQ,,,SQ,,,SQ,,SQ
text,or anyone ⌈who⌉.  knows anyone who goes ⌈there⌉? ,knows anyone who goes ⌈there⌉? ,how's he doing? ,"⌈what's his⌉ +/.  +, major anyway? ","+, major anyway? ",⌊really⌋? ,(be)cause he [/] he doesn't want to [/] he's like [/] (be)cause I said “don't people always say what are you gonna teach”? ,“don't people always say what are you gonna teach”?,“no I don't want to teach” you know? ,you know? 
time,1327313.0,1328428.0,5352534.0,5353649.0,5354392.0,5384113.0,5399057.0,5401012.0,5404835.0,5405587.0
