annotator,item-1,item-18,item-20,item-21,item-24,item-28,item-36,item-37,item-39,item-40,item-41,item-44,item-47,item-48,item-49,item-5,item-50,item-51,item-6
../preprocessing/output/amy_axel.json,,DA,,,PHA,,PA,,,PHA,,PA,UA,,PA,PA,,PHA,
../preprocessing/output/amy_aria.json,PHA,UA,UA,PHA,UT,UT,,PA,UA,,PHA,,,UA,,,PA,,PA
text,&=laugh . ,I don't have any plans. ,Tuesday or Wednesday. ,yeah. ,you just stay. ,or science &=laugh . ,I can after three. ,"I can after three.  (2.) yeah, spring ninty two I can graduate.  (2.) as long as I get all my classes. ","oh, no that I don't know. ",it's true. ,it's true.  very true. ,yeah I did. ,he's [/] used to be shy::. ,he's [/] used to be shy::.  and he's not shy anymore +/. ,he talked a lot. ,⌊oh yeah⌋. ,he talked a lot.  ⌈yeah⌉. ,mhm mhm. ,⌊oh yeah⌋.  you have to for alterations. 
time,35915.0,304034.0,310928.0,392520.0,1277198.0,5056550.0,5208833.0,5208833.0,5226916.0,5280953.0,5280953.0,5346961.0,5377343.0,5377343.0,5382089.0,141881.0,5382089.0,5404546.0,141881.0
