annotator,item-14,item-42
../preprocessing/output/amy_axel_2020.json,,
../preprocessing/output/amy_alena_2020.json,YN,YN
text,&=laugh to see how horrendous I look? ,"+"" oh (.) as far as a masters ⌈program⌉? "
time,246338.0,5224687.0
