annotator,item-0,item-1,item-2,item-3,item-4,item-5,item-6,item-7,item-8,item-9,item-10,item-11,item-12,item-13,item-14,item-15,item-16,item-17,item-18,item-19,item-20,item-21,item-22,item-23,item-24,item-25,item-26,item-27,item-28,item-29,item-30,item-31,item-32,item-33,item-34,item-35,item-36,item-37,item-38,item-39,item-40,item-41,item-42,item-43,item-44,item-45,item-46,item-47,item-48,item-49,item-50,item-51,item-52,item-53,item-54,item-55,item-56,item-57,item-58,item-59,item-60,item-61
../preprocessing/output/amy_axel.json,,,,,,CH,,,,,,,,,,,,,,TH,TMP,,,,TH,TH,,,,,,,,,CH,,,,,,AG,,,,,,CH,,,,CH,,,,CH,,,,,,,TH
../preprocessing/output/amy_alena.json,,,,,,CH,,,,,,,,,,,,,TMP,TH,TMP,,,,TH,,,,,,,,,,CH,,,,,,AG,,,,,,RE,,,,CH,TH,,,TH,,,,,,,TH
text,⌊making⌋ an evening of it? ,oh really? ,“so [/] so you're gonna be home then”? ,“or will you be just gonna hangin around with Brianne”? ,does it? ,⌊what colour⌋ is it? ,you have to pay for ⌈all this⌉? ,right? ,⌊oh d'you⌋ have a white shirt ? ,"+, and then everybody had to get it? ",buying them you know? ,did you? ,you want me to go? ,"+, you will? ",&=laugh to see how horrendous I look? ,are they? ,go? ,"yeah, do you really? ",w [/] is the wedding on Sunday or is it Saturday? ,what are your plans now? ,when will you guys get off? ,did you get a new sweater? ,(2.) huh? ,oh yeah? ,⌊yeah⌋ so what are your options for that? ,you go through four years of regular school and then to art school or ⌈what⌉? ,that would be great.  you know? ,you know? ,⌊do you⌋ know anyone that goes there? ,or anyone ⌈who⌉.  knows anyone who goes ⌈there⌉? ,knows anyone who goes ⌈there⌉? ,kind of goony but ⌈you know⌉? ,no? ,⌊do you⌋ need to? ,"yeah, how much? ",two classes? ,you know? ,so I hope I can [/] I hope I can fill [/] like fulfill you know? ,(1.) you know? ,really? ,who wants to work? ,(2.) so are you gonna be done after four years or? ,you'll be done? ,but I mean y[/] you not gonna go on? ,"+"" oh (.) as far as a masters ⌈program⌉? ",you know? ,so (.) what's the point? ,you know? ,⌊did you⌋ really? ,++ really? ,how's he doing? ,"⌈what's his⌉ +/.  +, major anyway? ","+, major anyway? ",really? ,tell me (.) what if he say? ,++ really? ,⌊really⌋? ,(be)cause he [/] he doesn't want to [/] he's like [/] (be)cause I said “don't people always say what are you gonna teach”? ,“don't people always say what are you gonna teach”? ,“no I don't want to teach” you know? ,you know? ,what [/] what d[/] what does he want to do? 
time,26627.0,30920.0,34801.0,36742.0,86403.0,90612.0,140107.0,152944.0,168631.0,179421.0,186108.0,215169.0,218308.0,232425.0,246338.0,252077.0,260993.0,273725.0,286833.0,302631.0,306096.0,356340.0,358075.0,391983.0,1260563.0,1261966.0,1275462.0,1276743.0,1325456.0,1327313.0,1328428.0,5031575.0,5055807.0,5059484.0,5060515.0,5062494.0,5107698.0,5110298.0,5168543.0,5196945.0,5201980.0,5202889.0,5208379.0,5222914.0,5224687.0,5280498.0,5317567.0,5334618.0,5346690.0,5352163.0,5352534.0,5353649.0,5354392.0,5355962.0,5376145.0,5381718.0,5384113.0,5399057.0,5401012.0,5404835.0,5405587.0,5406692.0
