annotator,item-26,item-27,item-29,item-30,item-51,item-52,item-56,item-57,item-58,item-59,item-60
../preprocessing/output/amy_axel.json,,SQ,,SQ,,SQ,,,SQ,,SQ
../preprocessing/output/amy_alena.json,SQ,,SQ,,SQ,,SQ,SQ,,SQ,
text,that would be great.  you know? ,you know? ,or anyone ⌈who⌉.  knows anyone who goes ⌈there⌉? ,knows anyone who goes ⌈there⌉? ,"⌈what's his⌉ +/.  +, major anyway? ","+, major anyway? ",⌊really⌋? ,(be)cause he [/] he doesn't want to [/] he's like [/] (be)cause I said “don't people always say what are you gonna teach”? ,“don't people always say what are you gonna teach”? ,“no I don't want to teach” you know? ,you know? 
time,1275462.0,1276743.0,1327313.0,1328428.0,5353649.0,5354392.0,5384113.0,5399057.0,5401012.0,5404835.0,5405587.0
