annotator,item-104,item-105,item-107,item-108,item-109,item-110,item-112,item-12,item-13,item-27,item-41,item-44,item-47,item-55,item-56,item-58,item-59,item-6,item-62,item-66,item-68,item-71,item-72,item-79,item-81,item-82,item-88,item-89,item-93,item-95,item-98
../preprocessing/output/amy_aria.json,NQ,,NQ,,,,,NQ,,NQ,NQ,,NQ,,NQ,NQ,,NQ,NQ,NQ,,NQ,,NQ,NQ,,NQ,,NQ,,
../preprocessing/output/amy_gosse.json,,NQ,,NQ,NQ,NQ,QQ,,NQ,QQ,,NQ,,NQ,,,NQ,QQ,,,NQ,,NQ,,,NQ,,NQ,,NQ,NQ
text,he's [/] used to be shy::.  and he's not shy anymore +/. ,he's [/] used to be shy::. ,he talked a lot.  ⌈yeah⌉. ,⌈yeah⌉. ,⌊really⌋? ,++ yeah. ,“no I don't want to teach”,⌊oh yeah⌋.  you have to for alterations. ,⌊oh yeah⌋. ,&=laugh to see how horrendous I look? ,Tuesday or Wednesday. ,(4.) all right. ,oh yeah. ,or anyone ⌈who⌉.  knows anyone who goes ⌈there⌉? ,knows anyone who goes ⌈there⌉? ,kind of goony but ⌈you know⌉? ,⌈you know⌉? ,I'm like “yeah”. ,or science &=laugh . ,uhm +... ,(1.) something like that. ,so I hope I can [/] I hope I can fill [/] like fulfill you know? ,like fulfill you know? ,"yeah, I can make it three. ","I can after three.  (2.) yeah, spring ninty two I can graduate.  (2.) as long as I get all my classes. ","(2.) yeah, spring ninty two I can graduate. ",it's true.  very true. ,it's true. ,mhm mhm. ,yeah I did. ,⌊pretty good⌋. 
time,5377343.0,5377343.0,5382089.0,5383741.0,5384113.0,5385887.0,5404837.0,141881.0,141881.0,246338.0,310928.0,360137.0,1252816.0,1327313.0,1328428.0,5031575.0,5033016.0,38804.0,5056550.0,5061630.0,5063487.0,5110298.0,5113114.0,5206810.0,5208833.0,5210608.0,5280953.0,5280953.0,5340562.0,5346961.0,5354020.0
