annotator,item-26,item-27,item-29,item-30,item-31,item-32,item-38,item-39,item-52,item-53,item-54,item-58,item-59,item-60,item-61,item-62,item-63
../preprocessing/output/amy_axel.json,,SQ,,SQ,SQ,,SQ,,SQ,,SQ,,,SQ,,,SQ
../preprocessing/output/amy_alena.json,SQ,,SQ,,SQ,,SQ,,SQ,SQ,,SQ,SQ,,,SQ,
../preprocessing/output/amy_andrea.json,,SQ,SQ,,SQ,,SQ,,SQ,SQ,,SQ,SQ,,,SQ,
../preprocessing/output/amy_aria.json,,SQ,,SQ,SQ,,SQ,,,,SQ,,,,SQ,,SQ
../preprocessing/output/amy_gosse.json,,SQ,SQ,,,SQ,,SQ,SQ,,SQ,SQ,,,SQ,,SQ
text,that would be great.  you know? ,you know? ,or anyone ⌈who⌉.  knows anyone who goes ⌈there⌉? ,knows anyone who goes ⌈there⌉? ,kind of goony but ⌈you know⌉? ,⌈you know⌉? ,so I hope I can [/] I hope I can fill [/] like fulfill you know? ,like fulfill you know? ,how's he doing? ,"⌈what's his⌉ +/.  +, major anyway? ","+, major anyway? ",⌊really⌋? ,(be)cause he [/] he doesn't want to [/] he's like [/] (be)cause I said “don't people always say what are you gonna teach”? ,“don't people always say what are you gonna teach”? ,“don't people always say what are you gonna teach”?,“no I don't want to teach” you know? ,you know? 
time,1275462.0,1276743.0,1327313.0,1328428.0,5031575.0,5033016.0,5110298.0,5113114.0,5352534.0,5353649.0,5354392.0,5384113.0,5399057.0,5401012.0,5401012.0,5404835.0,5405587.0
