annotator,item-0,item-1,item-2,item-3,item-4,item-5,item-6,item-7,item-8,item-9,item-10,item-11,item-12,item-13,item-14,item-15,item-16,item-17,item-18,item-19,item-20,item-21,item-22,item-23,item-24,item-25,item-26,item-27,item-28,item-29,item-30,item-31,item-32,item-33,item-34,item-35,item-36,item-37,item-38,item-39,item-40,item-41,item-42,item-43,item-44,item-45,item-46,item-47,item-48,item-49,item-50
../preprocessing/output/amy_axel.json,PA,,PA,PA,FA,PA,PHA,PA,PA,PHA,PA,PA,NA,PA,PHA,PA,UA,DA,UA,,,PHA,FA,PHA,NA,NA,PA,,PA,PHA,UA,PHA,PA,PHA,PA,PA,PA,,PHA,PHA,PHA,PA,,PA,PHA,UA,PA,,,PHA,UA
../preprocessing/output/amy_andrea.json,PA,PHA,PA,PA,FA,PA,PHA,PA,PA,PHA,PA,PA,NA,PA,PHA,PHA,UA,DA,UT,PA,PHA,PHA,UA,,NA,NA,,UT,PA,PHA,PA,PHA,PHA,PA,PA,UT,PA,UA,,PHA,,PA,FA,FA,PA,UT,,PHA,PHA,,UA
text,making an evening of it. ,&=laugh . ,I'm like “yeah”. ,in my opinion. ,it's midnight blue. ,⌊oh yeah⌋. ,mhm mhm. ,yeah . ,"yeah, like this [/] my mum's part was well it would be different if they were paying for them you ⌈know⌉ +/. ",yeah. ,yes. ,yes. ,no no. ,they probably plan to go. ,go. ,yeah. ,its [/] I don't even know. ,I don't have any plans. ,my last exam is like [/] (.) I don't know. ,(4.) all right. ,yeah. ,oh yeah. ,⌊that⌋ or else I transfer to a university that has a stronger art department. ,you just stay. ,no. ,⌊no⌋ &=laugh . ,"⌊yeah⌋, he likes ⌈kids⌉. ",or science &=laugh . ,yeah. ,uhm +... ,(1.) something like that. ,mhm mhm. ,"yeah, (3.) yeah. ",yeah. ,"yeah, I can make it three. ",I can after three. ,⌊yeah⌋. ,"oh, no that I don't know. ",it's true. ,yeah. ,mhm mhm. ,yeah I did. ,⌊pretty good⌋. ,he's majoring in English. ,yeah! ,he's [/] used to be shy::. ,he talked a lot. ,⌈yeah⌉. ,++ yeah. ,mhm mhm. ,he doesn't know ⌈exactly⌉. 
time,27742.0,35915.0,38804.0,86675.0,91233.0,141881.0,153415.0,170739.0,180619.0,187760.0,219589.0,232881.0,248279.0,252532.0,261570.0,274739.0,289145.0,304034.0,307210.0,360137.0,392520.0,1252816.0,1265393.0,1277198.0,1326487.0,1329171.0,5033683.0,5056550.0,5060060.0,5061630.0,5063487.0,5108275.0,5114097.0,5197316.0,5206810.0,5208833.0,5226629.0,5226916.0,5280953.0,5319219.0,5340562.0,5346961.0,5354020.0,5355052.0,5356826.0,5377343.0,5382089.0,5383741.0,5385887.0,5404546.0,5408057.0
