annotator,item-11,item-15,item-22,item-38,item-44,item-46
../preprocessing/output/amy_axel_2020.json,,,PHA,,,
../preprocessing/output/amy_alena_2020.json,PHA,PHA,,PHA,PHA,PHA
text,did you? ,are they? ,(2.) huh? ,who wants to work? ,so (.) what's the point? ,⌊did you⌋ really? 
time,215169.0,252077.0,358075.0,5201980.0,5317567.0,5346690.0
