annotator,item-14,item-25,item-42
../preprocessing/output/amy_axel_2020.json,YN,WH,YN
../preprocessing/output/amy_alena_2020.json,None,Other,RDC
text,&=laugh to see how horrendous I look? ,you go through four years of regular school and then to art school or ⌈what⌉? ,"+"" oh (.) as far as a masters ⌈program⌉? "
time,246338.0,1261966.0,5224687.0
