annotator,item-25,item-29,item-30,item-31,item-36,item-37,item-39,item-40,item-46,item-48,item-51,item-52,item-53,item-57,item-58,item-59,item-60
../preprocessing/output/amy_andrea.json,CS,PQ,,YN,PQ,,YN,WH,WH,YN,WH,,YN,YN,,PQ,
../preprocessing/output/amy_gosse.json,YN,,PQ,PQ,,PQ,PQ,PQ,PQ,PQ,,WH,PQ,,YN,,PQ
text,you go through four years of regular school and then to art school or ⌈what⌉? ,kind of goony but ⌈you know⌉? ,⌈you know⌉? ,no? ,so I hope I can [/] I hope I can fill [/] like fulfill you know? ,like fulfill you know? ,really? ,who wants to work? ,so (.) what's the point? ,⌊did you⌋ really? ,"⌈what's his⌉ +/.  +, major anyway? ","+, major anyway? ",really? ,(be)cause he [/] he doesn't want to [/] he's like [/] (be)cause I said “don't people always say what are you gonna teach”? ,“don't people always say what are you gonna teach”?,“no I don't want to teach” you know? ,you know? 
time,1261966.0,5031575.0,5033016.0,5055807.0,5110298.0,5113114.0,5196945.0,5201980.0,5317567.0,5346690.0,5353649.0,5354392.0,5355962.0,5399057.0,5401012.0,5404835.0,5405587.0
