annotator,item-14,item-42
../preprocessing/output/amy_axel_2020.json,YN,YN
../preprocessing/output/amy_GOLD_2020.json,RDC,RDC
text,&=laugh to see how horrendous I look? ,"+"" oh (.) as far as a masters ⌈program⌉? "
time,246338.0,5224687.0
