annotator,item-1,item-12,item-22,item-34,item-40,item-42,item-43,item-44,item-53,item-56
../preprocessing/output/amy_axel_2020.json,YES,YES,YES,,YES,NO,YES,,,UNC
../preprocessing/output/amy_alena_2020.json,,,FEAT,UNC,,UNK,,YES,FEAT,UNK
text,that's so late to be ⌈home⌉. ,I have a wh[/] white ⌈shirt⌉. ,it's &sa +/. ,(1.) something like that. ,I can after three. ,"oh, no that I don't know. ",it's true. ,yeah. ,he just told me a little bit [/] uhm [/] I don't know.,he doesn't know ⌈exactly⌉. 
time,31829.0,171026.0,290138.0,5063487.0,5208833.0,5226916.0,5280953.0,5319219.0,5387085.0,5408057.0
