annotator,item-102,item-103,item-105,item-106,item-107,item-108,item-109,item-110,item-111,item-112,item-12,item-13,item-41,item-44,item-52,item-55,item-56,item-59,item-6,item-67,item-79,item-80,item-86,item-90,item-92,item-95,item-96,item-97
../preprocessing/output/amy_andrea.json,NQ,,,NQ,NQ,NQ,QQ,,NQ,,NQ,,,NQ,,NQ,,,QQ,NQ,NQ,,,,NQ,NQ,NQ,
../preprocessing/output/amy_aria.json,,NQ,NQ,,,,,QQ,,NQ,,NQ,NQ,,NQ,,NQ,NQ,NQ,,,NQ,NQ,NQ,,,,NQ
text,he's [/] used to be shy::. ,he's [/] used to be shy::.  and he's not shy anymore +/. ,he talked a lot.  ⌈yeah⌉. ,⌈yeah⌉. ,⌊really⌋? ,++ yeah. ,(be)cause he [/] he doesn't want to [/] he's like [/] (be)cause I said “don't people always say what are you gonna teach”? ,“don't people always say what are you gonna teach”?,“no I don't want to teach” you know? ,you know? ,⌊oh yeah⌋. ,⌊oh yeah⌋.  you have to for alterations. ,Tuesday or Wednesday. ,(4.) all right. ,you just stay. ,or anyone ⌈who⌉.  knows anyone who goes ⌈there⌉? ,knows anyone who goes ⌈there⌉? ,"⌊yeah⌋, he likes ⌈kids⌉. ",I'm like “yeah”. ,(1.) something like that. ,I can after three. ,"I can after three.  (2.) yeah, spring ninty two I can graduate.  (2.) as long as I get all my classes. ",it's true.  very true. ,mhm mhm. ,yeah I did. ,"⌈what's his⌉ +/.  +, major anyway? ",⌊pretty good⌋. ,"+, major anyway? "
time,5377343.0,5377343.0,5382089.0,5383741.0,5384113.0,5385887.0,5399057.0,5401012.0,5404835.0,5405587.0,141881.0,141881.0,310928.0,360137.0,1277198.0,1327313.0,1328428.0,5033683.0,38804.0,5063487.0,5208833.0,5208833.0,5280953.0,5340562.0,5346961.0,5353649.0,5354020.0,5354392.0
