annotator,item-34,item-43,item-44
../preprocessing/output/amy_alena_2020.json,,YES,Other
../preprocessing/output/amy_GOLD_2020.json,YES,,
text,(1.) something like that. ,it's true. ,yeah. 
time,5063487.0,5280953.0,5319219.0
