[
   {
      "annotation_type": "question",
      "text": "\u230amaking\u230b an evening of it? ",
      "speaker": "*BRI",
      "start_time": 26627.0,
      "stop_time": 27742.0,
      "question_type": "CS",
      "feature": null,
      "is_quoted": "NQ",
      "complexity": "SQ",
      "overlap_flag": false
   },
   {
      "annotation_type": "answer",
      "text": "making an evening of it. ",
      "speaker": "*ADD",
      "start_time": 27742.0,
      "stop_time": 29312.0,
      "answer_type": "PA",
      "is_quoted": "NQ",
      "overlap_flag": false
   },
   {
      "annotation_type": "question",
      "text": "oh really? ",
      "speaker": "*BRI",
      "start_time": 30920.0,
      "stop_time": 31829.0,
      "question_type": "PQ",
      "feature": null,
      "is_quoted": "NQ",
      "complexity": "SQ",
      "overlap_flag": false
   },
   {
      "annotation_type": "question",
      "text": "\u201cso [/] so you're gonna be home then\u201d? ",
      "speaker": "*ADD",
      "start_time": 34801.0,
      "stop_time": 35915.0,
      "question_type": "YN",
      "feature": null,
      "is_quoted": "QQ",
      "complexity": "SQ",
      "overlap_flag": false
   },
   {
      "annotation_type": "answer",
      "text": "&=laugh . ",
      "speaker": "*BRI",
      "start_time": 35915.0,
      "stop_time": 36742.0,
      "answer_type": "PHA",
      "is_quoted": "NQ",
      "overlap_flag": false
   },
   {
      "annotation_type": "question",
      "text": "\u201cor will you be just gonna hangin around with Brianne\u201d? ",
      "speaker": "*ADD",
      "start_time": 36742.0,
      "stop_time": 38804.0,
      "question_type": "YN",
      "feature": null,
      "is_quoted": "QQ",
      "complexity": "SQ",
      "overlap_flag": false
   },
   {
      "annotation_type": "answer",
      "text": "I'm like \u201cyeah\u201d. ",
      "speaker": "*ADD",
      "start_time": 38804.0,
      "stop_time": 39426.0,
      "answer_type": "PA",
      "is_quoted": "QQ",
      "overlap_flag": false
   },
   {
      "annotation_type": "question",
      "text": "does it? ",
      "speaker": "*ADD",
      "start_time": 86403.0,
      "stop_time": 86675.0,
      "question_type": "YN",
      "feature": null,
      "is_quoted": "NQ",
      "complexity": "SQ",
      "overlap_flag": false
   },
   {
      "annotation_type": "answer",
      "text": "in my opinion. ",
      "speaker": "*BRI",
      "start_time": 86675.0,
      "stop_time": 87351.0,
      "answer_type": "PA",
      "is_quoted": "NQ",
      "overlap_flag": false
   },
   {
      "annotation_type": "question",
      "text": "\u230awhat colour\u230b is it? ",
      "speaker": "*ADD",
      "start_time": 90612.0,
      "stop_time": 91233.0,
      "question_type": "WH",
      "feature": "CH",
      "is_quoted": "NQ",
      "complexity": "SQ",
      "overlap_flag": false
   },
   {
      "annotation_type": "answer",
      "text": "it's midnight blue. ",
      "speaker": "*BRI",
      "start_time": 91233.0,
      "stop_time": 92386.0,
      "answer_type": "FA",
      "is_quoted": "NQ",
      "overlap_flag": false
   },
   {
      "annotation_type": "question",
      "text": "you have to pay for \u2308all this\u2309? ",
      "speaker": "*ADD",
      "start_time": 140107.0,
      "stop_time": 141881.0,
      "question_type": "YN",
      "feature": null,
      "is_quoted": "NQ",
      "complexity": "SQ",
      "overlap_flag": false
   },
   {
      "annotation_type": "answer",
      "text": "\u230aoh yeah\u230b. ",
      "speaker": "*BRI",
      "start_time": 141881.0,
      "stop_time": 142114.0,
      "answer_type": "PA",
      "is_quoted": "NQ",
      "overlap_flag": false
   },
   {
      "annotation_type": "question",
      "text": "right? ",
      "speaker": "*ADD",
      "start_time": 152944.0,
      "stop_time": 153415.0,
      "question_type": "PQ",
      "feature": null,
      "is_quoted": "NQ",
      "complexity": "SQ",
      "overlap_flag": false
   },
   {
      "annotation_type": "answer",
      "text": "mhm mhm. ",
      "speaker": "*BRI",
      "start_time": 153415.0,
      "stop_time": 154141.0,
      "answer_type": "PHA",
      "is_quoted": "NQ",
      "overlap_flag": false
   },
   {
      "annotation_type": "question",
      "text": "\u230aoh d'you\u230b have a white shirt ? ",
      "speaker": "*ADD",
      "start_time": 168631.0,
      "stop_time": 170739.0,
      "question_type": "YN",
      "feature": null,
      "is_quoted": "QQ",
      "complexity": "SQ",
      "overlap_flag": false
   },
   {
      "annotation_type": "answer",
      "text": "yeah . ",
      "speaker": "*ADD",
      "start_time": 170739.0,
      "stop_time": 171026.0,
      "answer_type": "YA",
      "is_quoted": "QQ",
      "overlap_flag": false
   },
   {
      "annotation_type": "question",
      "text": "+, and then everybody had to get it? ",
      "speaker": "*ADD",
      "start_time": 179421.0,
      "stop_time": 180619.0,
      "question_type": "YN",
      "feature": null,
      "is_quoted": "NQ",
      "complexity": "SQ",
      "overlap_flag": false
   },
   {
      "annotation_type": "answer",
      "text": "yeah, like this [/] my mum's part was well it would be different if they were paying for them you \u2308know\u2309 +/. ",
      "speaker": "*BRI",
      "start_time": 180619.0,
      "stop_time": 185077.0,
      "answer_type": "PA",
      "is_quoted": "NQ",
      "overlap_flag": false
   },
   {
      "annotation_type": "question",
      "text": "buying them you know? ",
      "speaker": "*BRI",
      "start_time": 186108.0,
      "stop_time": 187760.0,
      "question_type": "PQ",
      "feature": null,
      "is_quoted": "NQ",
      "complexity": "SQ",
      "overlap_flag": false
   },
   {
      "annotation_type": "answer",
      "text": "yeah. ",
      "speaker": "*ADD",
      "start_time": 187760.0,
      "stop_time": 188337.0,
      "answer_type": "PHA",
      "is_quoted": "NQ",
      "overlap_flag": false
   },
   {
      "annotation_type": "question",
      "text": "did you? ",
      "speaker": "*BRI",
      "start_time": 215169.0,
      "stop_time": 216284.0,
      "question_type": "YN",
      "feature": null,
      "is_quoted": "NQ",
      "complexity": "SQ",
      "overlap_flag": false
   },
   {
      "annotation_type": "question",
      "text": "you want me to go? ",
      "speaker": "*ADD",
      "start_time": 218308.0,
      "stop_time": 219589.0,
      "question_type": "YN",
      "feature": null,
      "is_quoted": "NQ",
      "complexity": "SQ",
      "overlap_flag": false
   },
   {
      "annotation_type": "answer",
      "text": "yes. ",
      "speaker": "*BRI",
      "start_time": 219589.0,
      "stop_time": 220182.0,
      "answer_type": "PA",
      "is_quoted": "NQ",
      "overlap_flag": false
   },
   {
      "annotation_type": "question",
      "text": "+, you will? ",
      "speaker": "*ADD",
      "start_time": 232425.0,
      "stop_time": 232881.0,
      "question_type": "YN",
      "feature": null,
      "is_quoted": "NQ",
      "complexity": "SQ",
      "overlap_flag": false
   },
   {
      "annotation_type": "answer",
      "text": "yes. ",
      "speaker": "*BRI",
      "start_time": 232881.0,
      "stop_time": 233374.0,
      "answer_type": "PA",
      "is_quoted": "NQ",
      "overlap_flag": false
   },
   {
      "annotation_type": "question",
      "text": "&=laugh to see how horrendous I look? ",
      "speaker": "*BRI",
      "start_time": 246338.0,
      "stop_time": 248279.0,
      "question_type": "CS",
      "feature": null,
      "is_quoted": "QQ",
      "complexity": "SQ",
      "overlap_flag": false
   },
   {
      "annotation_type": "answer",
      "text": "no no. ",
      "speaker": "*ADD",
      "start_time": 248279.0,
      "stop_time": 249105.0,
      "answer_type": "NA",
      "is_quoted": "NQ",
      "overlap_flag": false
   },
   {
      "annotation_type": "question",
      "text": "are they? ",
      "speaker": "*ADD",
      "start_time": 252077.0,
      "stop_time": 252532.0,
      "question_type": "YN",
      "feature": null,
      "is_quoted": "NQ",
      "complexity": "SQ",
      "overlap_flag": false
   },
   {
      "annotation_type": "answer",
      "text": "they probably plan to go. ",
      "speaker": "*BRI",
      "start_time": 252532.0,
      "stop_time": 253951.0,
      "answer_type": "PA",
      "is_quoted": "NQ",
      "overlap_flag": false
   },
   {
      "annotation_type": "question",
      "text": "go? ",
      "speaker": "*ADD",
      "start_time": 260993.0,
      "stop_time": 261570.0,
      "question_type": "PQ",
      "feature": null,
      "is_quoted": "NQ",
      "complexity": "SQ",
      "overlap_flag": false
   },
   {
      "annotation_type": "answer",
      "text": "go. ",
      "speaker": "*BRI",
      "start_time": 261570.0,
      "stop_time": 262192.0,
      "answer_type": "PHA",
      "is_quoted": "NQ",
      "overlap_flag": false
   },
   {
      "annotation_type": "question",
      "text": "yeah, do you really? ",
      "speaker": "*ADD",
      "start_time": 273725.0,
      "stop_time": 274739.0,
      "question_type": "PQ",
      "feature": null,
      "is_quoted": "NQ",
      "complexity": "SQ",
      "overlap_flag": false
   },
   {
      "annotation_type": "answer",
      "text": "yeah. ",
      "speaker": "*BRI",
      "start_time": 274739.0,
      "stop_time": 275195.0,
      "answer_type": "PHA",
      "is_quoted": "NQ",
      "overlap_flag": false
   },
   {
      "annotation_type": "question",
      "text": "w [/] is the wedding on Sunday or is it Saturday? ",
      "speaker": "*BRI",
      "start_time": 286833.0,
      "stop_time": 289145.0,
      "question_type": "DQ",
      "feature": "TMP",
      "is_quoted": "NQ",
      "complexity": "SQ",
      "overlap_flag": false
   },
   {
      "annotation_type": "answer",
      "text": "its [/] I don't even know. ",
      "speaker": "*ADD",
      "start_time": 289145.0,
      "stop_time": 290138.0,
      "answer_type": "UA",
      "is_quoted": "NQ",
      "overlap_flag": false
   },
   {
      "annotation_type": "question",
      "text": "what are your plans now? ",
      "speaker": "*BRI",
      "start_time": 302631.0,
      "stop_time": 304034.0,
      "question_type": "WH",
      "feature": "TH",
      "is_quoted": "NQ",
      "complexity": "SQ",
      "overlap_flag": false
   },
   {
      "annotation_type": "answer",
      "text": "I don't have any plans. ",
      "speaker": "*ADD",
      "start_time": 304034.0,
      "stop_time": 306096.0,
      "answer_type": "DA",
      "is_quoted": "NQ",
      "overlap_flag": false
   },
   {
      "annotation_type": "question",
      "text": "when will you guys get off? ",
      "speaker": "*BRI",
      "start_time": 306096.0,
      "stop_time": 307210.0,
      "question_type": "WH",
      "feature": "TMP",
      "is_quoted": "NQ",
      "complexity": "SQ",
      "overlap_flag": false
   },
   {
      "annotation_type": "answer",
      "text": "my last exam is like [/] (.) I don't know. ",
      "speaker": "*ADD",
      "start_time": 307210.0,
      "stop_time": 310925.0,
      "answer_type": "UT",
      "is_quoted": "NQ",
      "overlap_flag": false
   },
   {
      "annotation_type": "question",
      "text": "did you get a new sweater? ",
      "speaker": "*BRI",
      "start_time": 356340.0,
      "stop_time": 358075.0,
      "question_type": "YN",
      "feature": null,
      "is_quoted": "NQ",
      "complexity": "SQ",
      "overlap_flag": false
   },
   {
      "annotation_type": "question",
      "text": "(2.) huh? ",
      "speaker": "*BRI",
      "start_time": 358075.0,
      "stop_time": 360137.0,
      "question_type": "PQ",
      "feature": null,
      "is_quoted": "NQ",
      "complexity": "SQ",
      "overlap_flag": false
   },
   {
      "annotation_type": "answer",
      "text": "(4.) all right. ",
      "speaker": "*ADD",
      "start_time": 360137.0,
      "stop_time": 362366.0,
      "answer_type": "PHA",
      "is_quoted": "NQ",
      "overlap_flag": false
   },
   {
      "annotation_type": "question",
      "text": "oh yeah? ",
      "speaker": "*ADD",
      "start_time": 391983.0,
      "stop_time": 392520.0,
      "question_type": "PQ",
      "feature": null,
      "is_quoted": "NQ",
      "complexity": "SQ",
      "overlap_flag": false
   },
   {
      "annotation_type": "answer",
      "text": "yeah. ",
      "speaker": "*BRI",
      "start_time": 392520.0,
      "stop_time": 393469.0,
      "answer_type": "PHA",
      "is_quoted": "NQ",
      "overlap_flag": false
   },
   {
      "annotation_type": "question",
      "text": "are you going too? ",
      "speaker": "*ADD",
      "start_time": 440818.0,
      "stop_time": 441478.0,
      "question_type": "YN",
      "feature": null,
      "is_quoted": "NQ",
      "complexity": "SQ",
      "overlap_flag": false
   },
   {
      "annotation_type": "answer",
      "text": "I can't because [/] uhm +/. ",
      "speaker": "*BRI",
      "start_time": 441478.0,
      "stop_time": 442675.0,
      "answer_type": "NA",
      "is_quoted": "NQ",
      "overlap_flag": false
   },
   {
      "annotation_type": "question",
      "text": "\u2308you're going to a different wedding\u2309.  \u230aI'll be leaving tomorrow\u230b.  +, right? ",
      "speaker": "*ADD",
      "start_time": 443505.0,
      "stop_time": 445565.0,
      "question_type": "CS",
      "feature": null,
      "is_quoted": "NQ",
      "complexity": "SQ",
      "overlap_flag": true
   },
   {
      "annotation_type": "answer",
      "text": "\u2308yeah\u2309. ",
      "speaker": "*BRI",
      "start_time": 445565.0,
      "stop_time": 446019.0,
      "answer_type": "PA",
      "is_quoted": "NQ",
      "overlap_flag": false
   },
   {
      "annotation_type": "question",
      "text": "\u230aoh really\u230b? ",
      "speaker": "*BRI",
      "start_time": 762696.0,
      "stop_time": 763272.0,
      "question_type": "PQ",
      "feature": null,
      "is_quoted": "NQ",
      "complexity": "SQ",
      "overlap_flag": false
   },
   {
      "annotation_type": "answer",
      "text": "uh huh. ",
      "speaker": "*BRI",
      "start_time": 764842.0,
      "stop_time": 765230.0,
      "answer_type": "PHA",
      "is_quoted": "NQ",
      "overlap_flag": false
   },
   {
      "annotation_type": "question",
      "text": "you know? ",
      "speaker": "*ADD",
      "start_time": 847858.0,
      "stop_time": 848684.0,
      "question_type": "PQ",
      "feature": null,
      "is_quoted": "NQ",
      "complexity": "SQ",
      "overlap_flag": false
   },
   {
      "annotation_type": "answer",
      "text": "of course. ",
      "speaker": "*BRI",
      "start_time": 848684.0,
      "stop_time": 849260.0,
      "answer_type": "PHA",
      "is_quoted": "NQ",
      "overlap_flag": false
   },
   {
      "annotation_type": "question",
      "text": "so [/] wh [/] where can you move to? ",
      "speaker": "*ADD",
      "start_time": 858343.0,
      "stop_time": 860079.0,
      "question_type": "WH",
      "feature": "LOC",
      "is_quoted": "NQ",
      "complexity": "SQ",
      "overlap_flag": false
   },
   {
      "annotation_type": "answer",
      "text": "well (.) you see (.) I don't even know where I'm living \u2308next year\u2309. ",
      "speaker": "*BRI",
      "start_time": 860079.0,
      "stop_time": 863423.0,
      "answer_type": "UT",
      "is_quoted": "NQ",
      "overlap_flag": false
   },
   {
      "annotation_type": "question",
      "text": "just for the hell of it? ",
      "speaker": "*ADD",
      "start_time": 881832.0,
      "stop_time": 883235.0,
      "question_type": "CS",
      "feature": null,
      "is_quoted": "NQ",
      "complexity": "SQ",
      "overlap_flag": false
   },
   {
      "annotation_type": "answer",
      "text": "yeah. ",
      "speaker": "*BRI",
      "start_time": 883235.0,
      "stop_time": 883607.0,
      "answer_type": "PA",
      "is_quoted": "NQ",
      "overlap_flag": false
   },
   {
      "annotation_type": "question",
      "text": "just for the [/] did I tell you about that? ",
      "speaker": "*BRI",
      "start_time": 883607.0,
      "stop_time": 884683.0,
      "question_type": "YN",
      "feature": null,
      "is_quoted": "NQ",
      "complexity": "SQ",
      "overlap_flag": false
   },
   {
      "annotation_type": "answer",
      "text": "no. ",
      "speaker": "*ADD",
      "start_time": 884683.0,
      "stop_time": 885093.0,
      "answer_type": "NA",
      "is_quoted": "NQ",
      "overlap_flag": false
   },
   {
      "annotation_type": "question",
      "text": "going looking for apartments? ",
      "speaker": "*BRI",
      "start_time": 885093.0,
      "stop_time": 886540.0,
      "question_type": "YN",
      "feature": null,
      "is_quoted": "NQ",
      "complexity": "SQ",
      "overlap_flag": false
   },
   {
      "annotation_type": "answer",
      "text": "no! ",
      "speaker": "*ADD",
      "start_time": 886540.0,
      "stop_time": 887116.0,
      "answer_type": "NA",
      "is_quoted": "NQ",
      "overlap_flag": false
   },
   {
      "annotation_type": "question",
      "text": "so [/] \u2308you know\u2309? ",
      "speaker": "*BRI",
      "start_time": 896117.0,
      "stop_time": 897147.0,
      "question_type": "PQ",
      "feature": null,
      "is_quoted": "NQ",
      "complexity": "SQ",
      "overlap_flag": false
   },
   {
      "annotation_type": "answer",
      "text": "\u230auhhuh\u230b. ",
      "speaker": "*ADD",
      "start_time": 897147.0,
      "stop_time": 897353.0,
      "answer_type": "PHA",
      "is_quoted": "NQ",
      "overlap_flag": false
   },
   {
      "annotation_type": "question",
      "text": "\u230awhich\u230b is pretty small but still bigger than a dorm room you know? ",
      "speaker": "*BRI",
      "start_time": 946699.0,
      "stop_time": 950131.0,
      "question_type": "PQ",
      "feature": null,
      "is_quoted": "NQ",
      "complexity": "SQ",
      "overlap_flag": false
   },
   {
      "annotation_type": "answer",
      "text": "uhhuh. ",
      "speaker": "*ADD",
      "start_time": 950131.0,
      "stop_time": 950669.0,
      "answer_type": "PHA",
      "is_quoted": "NQ",
      "overlap_flag": false
   },
   {
      "annotation_type": "question",
      "text": "\u230ayeah\u230b so what are your options for that? ",
      "speaker": "*ADD",
      "start_time": 1260563.0,
      "stop_time": 1261966.0,
      "question_type": "WH",
      "feature": "TH",
      "is_quoted": "NQ",
      "complexity": "SQ",
      "overlap_flag": false
   },
   {
      "annotation_type": "question",
      "text": "you go through four years of regular school and then to art school or \u2308what\u2309? ",
      "speaker": "*ADD",
      "start_time": 1261966.0,
      "stop_time": 1265393.0,
      "question_type": "YN",
      "feature": null,
      "is_quoted": "NQ",
      "complexity": "SQ",
      "overlap_flag": false
   },
   {
      "annotation_type": "answer",
      "text": "\u230athat\u230b or else I transfer to a university that has a stronger art department. ",
      "speaker": "*BRI",
      "start_time": 1265393.0,
      "stop_time": 1269972.0,
      "answer_type": "PA",
      "is_quoted": "NQ",
      "overlap_flag": false
   },
   {
      "annotation_type": "question",
      "text": "you know? ",
      "speaker": "*BRI",
      "start_time": 1276743.0,
      "stop_time": 1277198.0,
      "question_type": "PQ",
      "feature": null,
      "is_quoted": "NQ",
      "complexity": "SQ",
      "overlap_flag": false
   },
   {
      "annotation_type": "answer",
      "text": "you just stay. ",
      "speaker": "*ADD",
      "start_time": 1277198.0,
      "stop_time": 1277941.0,
      "answer_type": "UT",
      "is_quoted": "NQ",
      "overlap_flag": false
   },
   {
      "annotation_type": "question",
      "text": "\u230ado you\u230b know anyone that goes there? ",
      "speaker": "*ADD",
      "start_time": 1325456.0,
      "stop_time": 1326487.0,
      "question_type": "YN",
      "feature": null,
      "is_quoted": "NQ",
      "complexity": "SQ",
      "overlap_flag": false
   },
   {
      "annotation_type": "answer",
      "text": "no. ",
      "speaker": "*BRI",
      "start_time": 1326487.0,
      "stop_time": 1327313.0,
      "answer_type": "NA",
      "is_quoted": "NQ",
      "overlap_flag": false
   },
   {
      "annotation_type": "question",
      "text": "or anyone \u2308who\u2309. ",
      "speaker": "*ADD",
      "start_time": 1327313.0,
      "stop_time": 1328056.0,
      "question_type": "YN_1",
      "feature": null,
      "is_quoted": "NQ_1",
      "complexity": "SQ_1",
      "overlap_flag": false
   },
   {
      "annotation_type": "question",
      "text": "knows anyone who goes \u2308there\u2309? ",
      "speaker": "*ADD",
      "start_time": 1328428.0,
      "stop_time": 1329171.0,
      "question_type": "YN_2",
      "feature": null,
      "is_quoted": "NQ_2",
      "complexity": "SQ_2",
      "overlap_flag": false
   },
   {
      "annotation_type": "answer",
      "text": "\u230ano\u230b &=laugh . ",
      "speaker": "*BRI",
      "start_time": 1329171.0,
      "stop_time": 1329542.0,
      "answer_type": "NA",
      "is_quoted": "NQ",
      "overlap_flag": false
   },
   {
      "annotation_type": "question",
      "text": "and philosophy? ",
      "speaker": "*BRI",
      "start_time": 3022897.0,
      "stop_time": 3024117.0,
      "question_type": "CS",
      "feature": null,
      "is_quoted": "NQ",
      "complexity": "SQ",
      "overlap_flag": false
   },
   {
      "annotation_type": "question",
      "text": "(1.) that's four isn't it? ",
      "speaker": "*BRI",
      "start_time": 3024117.0,
      "stop_time": 3026140.0,
      "question_type": "YN",
      "feature": null,
      "is_quoted": "NQ",
      "complexity": "SQ",
      "overlap_flag": false
   },
   {
      "annotation_type": "answer",
      "text": "uh uh. ",
      "speaker": "*ADD",
      "start_time": 3026140.0,
      "stop_time": 3026512.0,
      "answer_type": "PHA",
      "is_quoted": "NQ",
      "overlap_flag": false
   },
   {
      "annotation_type": "answer",
      "text": "that's \u2308five\u2309. ",
      "speaker": "*ADD",
      "start_time": 3026512.0,
      "stop_time": 3027355.0,
      "answer_type": "NA",
      "is_quoted": "NQ",
      "overlap_flag": false
   },
   {
      "annotation_type": "question",
      "text": "you weren't counting that one? ",
      "speaker": "*ADD",
      "start_time": 3032290.0,
      "stop_time": 3032912.0,
      "question_type": "YN",
      "feature": null,
      "is_quoted": "NQ",
      "complexity": "SQ",
      "overlap_flag": false
   },
   {
      "annotation_type": "answer",
      "text": "I [/] I no. ",
      "speaker": "*BRI",
      "start_time": 3032912.0,
      "stop_time": 3034109.0,
      "answer_type": "NA",
      "is_quoted": "NQ",
      "overlap_flag": false
   },
   {
      "annotation_type": "question",
      "text": "so it was five then? ",
      "speaker": "*ADD",
      "start_time": 3037492.0,
      "stop_time": 3038606.0,
      "question_type": "YN",
      "feature": null,
      "is_quoted": "NQ",
      "complexity": "SQ",
      "overlap_flag": false
   },
   {
      "annotation_type": "answer",
      "text": "right. ",
      "speaker": "*BRI",
      "start_time": 3038606.0,
      "stop_time": 3038978.0,
      "answer_type": "PA",
      "is_quoted": "NQ",
      "overlap_flag": false
   },
   {
      "annotation_type": "question",
      "text": "you know? ",
      "speaker": "*ADD",
      "start_time": 3084181.0,
      "stop_time": 3085212.0,
      "question_type": "PQ",
      "feature": null,
      "is_quoted": "NQ",
      "complexity": "SQ",
      "overlap_flag": false
   },
   {
      "annotation_type": "question",
      "text": "could use the A right? ",
      "speaker": "*ADD",
      "start_time": 3154109.0,
      "stop_time": 3154769.0,
      "question_type": "CS",
      "feature": null,
      "is_quoted": "NQ",
      "complexity": "SQ",
      "overlap_flag": false
   },
   {
      "annotation_type": "answer",
      "text": "yes. ",
      "speaker": "*BRI",
      "start_time": 3154769.0,
      "stop_time": 3155306.0,
      "answer_type": "PA",
      "is_quoted": "NQ",
      "overlap_flag": false
   },
   {
      "annotation_type": "question",
      "text": "and then uhm (2.) what else do I have? ",
      "speaker": "*BRI",
      "start_time": 3190229.0,
      "stop_time": 3194316.0,
      "question_type": "WH",
      "feature": "TH",
      "is_quoted": "NQ",
      "complexity": "SQ",
      "overlap_flag": false
   },
   {
      "annotation_type": "answer",
      "text": "oh I have sculpture. ",
      "speaker": "*BRI",
      "start_time": 3194316.0,
      "stop_time": 3195059.0,
      "answer_type": "FA",
      "is_quoted": "NQ",
      "overlap_flag": false
   },
   {
      "annotation_type": "question",
      "text": "so you liked it sort of then? ",
      "speaker": "*ADD",
      "start_time": 3209714.0,
      "stop_time": 3211117.0,
      "question_type": "YN",
      "feature": null,
      "is_quoted": "NQ",
      "complexity": "SQ",
      "overlap_flag": false
   },
   {
      "annotation_type": "answer",
      "text": "well (.) not really that but +/. ",
      "speaker": "*BRI",
      "start_time": 3211117.0,
      "stop_time": 3212603.0,
      "answer_type": "NA",
      "is_quoted": "NQ",
      "overlap_flag": false
   },
   {
      "annotation_type": "question",
      "text": "+, you know? ",
      "speaker": "*BRI",
      "start_time": 3228290.0,
      "stop_time": 3228662.0,
      "question_type": "PQ",
      "feature": null,
      "is_quoted": "NQ",
      "complexity": "SQ",
      "overlap_flag": false
   },
   {
      "annotation_type": "answer",
      "text": "mhm mhm. ",
      "speaker": "*ADD",
      "start_time": 3229693.0,
      "stop_time": 3230065.0,
      "answer_type": "PHA",
      "is_quoted": "NQ",
      "overlap_flag": false
   },
   {
      "annotation_type": "question",
      "text": "\u2308you know\u2309? ",
      "speaker": "*BRI",
      "start_time": 3255428.0,
      "stop_time": 3255800.0,
      "question_type": "PQ",
      "feature": null,
      "is_quoted": "NQ",
      "complexity": "SQ",
      "overlap_flag": false
   },
   {
      "annotation_type": "answer",
      "text": "\u230auhhuh\u230b. ",
      "speaker": "*ADD",
      "start_time": 3255800.0,
      "stop_time": 3256460.0,
      "answer_type": "PHA",
      "is_quoted": "NQ",
      "overlap_flag": false
   },
   {
      "annotation_type": "question",
      "text": "++ what about life drawing? ",
      "speaker": "*ADD",
      "start_time": 3297864.0,
      "stop_time": 3298691.0,
      "question_type": "WH",
      "feature": "CH",
      "is_quoted": "NQ",
      "complexity": "SQ",
      "overlap_flag": false
   },
   {
      "annotation_type": "answer",
      "text": "uhm [/] we kind of had [/] we had a section on figure drawing. ",
      "speaker": "*BRI",
      "start_time": 3298691.0,
      "stop_time": 3302528.0,
      "answer_type": "FA",
      "is_quoted": "NQ",
      "overlap_flag": false
   },
   {
      "annotation_type": "question",
      "text": "yeah, everyone was kind of like \u201coh my God (.) we can't believe it\u201d we [/] you know it's DePaul you know? ",
      "speaker": "*BRI",
      "start_time": 3318475.0,
      "stop_time": 3319989.0,
      "question_type": "PQ",
      "feature": null,
      "is_quoted": "NQ",
      "complexity": "SQ",
      "overlap_flag": false
   },
   {
      "annotation_type": "answer",
      "text": "uhhuh. ",
      "speaker": "*ADD",
      "start_time": 3319989.0,
      "stop_time": 3320361.0,
      "answer_type": "PHA",
      "is_quoted": "NQ",
      "overlap_flag": false
   },
   {
      "annotation_type": "question",
      "text": "a:::h all the things?",
      "speaker": "*ADD",
      "start_time": 3374703.0,
      "stop_time": 3374821.0,
      "question_type": "YN",
      "feature": null,
      "is_quoted": "NQ",
      "complexity": "SQ",
      "overlap_flag": false
   },
   {
      "annotation_type": "answer",
      "text": "like we started off with (.) value and then perspective and (1.) you know.",
      "speaker": "*BRI",
      "start_time": 3374821.0,
      "stop_time": 3374939.0,
      "answer_type": "UT",
      "is_quoted": "NQ",
      "overlap_flag": false
   },
   {
      "annotation_type": "question",
      "text": "\u201ca::h who ca::res\u201d?",
      "speaker": "*ADD",
      "start_time": 3376473.0,
      "stop_time": 3376591.0,
      "question_type": "PQ",
      "feature": null,
      "is_quoted": "QQ",
      "complexity": "SQ",
      "overlap_flag": false
   },
   {
      "annotation_type": "question",
      "text": "do you have to hand in these tapes? ",
      "speaker": "*BRI",
      "start_time": 3379926.0,
      "stop_time": 3381866.0,
      "question_type": "YN",
      "feature": null,
      "is_quoted": "NQ",
      "complexity": "SQ",
      "overlap_flag": false
   },
   {
      "annotation_type": "answer",
      "text": "yeah &=laugh . ",
      "speaker": "*ADD",
      "start_time": 3381866.0,
      "stop_time": 3383435.0,
      "answer_type": "PA",
      "is_quoted": "NQ",
      "overlap_flag": false
   },
   {
      "annotation_type": "question",
      "text": "is it a guy or a [/] a girl? ",
      "speaker": "*BRI",
      "start_time": 3389834.0,
      "stop_time": 3392806.0,
      "question_type": "DQ",
      "feature": "TH",
      "is_quoted": "NQ",
      "complexity": "SQ",
      "overlap_flag": false
   },
   {
      "annotation_type": "question",
      "text": "a \u2308woman teacher\u2309? ",
      "speaker": "*BRI",
      "start_time": 3392806.0,
      "stop_time": 3393260.0,
      "question_type": "YN",
      "feature": null,
      "is_quoted": "NQ",
      "complexity": "SQ",
      "overlap_flag": false
   },
   {
      "annotation_type": "answer",
      "text": "\u230ait's a guy\u230b. ",
      "speaker": "*ADD",
      "start_time": 3393260.0,
      "stop_time": 3393632.0,
      "answer_type": "FA",
      "is_quoted": "NQ",
      "overlap_flag": false
   },
   {
      "annotation_type": "answer",
      "text": "a guy teacher. ",
      "speaker": "*ADD",
      "start_time": 3393632.0,
      "stop_time": 3394747.0,
      "answer_type": "NA",
      "is_quoted": "NQ",
      "overlap_flag": false
   },
   {
      "annotation_type": "question",
      "text": "does he listen to them them all? ",
      "speaker": "*BRI",
      "start_time": 3395324.0,
      "stop_time": 3396538.0,
      "question_type": "YN",
      "feature": null,
      "is_quoted": "NQ",
      "complexity": "SQ",
      "overlap_flag": false
   },
   {
      "annotation_type": "answer",
      "text": "uhm (1.) just whatever little part you analyze. ",
      "speaker": "*ADD",
      "start_time": 3396538.0,
      "stop_time": 3399760.0,
      "answer_type": "UT",
      "is_quoted": "NQ",
      "overlap_flag": false
   },
   {
      "annotation_type": "question",
      "text": "ha ha (1.5) ha ha so he's always asking me now \u201cwhat is your theme\u201d? ",
      "speaker": "*ADD",
      "start_time": 3408659.0,
      "stop_time": 3410656.0,
      "question_type": "WH",
      "feature": "TH",
      "is_quoted": "QQ",
      "complexity": "SQ",
      "overlap_flag": false
   },
   {
      "annotation_type": "question",
      "text": "+\" have you gotten a theme yet? ",
      "speaker": "*ADD",
      "start_time": 3410656.0,
      "stop_time": 3412325.0,
      "question_type": "YN",
      "feature": null,
      "is_quoted": "QQ",
      "complexity": "SQ",
      "overlap_flag": false
   },
   {
      "annotation_type": "answer",
      "text": "\u230a\u201cyes\u230b, s:::ure s::ure I do\u201d. ",
      "speaker": "*ADD",
      "start_time": 3413218.0,
      "stop_time": 3415485.0,
      "answer_type": "PA",
      "is_quoted": "QQ",
      "overlap_flag": false
   },
   {
      "annotation_type": "question",
      "text": "is she really? ",
      "speaker": "*BRI",
      "start_time": 3418624.0,
      "stop_time": 3419572.0,
      "question_type": "YN",
      "feature": null,
      "is_quoted": "NQ",
      "complexity": "SQ",
      "overlap_flag": false
   },
   {
      "annotation_type": "answer",
      "text": "yes she is. ",
      "speaker": "*ADD",
      "start_time": 3419572.0,
      "stop_time": 3420027.0,
      "answer_type": "PA",
      "is_quoted": "NQ",
      "overlap_flag": false
   },
   {
      "annotation_type": "question",
      "text": "yeah? ",
      "speaker": "*BRI",
      "start_time": 3459453.0,
      "stop_time": 3459824.0,
      "question_type": "PQ",
      "feature": null,
      "is_quoted": "NQ",
      "complexity": "SQ",
      "overlap_flag": false
   },
   {
      "annotation_type": "answer",
      "text": "yeah, I guess so. ",
      "speaker": "*ADD",
      "start_time": 3459824.0,
      "stop_time": 3461106.0,
      "answer_type": "PHA",
      "is_quoted": "NQ",
      "overlap_flag": false
   },
   {
      "annotation_type": "question",
      "text": "(2.) I kind of miss him you \u2308know\u2309? ",
      "speaker": "*ADD",
      "start_time": 3517681.0,
      "stop_time": 3518485.0,
      "question_type": "PQ",
      "feature": null,
      "is_quoted": "NQ",
      "complexity": "SQ",
      "overlap_flag": false
   },
   {
      "annotation_type": "answer",
      "text": "\u230amhm mhm\u230b. ",
      "speaker": "*BRI",
      "start_time": 3518485.0,
      "stop_time": 3518857.0,
      "answer_type": "PHA",
      "is_quoted": "NQ",
      "overlap_flag": false
   },
   {
      "annotation_type": "question",
      "text": "but it happens you know? ",
      "speaker": "*ADD",
      "start_time": 3543154.0,
      "stop_time": 3543710.0,
      "question_type": "PQ",
      "feature": null,
      "is_quoted": "NQ",
      "complexity": "SQ",
      "overlap_flag": false
   },
   {
      "annotation_type": "question",
      "text": "you know? ",
      "speaker": "*BRI",
      "start_time": 3597209.0,
      "stop_time": 3597663.0,
      "question_type": "PQ",
      "feature": null,
      "is_quoted": "NQ",
      "complexity": "SQ",
      "overlap_flag": false
   },
   {
      "annotation_type": "answer",
      "text": "\u2308yeah\u2309. ",
      "speaker": "*ADD",
      "start_time": 3597663.0,
      "stop_time": 3598406.0,
      "answer_type": "PHA",
      "is_quoted": "NQ",
      "overlap_flag": false
   },
   {
      "annotation_type": "question",
      "text": "\u2308you know\u2309? ",
      "speaker": "*BRI",
      "start_time": 3650340.0,
      "stop_time": 3650712.0,
      "question_type": "PQ",
      "feature": null,
      "is_quoted": "NQ",
      "complexity": "SQ",
      "overlap_flag": false
   },
   {
      "annotation_type": "answer",
      "text": "\u230auhhuh\u230b. ",
      "speaker": "*ADD",
      "start_time": 3650712.0,
      "stop_time": 3651000.0,
      "answer_type": "PHA",
      "is_quoted": "NQ",
      "overlap_flag": false
   },
   {
      "annotation_type": "question",
      "text": "really? ",
      "speaker": "*BRI",
      "start_time": 3659257.0,
      "stop_time": 3659917.0,
      "question_type": "PQ",
      "feature": null,
      "is_quoted": "NQ",
      "complexity": "SQ",
      "overlap_flag": false
   },
   {
      "annotation_type": "question",
      "text": "that guy that hasn't been calling back? ",
      "speaker": "*BRI",
      "start_time": 3662889.0,
      "stop_time": 3664997.0,
      "question_type": "YN",
      "feature": null,
      "is_quoted": "NQ",
      "complexity": "SQ",
      "overlap_flag": false
   },
   {
      "annotation_type": "answer",
      "text": "uhm [/] (2.) wait [/] no this is a different one. ",
      "speaker": "*ADD",
      "start_time": 3664997.0,
      "stop_time": 3669083.0,
      "answer_type": "NA",
      "is_quoted": "NQ",
      "overlap_flag": false
   },
   {
      "annotation_type": "question",
      "text": "++ to where? ",
      "speaker": "*BRI",
      "start_time": 3680433.0,
      "stop_time": 3680805.0,
      "question_type": "WH",
      "feature": "LOC",
      "is_quoted": "NQ",
      "complexity": "SQ",
      "overlap_flag": false
   },
   {
      "annotation_type": "answer",
      "text": "Cornell College +/. ",
      "speaker": "*ADD",
      "start_time": 3680805.0,
      "stop_time": 3681798.0,
      "answer_type": "FA",
      "is_quoted": "NQ",
      "overlap_flag": false
   },
   {
      "annotation_type": "question",
      "text": "++ really? ",
      "speaker": "*BRI",
      "start_time": 3681798.0,
      "stop_time": 3682187.0,
      "question_type": "PQ",
      "feature": null,
      "is_quoted": "NQ",
      "complexity": "SQ",
      "overlap_flag": false
   },
   {
      "annotation_type": "answer",
      "text": "yeah. ",
      "speaker": "*ADD",
      "start_time": 3683489.0,
      "stop_time": 3684149.0,
      "answer_type": "PHA",
      "is_quoted": "NQ",
      "overlap_flag": false
   },
   {
      "annotation_type": "question",
      "text": "+, \u230ayou\u230b know? ",
      "speaker": "*ADD",
      "start_time": 3739179.0,
      "stop_time": 3739383.0,
      "question_type": "PQ",
      "feature": null,
      "is_quoted": "NQ",
      "complexity": "SQ",
      "overlap_flag": false
   },
   {
      "annotation_type": "answer",
      "text": "\u230amhm mhm\u230b. ",
      "speaker": "*BRI",
      "start_time": 3742727.0,
      "stop_time": 3742977.0,
      "answer_type": "PHA",
      "is_quoted": "NQ",
      "overlap_flag": false
   },
   {
      "annotation_type": "question",
      "text": "you know? ",
      "speaker": "*ADD",
      "start_time": 3749293.0,
      "stop_time": 3750157.0,
      "question_type": "PQ",
      "feature": null,
      "is_quoted": "NQ",
      "complexity": "SQ",
      "overlap_flag": false
   },
   {
      "annotation_type": "question",
      "text": "no? ",
      "speaker": "*ADD",
      "start_time": 3775958.0,
      "stop_time": 3776347.0,
      "question_type": "PQ",
      "feature": null,
      "is_quoted": "NQ",
      "complexity": "SQ",
      "overlap_flag": false
   },
   {
      "annotation_type": "answer",
      "text": "no. ",
      "speaker": "*BRI",
      "start_time": 3776347.0,
      "stop_time": 3776907.0,
      "answer_type": "PHA",
      "is_quoted": "NQ",
      "overlap_flag": false
   },
   {
      "annotation_type": "question",
      "text": "(2.) I mean for a while there was like this thing [/] I don't know [/] well (.) he [/] he's like our mutual friend Peter \u2308ok\u2309? ",
      "speaker": "*BRI",
      "start_time": 3823869.0,
      "stop_time": 3824544.0,
      "question_type": "PQ",
      "feature": null,
      "is_quoted": "NQ",
      "complexity": "SQ",
      "overlap_flag": false
   },
   {
      "annotation_type": "answer",
      "text": "\u230amhm mhm\u230b. ",
      "speaker": "*ADD",
      "start_time": 3824544.0,
      "stop_time": 3824833.0,
      "answer_type": "PHA",
      "is_quoted": "NQ",
      "overlap_flag": false
   },
   {
      "annotation_type": "question",
      "text": "\u230ahe's\u230b our mutual friend of all of our friends \u2308you know\u2309? ",
      "speaker": "*BRI",
      "start_time": 3828718.0,
      "stop_time": 3829656.0,
      "question_type": "PQ",
      "feature": null,
      "is_quoted": "NQ",
      "complexity": "SQ",
      "overlap_flag": false
   },
   {
      "annotation_type": "answer",
      "text": "\u230aaha\u230b. ",
      "speaker": "*ADD",
      "start_time": 3829663.0,
      "stop_time": 3830034.0,
      "answer_type": "PHA",
      "is_quoted": "NQ",
      "overlap_flag": false
   },
   {
      "annotation_type": "question",
      "text": "+, you know? ",
      "speaker": "*BRI",
      "start_time": 3849686.0,
      "stop_time": 3849991.0,
      "question_type": "PQ",
      "feature": null,
      "is_quoted": "NQ",
      "complexity": "SQ",
      "overlap_flag": false
   },
   {
      "annotation_type": "answer",
      "text": "mhm mhm. ",
      "speaker": "*ADD",
      "start_time": 3850429.0,
      "stop_time": 3851088.0,
      "answer_type": "PHA",
      "is_quoted": "NQ",
      "overlap_flag": false
   },
   {
      "annotation_type": "question",
      "text": "you know? ",
      "speaker": "*BRI",
      "start_time": 3907931.0,
      "stop_time": 3908757.0,
      "question_type": "PQ",
      "feature": null,
      "is_quoted": "NQ",
      "complexity": "SQ",
      "overlap_flag": false
   },
   {
      "annotation_type": "answer",
      "text": "that's fairly prob [/] (2.) yeah. ",
      "speaker": "*ADD",
      "start_time": 3908757.0,
      "stop_time": 3911895.0,
      "answer_type": "PHA",
      "is_quoted": "NQ",
      "overlap_flag": false
   },
   {
      "annotation_type": "question",
      "text": "+, you just forget that it ever \u2308happened, you know\u2309? ",
      "speaker": "*BRI",
      "start_time": 3926336.0,
      "stop_time": 3926756.0,
      "question_type": "PQ",
      "feature": null,
      "is_quoted": "NQ",
      "complexity": "SQ",
      "overlap_flag": false
   },
   {
      "annotation_type": "answer",
      "text": "\u230a &=laugh I know\u230b. ",
      "speaker": "*ADD",
      "start_time": 3926756.0,
      "stop_time": 3927394.0,
      "answer_type": "PHA",
      "is_quoted": "NQ",
      "overlap_flag": false
   },
   {
      "annotation_type": "question",
      "text": "+, or something like that \u2308you know\u2309? ",
      "speaker": "*BRI",
      "start_time": 4001761.0,
      "stop_time": 4001975.0,
      "question_type": "PQ",
      "feature": null,
      "is_quoted": "NQ",
      "complexity": "SQ",
      "overlap_flag": false
   },
   {
      "annotation_type": "answer",
      "text": "\u230amhm mhm\u230b. ",
      "speaker": "*ADD",
      "start_time": 4001976.0,
      "stop_time": 4002348.0,
      "answer_type": "PHA",
      "is_quoted": "NQ",
      "overlap_flag": false
   },
   {
      "annotation_type": "question",
      "text": "just sort of seeing each other you know? ",
      "speaker": "*BRI",
      "start_time": 4004490.0,
      "stop_time": 4004743.0,
      "question_type": "PQ",
      "feature": null,
      "is_quoted": "NQ",
      "complexity": "SQ",
      "overlap_flag": false
   },
   {
      "annotation_type": "answer",
      "text": "uhhuh. ",
      "speaker": "*ADD",
      "start_time": 4004743.0,
      "stop_time": 4005115.0,
      "answer_type": "PHA",
      "is_quoted": "NQ",
      "overlap_flag": false
   },
   {
      "annotation_type": "question",
      "text": "do you know what I mean? ",
      "speaker": "*BRI",
      "start_time": 4027739.0,
      "stop_time": 4028688.0,
      "question_type": "YN",
      "feature": null,
      "is_quoted": "NQ",
      "complexity": "SQ",
      "overlap_flag": false
   },
   {
      "annotation_type": "answer",
      "text": "yeah, kind of. ",
      "speaker": "*ADD",
      "start_time": 4028688.0,
      "stop_time": 4029886.0,
      "answer_type": "PA",
      "is_quoted": "NQ",
      "overlap_flag": false
   },
   {
      "annotation_type": "question",
      "text": "+, \u230athen\u230b are you still friends with all those same \u2308people if it doesn't work out\u2309? ",
      "speaker": "*ADD",
      "start_time": 4055149.0,
      "stop_time": 4057667.0,
      "question_type": "YN",
      "feature": null,
      "is_quoted": "NQ",
      "complexity": "SQ",
      "overlap_flag": false
   },
   {
      "annotation_type": "answer",
      "text": "\u230ayeah, exactly\u230b. ",
      "speaker": "*BRI",
      "start_time": 4057667.0,
      "stop_time": 4058288.0,
      "answer_type": "PHA",
      "is_quoted": "NQ",
      "overlap_flag": false
   },
   {
      "annotation_type": "question",
      "text": "\u230aor\u230b if it hurts somebody else? ",
      "speaker": "*ADD",
      "start_time": 4058826.0,
      "stop_time": 4060479.0,
      "question_type": "YN",
      "feature": null,
      "is_quoted": "NQ",
      "complexity": "SQ",
      "overlap_flag": false
   },
   {
      "annotation_type": "question",
      "text": "what if he wants to talk to her about it? ",
      "speaker": "*BRI",
      "start_time": 4075589.0,
      "stop_time": 4077113.0,
      "question_type": "WH",
      "feature": "TH",
      "is_quoted": "NQ",
      "complexity": "SQ",
      "overlap_flag": false
   },
   {
      "annotation_type": "question",
      "text": "\u2308you know\u2309? ",
      "speaker": "*BRI",
      "start_time": 4077485.0,
      "stop_time": 4077856.0,
      "question_type": "PQ",
      "feature": null,
      "is_quoted": "NQ",
      "complexity": "SQ",
      "overlap_flag": false
   },
   {
      "annotation_type": "question",
      "text": "+, right? ",
      "speaker": "*ADD",
      "start_time": 4079137.0,
      "stop_time": 4079797.0,
      "question_type": "PQ",
      "feature": null,
      "is_quoted": "NQ",
      "complexity": "SQ",
      "overlap_flag": false
   },
   {
      "annotation_type": "answer",
      "text": "yeah. ",
      "speaker": "*BRI",
      "start_time": 4079797.0,
      "stop_time": 4080251.0,
      "answer_type": "PHA",
      "is_quoted": "NQ",
      "overlap_flag": false
   },
   {
      "annotation_type": "question",
      "text": "you know? ",
      "speaker": "*BRI",
      "start_time": 4093049.0,
      "stop_time": 4093792.0,
      "question_type": "PQ",
      "feature": null,
      "is_quoted": "NQ",
      "complexity": "SQ",
      "overlap_flag": false
   },
   {
      "annotation_type": "answer",
      "text": "yeah. ",
      "speaker": "*ADD",
      "start_time": 4093792.0,
      "stop_time": 4094785.0,
      "answer_type": "PHA",
      "is_quoted": "NQ",
      "overlap_flag": false
   },
   {
      "annotation_type": "question",
      "text": "you \u2308know\u2309? ",
      "speaker": "*ADD",
      "start_time": 4150500.0,
      "stop_time": 4150955.0,
      "question_type": "PQ",
      "feature": null,
      "is_quoted": "NQ",
      "complexity": "SQ",
      "overlap_flag": false
   },
   {
      "annotation_type": "answer",
      "text": "\u230ayeah\u230b. ",
      "speaker": "*BRI",
      "start_time": 4150955.0,
      "stop_time": 4151326.0,
      "answer_type": "PHA",
      "is_quoted": "NQ",
      "overlap_flag": false
   },
   {
      "annotation_type": "question",
      "text": "you know? ",
      "speaker": "*ADD",
      "start_time": 4165733.0,
      "stop_time": 4166187.0,
      "question_type": "PQ",
      "feature": null,
      "is_quoted": "NQ",
      "complexity": "SQ",
      "overlap_flag": false
   },
   {
      "annotation_type": "question",
      "text": "kind of goony but \u2308you know\u2309? ",
      "speaker": "*BRI",
      "start_time": 5033016.0,
      "stop_time": 5033683.0,
      "question_type": "PQ",
      "feature": null,
      "is_quoted": "NQ",
      "complexity": "SQ",
      "overlap_flag": false
   },
   {
      "annotation_type": "answer",
      "text": "\u230ayeah\u230b, he likes \u2308kids\u2309. ",
      "speaker": "*ADD",
      "start_time": 5033683.0,
      "stop_time": 5034547.0,
      "answer_type": "PHA",
      "is_quoted": "NQ",
      "overlap_flag": false
   },
   {
      "annotation_type": "question",
      "text": "no? ",
      "speaker": "*ADD",
      "start_time": 5055807.0,
      "stop_time": 5056550.0,
      "question_type": "PQ",
      "feature": null,
      "is_quoted": "NQ",
      "complexity": "SQ",
      "overlap_flag": false
   },
   {
      "annotation_type": "question",
      "text": "\u230ado you\u230b need to? ",
      "speaker": "*ADD",
      "start_time": 5059484.0,
      "stop_time": 5060060.0,
      "question_type": "YN",
      "feature": null,
      "is_quoted": "NQ",
      "complexity": "SQ",
      "overlap_flag": false
   },
   {
      "annotation_type": "answer",
      "text": "yeah. ",
      "speaker": "*BRI",
      "start_time": 5060060.0,
      "stop_time": 5060515.0,
      "answer_type": "PA",
      "is_quoted": "NQ",
      "overlap_flag": false
   },
   {
      "annotation_type": "question",
      "text": "yeah, how much? ",
      "speaker": "*ADD",
      "start_time": 5060515.0,
      "stop_time": 5061630.0,
      "question_type": "WH",
      "feature": "CH",
      "is_quoted": "NQ",
      "complexity": "SQ",
      "overlap_flag": false
   },
   {
      "annotation_type": "question",
      "text": "two classes? ",
      "speaker": "*ADD",
      "start_time": 5062494.0,
      "stop_time": 5063487.0,
      "question_type": "YN",
      "feature": null,
      "is_quoted": "NQ",
      "complexity": "SQ",
      "overlap_flag": false
   },
   {
      "annotation_type": "answer",
      "text": "(1.) something like that. ",
      "speaker": "*BRI",
      "start_time": 5063487.0,
      "stop_time": 5065467.0,
      "answer_type": "PA",
      "is_quoted": "NQ",
      "overlap_flag": false
   },
   {
      "annotation_type": "question",
      "text": "you know? ",
      "speaker": "*BRI",
      "start_time": 5107698.0,
      "stop_time": 5108275.0,
      "question_type": "PQ",
      "feature": null,
      "is_quoted": "NQ",
      "complexity": "SQ",
      "overlap_flag": false
   },
   {
      "annotation_type": "answer",
      "text": "mhm mhm. ",
      "speaker": "*ADD",
      "start_time": 5108275.0,
      "stop_time": 5108646.0,
      "answer_type": "PHA",
      "is_quoted": "NQ",
      "overlap_flag": false
   },
   {
      "annotation_type": "question",
      "text": "so I hope I can [/] I hope I can fill [/] like fulfill you know? ",
      "speaker": "*BRI",
      "start_time": 5113114.0,
      "stop_time": 5114097.0,
      "question_type": "PQ",
      "feature": null,
      "is_quoted": "NQ",
      "complexity": "SQ",
      "overlap_flag": false
   },
   {
      "annotation_type": "answer",
      "text": "yeah, (3.) yeah. ",
      "speaker": "*ADD",
      "start_time": 5114097.0,
      "stop_time": 5114385.0,
      "answer_type": "PHA",
      "is_quoted": "NQ",
      "overlap_flag": false
   },
   {
      "annotation_type": "question",
      "text": "(1.) you know? ",
      "speaker": "*ADD",
      "start_time": 5168543.0,
      "stop_time": 5170112.0,
      "question_type": "PQ",
      "feature": null,
      "is_quoted": "NQ",
      "complexity": "SQ",
      "overlap_flag": false
   },
   {
      "annotation_type": "question",
      "text": "really? ",
      "speaker": "*BRI",
      "start_time": 5196945.0,
      "stop_time": 5197316.0,
      "question_type": "PQ",
      "feature": null,
      "is_quoted": "NQ",
      "complexity": "SQ",
      "overlap_flag": false
   },
   {
      "annotation_type": "answer",
      "text": "yeah. ",
      "speaker": "*ADD",
      "start_time": 5197316.0,
      "stop_time": 5197688.0,
      "answer_type": "PHA",
      "is_quoted": "NQ",
      "overlap_flag": false
   },
   {
      "annotation_type": "question",
      "text": "who wants to work? ",
      "speaker": "*ADD",
      "start_time": 5201980.0,
      "stop_time": 5202889.0,
      "question_type": "PQ",
      "feature": null,
      "is_quoted": "NQ",
      "complexity": "SQ",
      "overlap_flag": false
   },
   {
      "annotation_type": "question",
      "text": "(2.) so are you gonna be done after four years or? ",
      "speaker": "*BRI",
      "start_time": 5202889.0,
      "stop_time": 5206810.0,
      "question_type": "YN",
      "feature": null,
      "is_quoted": "NQ",
      "complexity": "SQ",
      "overlap_flag": false
   },
   {
      "annotation_type": "question",
      "text": "you'll be done? ",
      "speaker": "*BRI",
      "start_time": 5208379.0,
      "stop_time": 5208833.0,
      "question_type": "YN",
      "feature": null,
      "is_quoted": "NQ",
      "complexity": "SQ",
      "overlap_flag": false
   },
   {
      "annotation_type": "answer",
      "text": "(2.) yeah, spring ninty two I can graduate. ",
      "speaker": "*ADD",
      "start_time": 5210608.0,
      "stop_time": 5215809.0,
      "answer_type": "PA",
      "is_quoted": "NQ",
      "overlap_flag": false
   },
   {
      "annotation_type": "question",
      "text": "but I mean y[/] you not gonna go on? ",
      "speaker": "*BRI",
      "start_time": 5222914.0,
      "stop_time": 5224687.0,
      "question_type": "YN",
      "feature": null,
      "is_quoted": "NQ",
      "complexity": "SQ",
      "overlap_flag": false
   },
   {
      "annotation_type": "question",
      "text": "+\" oh (.) as far as a masters \u2308program\u2309? ",
      "speaker": "*ADD",
      "start_time": 5224687.0,
      "stop_time": 5226629.0,
      "question_type": "YN",
      "feature": null,
      "is_quoted": "NQ",
      "complexity": "SQ",
      "overlap_flag": false
   },
   {
      "annotation_type": "answer",
      "text": "\u230ayeah\u230b. ",
      "speaker": "*BRI",
      "start_time": 5226629.0,
      "stop_time": 5226916.0,
      "answer_type": "PA",
      "is_quoted": "NQ",
      "overlap_flag": false
   },
   {
      "annotation_type": "answer",
      "text": "oh, no that I don't know. ",
      "speaker": "*ADD",
      "start_time": 5226916.0,
      "stop_time": 5228774.0,
      "answer_type": "UA",
      "is_quoted": "NQ",
      "overlap_flag": false
   },
   {
      "annotation_type": "question",
      "text": "you know? ",
      "speaker": "*BRI",
      "start_time": 5280498.0,
      "stop_time": 5280953.0,
      "question_type": "PQ",
      "feature": null,
      "is_quoted": "NQ",
      "complexity": "SQ",
      "overlap_flag": false
   },
   {
      "annotation_type": "answer",
      "text": "it's true. ",
      "speaker": "*ADD",
      "start_time": 5280953.0,
      "stop_time": 5281424.0,
      "answer_type": "PHA",
      "is_quoted": "NQ",
      "overlap_flag": false
   },
   {
      "annotation_type": "question",
      "text": "so (.) what's the point? ",
      "speaker": "*ADD",
      "start_time": 5317567.0,
      "stop_time": 5319219.0,
      "question_type": "PQ",
      "feature": null,
      "is_quoted": "NQ",
      "complexity": "SQ",
      "overlap_flag": false
   },
   {
      "annotation_type": "answer",
      "text": "yeah. ",
      "speaker": "*BRI",
      "start_time": 5319219.0,
      "stop_time": 5320168.0,
      "answer_type": "PHA",
      "is_quoted": "NQ",
      "overlap_flag": false
   },
   {
      "annotation_type": "question",
      "text": "you know? ",
      "speaker": "*ADD",
      "start_time": 5334618.0,
      "stop_time": 5335278.0,
      "question_type": "PQ",
      "feature": null,
      "is_quoted": "NQ",
      "complexity": "SQ",
      "overlap_flag": false
   },
   {
      "annotation_type": "question",
      "text": "\u230adid you\u230b really? ",
      "speaker": "*BRI",
      "start_time": 5346690.0,
      "stop_time": 5346961.0,
      "question_type": "PQ",
      "feature": null,
      "is_quoted": "NQ",
      "complexity": "SQ",
      "overlap_flag": false
   },
   {
      "annotation_type": "answer",
      "text": "yeah I did. ",
      "speaker": "*ADD",
      "start_time": 5346961.0,
      "stop_time": 5348447.0,
      "answer_type": "PHA",
      "is_quoted": "NQ",
      "overlap_flag": false
   },
   {
      "annotation_type": "question",
      "text": "++ really? ",
      "speaker": "*BRI",
      "start_time": 5352163.0,
      "stop_time": 5352534.0,
      "question_type": "PQ",
      "feature": null,
      "is_quoted": "NQ",
      "complexity": "SQ",
      "overlap_flag": false
   },
   {
      "annotation_type": "question",
      "text": "how's he doing? ",
      "speaker": "*BRI",
      "start_time": 5352534.0,
      "stop_time": 5353649.0,
      "question_type": "WH",
      "feature": "CH",
      "is_quoted": "NQ",
      "complexity": "SQ",
      "overlap_flag": false
   },
   {
      "annotation_type": "answer",
      "text": "\u230apretty good\u230b. ",
      "speaker": "*ADD",
      "start_time": 5354020.0,
      "stop_time": 5354392.0,
      "answer_type": "FA",
      "is_quoted": "NQ",
      "overlap_flag": false
   },
   {
      "annotation_type": "question",
      "text": "+, major anyway? ",
      "speaker": "*BRI",
      "start_time": 5354392.0,
      "stop_time": 5355052.0,
      "question_type": "WH",
      "feature": "TH",
      "is_quoted": "NQ",
      "complexity": "SQ",
      "overlap_flag": false
   },
   {
      "annotation_type": "answer",
      "text": "he's majoring in English. ",
      "speaker": "*ADD",
      "start_time": 5355052.0,
      "stop_time": 5355962.0,
      "answer_type": "FA",
      "is_quoted": "NQ",
      "overlap_flag": false
   },
   {
      "annotation_type": "question",
      "text": "really? ",
      "speaker": "*BRI",
      "start_time": 5355962.0,
      "stop_time": 5356826.0,
      "question_type": "PQ",
      "feature": null,
      "is_quoted": "NQ",
      "complexity": "SQ",
      "overlap_flag": false
   },
   {
      "annotation_type": "answer",
      "text": "yeah! ",
      "speaker": "*ADD",
      "start_time": 5356826.0,
      "stop_time": 5357109.0,
      "answer_type": "PHA",
      "is_quoted": "NQ",
      "overlap_flag": false
   },
   {
      "annotation_type": "question",
      "text": "tell me (.) what if he say? ",
      "speaker": "*BRI",
      "start_time": 5376145.0,
      "stop_time": 5377343.0,
      "question_type": "WH",
      "feature": "TH",
      "is_quoted": "NQ",
      "complexity": "SQ",
      "overlap_flag": false
   },
   {
      "annotation_type": "answer",
      "text": "he's [/] used to be shy::. ",
      "speaker": "*ADD",
      "start_time": 5377343.0,
      "stop_time": 5380110.0,
      "answer_type": "UT",
      "is_quoted": "NQ",
      "overlap_flag": false
   },
   {
      "annotation_type": "question",
      "text": "++ really? ",
      "speaker": "*BRI",
      "start_time": 5381718.0,
      "stop_time": 5382089.0,
      "question_type": "PQ",
      "feature": null,
      "is_quoted": "NQ",
      "complexity": "SQ",
      "overlap_flag": false
   },
   {
      "annotation_type": "answer",
      "text": "\u2308yeah\u2309. ",
      "speaker": "*ADD",
      "start_time": 5383741.0,
      "stop_time": 5384113.0,
      "answer_type": "PHA",
      "is_quoted": "NQ",
      "overlap_flag": false
   },
   {
      "annotation_type": "question",
      "text": "\u230areally\u230b? ",
      "speaker": "*BRI",
      "start_time": 5384113.0,
      "stop_time": 5384584.0,
      "question_type": "PQ",
      "feature": null,
      "is_quoted": "NQ",
      "complexity": "SQ",
      "overlap_flag": false
   },
   {
      "annotation_type": "answer",
      "text": "++ yeah. ",
      "speaker": "*ADD",
      "start_time": 5385887.0,
      "stop_time": 5386426.0,
      "answer_type": "PHA",
      "is_quoted": "NQ",
      "overlap_flag": false
   },
   {
      "annotation_type": "question",
      "text": "(be)cause he [/] he doesn't want to [/] he's like [/] (be)cause I said \u201cdon't people always say what are you gonna teach\u201d? ",
      "speaker": "*ADD",
      "start_time": 5400081.0,
      "stop_time": 5404547.0,
      "question_type": "YN",
      "feature": null,
      "is_quoted": "QQ",
      "complexity": "SQ",
      "overlap_flag": false
   },
   {
      "annotation_type": "answer",
      "text": "\u201cno I don't want to teach\u201d you know? ",
      "speaker": "*ADD",
      "start_time": 5404837.0,
      "stop_time": 5405237.0,
      "answer_type": "DA",
      "is_quoted": "QQ",
      "overlap_flag": false
   },
   {
      "annotation_type": "question",
      "text": "\u201cno I don't want to teach\u201d you know? ",
      "speaker": "*ADD",
      "start_time": 5406091.0,
      "stop_time": 5406692.0,
      "question_type": "PQ",
      "feature": null,
      "is_quoted": "NQ",
      "complexity": "SQ",
      "overlap_flag": false
   },
   {
      "annotation_type": "question",
      "text": "what [/] what d[/] what does he want to do? ",
      "speaker": "*BRI",
      "start_time": 5406692.0,
      "stop_time": 5408057.0,
      "question_type": "WH",
      "feature": "TH",
      "is_quoted": "NQ",
      "complexity": "SQ",
      "overlap_flag": false
   },
   {
      "annotation_type": "answer",
      "text": "he doesn't know \u2308exactly\u2309. ",
      "speaker": "*ADD",
      "start_time": 5408057.0,
      "stop_time": 5408467.0,
      "answer_type": "UA",
      "is_quoted": "NQ",
      "overlap_flag": false
   }
]