annotator,item-12,item-34,item-40,item-43,item-44
../preprocessing/output/amy_axel_2020.json,,YES,,,
../preprocessing/output/amy_alena_2020.json,YES,,YES,YES,Other
text,I have a wh[/] white ⌈shirt⌉. ,(1.) something like that. ,I can after three. ,it's true. ,yeah. 
time,171026.0,5063487.0,5208833.0,5280953.0,5319219.0
