annotator,item-16,item-18,item-19,item-20,item-21,item-23,item-24,item-28,item-29,item-31,item-32,item-34,item-36,item-37,item-38,item-41,item-42,item-44,item-45,item-46,item-47,item-49,item-5,item-50,item-51,item-52,item-53,item-54,item-6,item-8
../preprocessing/output/amy_aria.json,PA,UA,UA,UA,,PHA,FA,PA,UT,PHA,UA,PA,PA,PA,,PHA,,PHA,,,PA,UA,PA,,PA,,,,,PA
../preprocessing/output/amy_gosse.json,PHA,DA,UT,,PHA,,PA,PHA,,,PA,PHA,,,PA,,PHA,,PHA,FA,FA,,,UT,,PHA,PHA,DA,PA,YA
text,yeah. ,I don't have any plans. ,my last exam is like [/] (.) I don't know. ,Tuesday or Wednesday. ,(4.) all right. ,oh yeah. ,⌊that⌋ or else I transfer to a university that has a stronger art department. ,"⌊yeah⌋, he likes ⌈kids⌉. ",or science &=laugh . ,uhm +... ,(1.) something like that. ,"yeah, (3.) yeah. ","yeah, I can make it three. ","I can after three.  (2.) yeah, spring ninty two I can graduate.  (2.) as long as I get all my classes. ","(2.) yeah, spring ninty two I can graduate. ",it's true.  very true. ,it's true. ,mhm mhm. ,yeah I did. ,⌊pretty good⌋. ,he's majoring in English. ,he's [/] used to be shy::.  and he's not shy anymore +/. ,⌊oh yeah⌋.  you have to for alterations. ,he's [/] used to be shy::. ,he talked a lot.  ⌈yeah⌉. ,⌈yeah⌉. ,++ yeah. ,“no I don't want to teach”,⌊oh yeah⌋. ,yeah . 
time,274739.0,304034.0,307210.0,310928.0,360137.0,1252816.0,1265393.0,5033683.0,5056550.0,5061630.0,5063487.0,5114097.0,5206810.0,5208833.0,5210608.0,5280953.0,5280953.0,5340562.0,5346961.0,5354020.0,5355052.0,5377343.0,141881.0,5377343.0,5382089.0,5383741.0,5385887.0,5404837.0,141881.0,170739.0
