annotator,item-102,item-103,item-104,item-109,item-110,item-112,item-113,item-114,item-115,item-116,item-117,item-118,item-119,item-12,item-120,item-121,item-122,item-123,item-13,item-27,item-4,item-40,item-41,item-42,item-45,item-47,item-48,item-52,item-53,item-54,item-57,item-58,item-6,item-60,item-61,item-62,item-64,item-68,item-70,item-73,item-74,item-77,item-82,item-84,item-85,item-86,item-90,item-92,item-93,item-97,item-99
../preprocessing/output/amy_axel.json,,,NQ,NQ,,NQ,,,,,,QQ,,NQ,NQ,,,NQ,,NQ,,NQ,,,,,NQ,,NQ,NQ,,NQ,NQ,NQ,,NQ,,NQ,,NQ,,,NQ,NQ,,,,NQ,,NQ,NQ
../preprocessing/output/amy_alena.json,NQ,NQ,,NQ,,,,NQ,NQ,NQ,QQ,,,NQ,NQ,NQ,,,,NQ,NQ,,,NQ,,NQ,NQ,NQ,,,NQ,,QQ,NQ,,NQ,,NQ,NQ,NQ,,NQ,NQ,NQ,,,NQ,NQ,,,NQ
../preprocessing/output/amy_andrea.json,NQ,NQ,,NQ,,,,NQ,NQ,NQ,QQ,,,NQ,,NQ,,,,NQ,NQ,NQ,,,NQ,NQ,NQ,,NQ,,NQ,,QQ,NQ,,,NQ,NQ,NQ,NQ,,,NQ,NQ,,,NQ,,,,NQ
../preprocessing/output/amy_aria.json,,,NQ,,NQ,,NQ,,,,,,QQ,,,,,NQ,NQ,NQ,NQ,NQ,NQ,,,NQ,NQ,,NQ,NQ,,NQ,NQ,NQ,,NQ,NQ,NQ,,NQ,,,NQ,,NQ,,NQ,,NQ,NQ,
../preprocessing/output/amy_gosse.json,,NQ,NQ,NQ,,,,NQ,NQ,NQ,,,QQ,NQ,,,QQ,NQ,,QQ,NQ,NQ,,,NQ,NQ,,,NQ,NQ,NQ,,QQ,,NQ,NQ,,,NQ,,NQ,,,,,NQ,NQ,NQ,,,NQ
text,"⌈what's his⌉ +/.  +, major anyway? ",⌊pretty good⌋. ,"+, major anyway? ",he's [/] used to be shy::. ,he's [/] used to be shy::.  and he's not shy anymore +/. ,he talked a lot. ,he talked a lot.  ⌈yeah⌉. ,⌈yeah⌉. ,⌊really⌋? ,++ yeah. ,(be)cause he [/] he doesn't want to [/] he's like [/] (be)cause I said “don't people always say what are you gonna teach”? ,“don't people always say what are you gonna teach”? ,“don't people always say what are you gonna teach”?,⌊oh yeah⌋. ,mhm mhm. ,“no I don't want to teach” you know? ,“no I don't want to teach”,you know? ,⌊oh yeah⌋.  you have to for alterations. ,&=laugh to see how horrendous I look? ,&=laugh . ,my last exam is like [/] (.) I don't know. ,Tuesday or Wednesday. ,"+, whenever I want to. ",(4.) all right. ,yeah. ,oh yeah. ,that would be great.  you know? ,you know? ,you just stay. ,or anyone ⌈who⌉.  knows anyone who goes ⌈there⌉? ,knows anyone who goes ⌈there⌉? ,I'm like “yeah”. ,kind of goony but ⌈you know⌉? ,⌈you know⌉? ,"⌊yeah⌋, he likes ⌈kids⌉. ",or science &=laugh . ,uhm +... ,(1.) something like that. ,so I hope I can [/] I hope I can fill [/] like fulfill you know? ,like fulfill you know? ,I'm sure you will. ,"yeah, I can make it three. ",I can after three. ,"I can after three.  (2.) yeah, spring ninty two I can graduate.  (2.) as long as I get all my classes. ","(2.) yeah, spring ninty two I can graduate. ","oh, no that I don't know. ",it's true. ,it's true.  very true. ,mhm mhm. ,yeah I did. 
time,5353649.0,5354020.0,5354392.0,5377343.0,5377343.0,5382089.0,5382089.0,5383741.0,5384113.0,5385887.0,5399057.0,5401012.0,5401012.0,141881.0,5404546.0,5404835.0,5404837.0,5405587.0,141881.0,246338.0,35915.0,307210.0,310928.0,335628.0,360137.0,392520.0,1252816.0,1275462.0,1276743.0,1277198.0,1327313.0,1328428.0,38804.0,5031575.0,5033016.0,5033683.0,5056550.0,5061630.0,5063487.0,5110298.0,5113114.0,5170112.0,5206810.0,5208833.0,5208833.0,5210608.0,5226916.0,5280953.0,5280953.0,5340562.0,5346961.0
