annotator,item-101,item-102,item-103,item-104,item-105,item-106,item-107,item-108,item-109,item-4,item-42,item-44,item-50,item-53,item-54,item-57,item-59,item-6,item-65,item-81,item-83,item-87,item-92,item-93,item-94
../preprocessing/output/amy_axel.json,NQ,,,,,QQ,NQ,,NQ,,,,NQ,,NQ,NQ,,NQ,,,NQ,NQ,,,NQ
../preprocessing/output/amy_andrea.json,,NQ,NQ,NQ,QQ,,,NQ,,NQ,NQ,NQ,,NQ,,,NQ,QQ,NQ,NQ,,,NQ,NQ,
text,he talked a lot. ,⌈yeah⌉. ,⌊really⌋? ,++ yeah. ,(be)cause he [/] he doesn't want to [/] he's like [/] (be)cause I said “don't people always say what are you gonna teach”? ,“don't people always say what are you gonna teach”? ,mhm mhm. ,“no I don't want to teach” you know? ,you know? ,&=laugh . ,(4.) all right. ,yeah. ,you just stay. ,or anyone ⌈who⌉.  knows anyone who goes ⌈there⌉? ,knows anyone who goes ⌈there⌉? ,"⌊yeah⌋, he likes ⌈kids⌉. ",or science &=laugh . ,I'm like “yeah”. ,(1.) something like that. ,"oh, no that I don't know. ",it's true. ,mhm mhm. ,"⌈what's his⌉ +/.  +, major anyway? ",⌊pretty good⌋. ,"+, major anyway? "
time,5382089.0,5383741.0,5384113.0,5385887.0,5399057.0,5401012.0,5404546.0,5404835.0,5405587.0,35915.0,360137.0,392520.0,1277198.0,1327313.0,1328428.0,5033683.0,5056550.0,38804.0,5063487.0,5226916.0,5280953.0,5340562.0,5353649.0,5354020.0,5354392.0
