annotator,item-0,item-1,item-2,item-3,item-4,item-5,item-6,item-7,item-8,item-9,item-10,item-11,item-12,item-13,item-14,item-15,item-16,item-17,item-18,item-19,item-20,item-21,item-22,item-23,item-24,item-25,item-26,item-27,item-28,item-29,item-30,item-31,item-32,item-33,item-34,item-35,item-36,item-37,item-38,item-39,item-40,item-41,item-42,item-43,item-44,item-45,item-46,item-47,item-48,item-49,item-50,item-51,item-52,item-53,item-54,item-55,item-56,item-57,item-58,item-59,item-60,item-61,item-62,item-63,item-64,item-65,item-66,item-67,item-68,item-69,item-70,item-71,item-72,item-73,item-74,item-75,item-76,item-77,item-78,item-79,item-80,item-81,item-82,item-83,item-84,item-85,item-86,item-87,item-88,item-89,item-90,item-91,item-92,item-93,item-94,item-95,item-96,item-97,item-98,item-99,item-100,item-101,item-102,item-103,item-104,item-105,item-106,item-107,item-108,item-109,item-110,item-111,item-112,item-113,item-114
../preprocessing/output/amy_alena.json,NQ,NQ,NQ,QQ,NQ,QQ,QQ,NQ,NQ,NQ,NQ,NQ,NQ,NQ,NQ,QQ,QQ,NQ,NQ,NQ,NQ,NQ,NQ,NQ,NQ,NQ,NQ,NQ,NQ,NQ,NQ,NQ,NQ,NQ,NQ,NQ,NQ,NQ,NQ,,NQ,NQ,NQ,,NQ,NQ,NQ,NQ,NQ,NQ,NQ,,,NQ,NQ,NQ,NQ,NQ,,NQ,NQ,NQ,NQ,NQ,NQ,NQ,NQ,NQ,NQ,NQ,,NQ,NQ,NQ,NQ,NQ,NQ,NQ,NQ,NQ,NQ,,NQ,NQ,NQ,NQ,NQ,NQ,NQ,NQ,NQ,NQ,NQ,NQ,NQ,NQ,NQ,,NQ,NQ,NQ,NQ,NQ,NQ,NQ,NQ,NQ,QQ,,NQ,NQ,,,NQ,NQ
../preprocessing/output/amy_gosse.json,NQ,NQ,NQ,QQ,NQ,QQ,QQ,NQ,NQ,NQ,NQ,NQ,NQ,NQ,NQ,QQ,QQ,NQ,NQ,NQ,NQ,NQ,NQ,NQ,NQ,NQ,QQ,NQ,NQ,NQ,NQ,NQ,NQ,NQ,NQ,NQ,NQ,NQ,NQ,NQ,,NQ,NQ,NQ,NQ,NQ,,NQ,NQ,NQ,,NQ,NQ,NQ,NQ,NQ,NQ,,NQ,NQ,NQ,NQ,NQ,NQ,,NQ,NQ,NQ,NQ,,NQ,NQ,NQ,,NQ,NQ,NQ,NQ,,NQ,,NQ,NQ,NQ,NQ,NQ,NQ,NQ,NQ,NQ,NQ,NQ,NQ,NQ,NQ,,NQ,NQ,NQ,NQ,NQ,NQ,NQ,NQ,NQ,NQ,NQ,,QQ,,,QQ,NQ,NQ,NQ
text,⌊making⌋ an evening of it? ,making an evening of it. ,oh really? ,“so [/] so you're gonna be home then”? ,&=laugh . ,“or will you be just gonna hangin around with Brianne”? ,I'm like “yeah”. ,does it? ,in my opinion. ,⌊what colour⌋ is it? ,it's midnight blue. ,you have to pay for ⌈all this⌉? ,⌊oh yeah⌋. ,right? ,mhm mhm. ,⌊oh d'you⌋ have a white shirt ? ,yeah . ,"+, and then everybody had to get it? ","yeah, like this [/] my mum's part was well it would be different if they were paying for them you ⌈know⌉ +/. ",buying them you know? ,yeah. ,did you? ,you want me to go? ,yes. ,"+, you will? ",yes. ,&=laugh to see how horrendous I look? ,no no. ,are they? ,they probably plan to go. ,go? ,go. ,"yeah, do you really? ",yeah. ,w [/] is the wedding on Sunday or is it Saturday? ,its [/] I don't even know. ,what are your plans now? ,I don't have any plans. ,when will you guys get off? ,my last exam is like [/] (.) I don't know. ,"+, whenever I want to. ",did you get a new sweater? ,(2.) huh? ,(4.) all right. ,oh yeah? ,yeah. ,oh yeah. ,⌊yeah⌋ so what are your options for that? ,you go through four years of regular school and then to art school or ⌈what⌉? ,⌊that⌋ or else I transfer to a university that has a stronger art department. ,that would be great.  you know? ,you know? ,you just stay. ,⌊do you⌋ know anyone that goes there? ,no. ,or anyone ⌈who⌉.  knows anyone who goes ⌈there⌉? ,⌊no⌋ &=laugh . ,kind of goony but ⌈you know⌉? ,⌈you know⌉? ,"⌊yeah⌋, he likes ⌈kids⌉. ",no? ,⌊do you⌋ need to? ,yeah. ,"yeah, how much? ",uhm +... ,two classes? ,(1.) something like that. ,you know? ,mhm mhm. ,so I hope I can [/] I hope I can fill [/] like fulfill you know? ,like fulfill you know? ,"yeah, (3.) yeah. ",(1.) you know? ,I'm sure you will. ,really? ,yeah. ,who wants to work? ,(2.) so are you gonna be done after four years or? ,"yeah, I can make it three. ",you'll be done? ,I can after three. ,"(2.) yeah, spring ninty two I can graduate. ",but I mean y[/] you not gonna go on? ,"+"" oh (.) as far as a masters ⌈program⌉? ",⌊yeah⌋. ,"oh, no that I don't know. ",you know? ,it's true. ,so (.) what's the point? ,yeah. ,you know? ,⌊did you⌋ really? ,yeah I did. ,++ really? ,how's he doing? ,"⌈what's his⌉ +/.  +, major anyway? ",⌊pretty good⌋. ,"+, major anyway? ",he's majoring in English. ,really? ,yeah! ,tell me (.) what if he say? ,he's [/] used to be shy::. ,++ really? ,⌈yeah⌉. ,⌊really⌋? ,++ yeah. ,(be)cause he [/] he doesn't want to [/] he's like [/] (be)cause I said “don't people always say what are you gonna teach”? ,“don't people always say what are you gonna teach”?,mhm mhm. ,“no I don't want to teach” you know? ,“no I don't want to teach”,you know? ,what [/] what d[/] what does he want to do? ,he doesn't know ⌈exactly⌉. 
time,26627.0,27742.0,30920.0,34801.0,35915.0,36742.0,38804.0,86403.0,86675.0,90612.0,91233.0,140107.0,141881.0,152944.0,153415.0,168631.0,170739.0,179421.0,180619.0,186108.0,187760.0,215169.0,218308.0,219589.0,232425.0,232881.0,246338.0,248279.0,252077.0,252532.0,260993.0,261570.0,273725.0,274739.0,286833.0,289145.0,302631.0,304034.0,306096.0,307210.0,335628.0,356340.0,358075.0,360137.0,391983.0,392520.0,1252816.0,1260563.0,1261966.0,1265393.0,1275462.0,1276743.0,1277198.0,1325456.0,1326487.0,1327313.0,1329171.0,5031575.0,5033016.0,5033683.0,5055807.0,5059484.0,5060060.0,5060515.0,5061630.0,5062494.0,5063487.0,5107698.0,5108275.0,5110298.0,5113114.0,5114097.0,5168543.0,5170112.0,5196945.0,5197316.0,5201980.0,5202889.0,5206810.0,5208379.0,5208833.0,5210608.0,5222914.0,5224687.0,5226629.0,5226916.0,5280498.0,5280953.0,5317567.0,5319219.0,5334618.0,5346690.0,5346961.0,5352163.0,5352534.0,5353649.0,5354020.0,5354392.0,5355052.0,5355962.0,5356826.0,5376145.0,5377343.0,5381718.0,5383741.0,5384113.0,5385887.0,5399057.0,5401012.0,5404546.0,5404835.0,5404837.0,5405587.0,5406692.0,5408057.0
