annotator,item-18,item-24,item-25,item-45,item-50,item-53,item-60
../preprocessing/output/amy_andrea.json,TMP,CH,,RE,TH,TH,TH
../preprocessing/output/amy_aria.json,,TH,TH,CH,,CH,
text,w [/] is the wedding on Sunday or is it Saturday? ,⌊yeah⌋ so what are your options for that? ,you go through four years of regular school and then to art school or ⌈what⌉? ,so (.) what's the point? ,"⌈what's his⌉ +/.  +, major anyway? ",tell me (.) what if he say? ,what [/] what d[/] what does he want to do? 
time,286833.0,1260563.0,1261966.0,5317567.0,5353649.0,5376145.0,5406692.0
