annotator,item-14,item-15,item-16,item-26,item-27,item-29,item-30,item-31,item-48,item-51,item-52,item-55,item-56,item-57,item-58,item-59,item-60,item-9
../preprocessing/output/amy_alena.json,CS,PQ,YN,PQ,,YN,,PQ,PQ,WH,,PQ,PQ,YN,,PQ,,PQ
../preprocessing/output/amy_aria.json,YN,YN,PQ,,PQ,,YN,YN,YN,,YN,YN,,,YN,,PQ,YN
text,&=laugh to see how horrendous I look? ,are they? ,go? ,that would be great.  you know? ,you know? ,or anyone ⌈who⌉.  knows anyone who goes ⌈there⌉? ,knows anyone who goes ⌈there⌉? ,kind of goony but ⌈you know⌉? ,⌊did you⌋ really? ,"⌈what's his⌉ +/.  +, major anyway? ","+, major anyway? ",++ really? ,⌊really⌋? ,(be)cause he [/] he doesn't want to [/] he's like [/] (be)cause I said “don't people always say what are you gonna teach”? ,“don't people always say what are you gonna teach”?,“no I don't want to teach” you know? ,you know? ,"+, and then everybody had to get it? "
time,246338.0,252077.0,260993.0,1275462.0,1276743.0,1327313.0,1328428.0,5031575.0,5346690.0,5353649.0,5354392.0,5381718.0,5384113.0,5399057.0,5401012.0,5404835.0,5405587.0,179421.0
