EESchema Schematic File Version 4
LIBS:driver4ejes-cache
EELAYER 26 0
EELAYER END
$Descr A4 11693 8268
encoding utf-8
Sheet 1 3
Title ""
Date ""
Rev ""
Comp ""
Comment1 ""
Comment2 ""
Comment3 ""
Comment4 ""
$EndDescr
$Comp
L Connector:DB9_Female J?
U 1 1 5E4305F6
P 5950 4800
F 0 "J?" H 6129 4846 50  0000 L CNN
F 1 "DB9_Female" H 6129 4755 50  0000 L CNN
F 2 "" H 5950 4800 50  0001 C CNN
F 3 " ~" H 5950 4800 50  0001 C CNN
	1    5950 4800
	1    0    0    -1  
$EndComp
$Comp
L Connector:DB9_Female J?
U 1 1 5E4306B4
P 5950 3700
F 0 "J?" H 6129 3746 50  0000 L CNN
F 1 "DB9_Female" H 6129 3655 50  0000 L CNN
F 2 "" H 5950 3700 50  0001 C CNN
F 3 " ~" H 5950 3700 50  0001 C CNN
	1    5950 3700
	1    0    0    -1  
$EndComp
$Comp
L Connector:DB9_Female J?
U 1 1 5E43073A
P 5950 2600
F 0 "J?" H 6129 2646 50  0000 L CNN
F 1 "DB9_Female" H 6129 2555 50  0000 L CNN
F 2 "" H 5950 2600 50  0001 C CNN
F 3 " ~" H 5950 2600 50  0001 C CNN
	1    5950 2600
	1    0    0    -1  
$EndComp
$Comp
L Connector:DB9_Female J?
U 1 1 5E4307C0
P 5950 1500
F 0 "J?" H 6129 1546 50  0000 L CNN
F 1 "DB9_Female" H 6129 1455 50  0000 L CNN
F 2 "" H 5950 1500 50  0001 C CNN
F 3 " ~" H 5950 1500 50  0001 C CNN
	1    5950 1500
	1    0    0    -1  
$EndComp
$Comp
L Connector:DB25_Female J?
U 1 1 5E430856
P 950 2350
F 0 "J?" H 870 858 50  0000 C CNN
F 1 "DB25_Female" H 870 949 50  0000 C CNN
F 2 "" H 950 2350 50  0001 C CNN
F 3 " ~" H 950 2350 50  0001 C CNN
	1    950  2350
	-1   0    0    1   
$EndComp
Text GLabel 1350 3550 2    50   Input ~ 0
DIR1
Text GLabel 1350 3350 2    50   Input ~ 0
STEP1
Text GLabel 1350 3150 2    50   Input ~ 0
DIR2
Text GLabel 1350 2950 2    50   Input ~ 0
STEP2
Text GLabel 1350 2750 2    50   Input ~ 0
DIR3
Text GLabel 1350 2550 2    50   Input ~ 0
STEP3
Text GLabel 1350 2350 2    50   Input ~ 0
DIR4
Text GLabel 1350 2150 2    50   Input ~ 0
STEP4
Wire Wire Line
	1250 2150 1350 2150
Wire Wire Line
	1350 2350 1250 2350
Wire Wire Line
	1250 2550 1350 2550
Wire Wire Line
	1350 2750 1250 2750
Wire Wire Line
	1350 2950 1250 2950
Wire Wire Line
	1250 3150 1350 3150
Wire Wire Line
	1350 3350 1250 3350
Wire Wire Line
	1250 3550 1350 3550
$Sheet
S 7250 1300 1950 2150
U 5E4FFA3B
F0 "ANTIREBOTE" 50
F1 "file5E4FFA3A.sch" 50
F2 "FC_1_IN" I L 7250 1450 50 
F3 "FC_1_GND" I L 7250 2200 50 
F4 "FC_2_IN" I L 7250 1600 50 
F5 "FC_2_GND" I L 7250 2300 50 
F6 "FC_1_OUT" I R 9200 1450 50 
F7 "FC_2_OUT" I R 9200 1600 50 
F8 "FC_3_IN" I L 7250 1750 50 
F9 "FC_3_GND" I L 7250 2400 50 
F10 "FC_4_IN" I L 7250 1900 50 
F11 "FC_4_GND" I L 7250 2500 50 
F12 "FC_3_OUT" I R 9200 1750 50 
F13 "FC_4_OUT" I R 9200 1900 50 
$EndSheet
$Sheet
S 2550 1000 1950 2250
U 5E5078F8
F0 "DRV8825" 50
F1 "file5E5078F7.sch" 50
F2 "STEP1" I L 2550 1100 50 
F3 "DIR1" I L 2550 1200 50 
F4 "STEP2" I L 2550 1300 50 
F5 "DIR2" I L 2550 1400 50 
F6 "STEP3" I L 2550 1500 50 
F7 "DIR3" I L 2550 1600 50 
F8 "STEP4" I L 2550 1700 50 
F9 "DIR4" I L 2550 1800 50 
$EndSheet
Text GLabel 2450 1100 0    50   Input ~ 0
DIR1
Text GLabel 2450 1200 0    50   Input ~ 0
STEP1
Text GLabel 2450 1300 0    50   Input ~ 0
DIR2
Text GLabel 2450 1400 0    50   Input ~ 0
STEP2
Text GLabel 2450 1500 0    50   Input ~ 0
DIR3
Text GLabel 2450 1600 0    50   Input ~ 0
STEP3
Text GLabel 2450 1700 0    50   Input ~ 0
DIR4
Text GLabel 2450 1800 0    50   Input ~ 0
STEP4
Wire Wire Line
	2450 1100 2550 1100
Wire Wire Line
	2450 1200 2550 1200
Wire Wire Line
	2450 1300 2550 1300
Wire Wire Line
	2550 1400 2450 1400
Wire Wire Line
	2450 1500 2550 1500
Wire Wire Line
	2450 1600 2550 1600
Wire Wire Line
	2550 1700 2450 1700
Wire Wire Line
	2450 1800 2550 1800
Text GLabel 1300 1950 2    50   Input ~ 0
FC_1_OUT
$EndSCHEMATC
