EESchema Schematic File Version 4
LIBS:driver4ejes-cache
EELAYER 26 0
EELAYER END
$Descr A4 11693 8268
encoding utf-8
Sheet 3 3
Title ""
Date ""
Rev ""
Comp ""
Comment1 ""
Comment2 ""
Comment3 ""
Comment4 ""
$EndDescr
$Comp
L mod_drv8825:modulo_drv8825 U?
U 1 1 5E507B5F
P 3100 1650
AR Path="/5E507B5F" Ref="U?"  Part="1" 
AR Path="/5E5078F8/5E507B5F" Ref="X"  Part="1" 
F 0 "X" H 3100 2465 50  0000 C CNN
F 1 "modulo_drv8825" H 3100 2374 50  0000 C CNN
F 2 "" H 3100 1650 50  0001 C CNN
F 3 "" H 3100 1650 50  0001 C CNN
	1    3100 1650
	1    0    0    -1  
$EndComp
$Comp
L mod_drv8825:modulo_drv8825 U?
U 1 1 5E507B66
P 3100 3350
AR Path="/5E507B66" Ref="U?"  Part="1" 
AR Path="/5E5078F8/5E507B66" Ref="Z"  Part="1" 
F 0 "Z" H 3100 4165 50  0000 C CNN
F 1 "modulo_drv8825" H 3100 4074 50  0000 C CNN
F 2 "" H 3100 3350 50  0001 C CNN
F 3 "" H 3100 3350 50  0001 C CNN
	1    3100 3350
	1    0    0    -1  
$EndComp
$Comp
L mod_drv8825:modulo_drv8825 U?
U 1 1 5E507B6D
P 5650 1650
AR Path="/5E507B6D" Ref="U?"  Part="1" 
AR Path="/5E5078F8/5E507B6D" Ref="Y"  Part="1" 
F 0 "Y" H 5650 2465 50  0000 C CNN
F 1 "modulo_drv8825" H 5650 2374 50  0000 C CNN
F 2 "" H 5650 1650 50  0001 C CNN
F 3 "" H 5650 1650 50  0001 C CNN
	1    5650 1650
	1    0    0    -1  
$EndComp
$Comp
L mod_drv8825:modulo_drv8825 U?
U 1 1 5E507B74
P 5650 3350
AR Path="/5E507B74" Ref="U?"  Part="1" 
AR Path="/5E5078F8/5E507B74" Ref="C"  Part="1" 
F 0 "C" H 5650 4165 50  0000 C CNN
F 1 "modulo_drv8825" H 5650 4074 50  0000 C CNN
F 2 "" H 5650 3350 50  0001 C CNN
F 3 "" H 5650 3350 50  0001 C CNN
	1    5650 3350
	1    0    0    -1  
$EndComp
$Comp
L Device:CP 100uF?
U 1 1 5E507B7B
P 3800 1100
AR Path="/5E507B7B" Ref="100uF?"  Part="1" 
AR Path="/5E5078F8/5E507B7B" Ref="100uF?"  Part="1" 
F 0 "100uF?" H 3918 1146 50  0000 L CNN
F 1 "CP" H 3918 1055 50  0000 L CNN
F 2 "" H 3838 950 50  0001 C CNN
F 3 "~" H 3800 1100 50  0001 C CNN
	1    3800 1100
	1    0    0    -1  
$EndComp
$Comp
L Device:CP 100uF?
U 1 1 5E507B82
P 3800 2800
AR Path="/5E507B82" Ref="100uF?"  Part="1" 
AR Path="/5E5078F8/5E507B82" Ref="100uF?"  Part="1" 
F 0 "100uF?" H 3918 2846 50  0000 L CNN
F 1 "CP" H 3918 2755 50  0000 L CNN
F 2 "" H 3838 2650 50  0001 C CNN
F 3 "~" H 3800 2800 50  0001 C CNN
	1    3800 2800
	1    0    0    -1  
$EndComp
$Comp
L Device:CP 100uF?
U 1 1 5E507B89
P 6350 1100
AR Path="/5E507B89" Ref="100uF?"  Part="1" 
AR Path="/5E5078F8/5E507B89" Ref="100uF?"  Part="1" 
F 0 "100uF?" H 6468 1146 50  0000 L CNN
F 1 "CP" H 6468 1055 50  0000 L CNN
F 2 "" H 6388 950 50  0001 C CNN
F 3 "~" H 6350 1100 50  0001 C CNN
	1    6350 1100
	1    0    0    -1  
$EndComp
$Comp
L Device:CP 100uF?
U 1 1 5E507B90
P 6350 2800
AR Path="/5E507B90" Ref="100uF?"  Part="1" 
AR Path="/5E5078F8/5E507B90" Ref="100uF?"  Part="1" 
F 0 "100uF?" H 6468 2846 50  0000 L CNN
F 1 "CP" H 6468 2755 50  0000 L CNN
F 2 "" H 6388 2650 50  0001 C CNN
F 3 "~" H 6350 2800 50  0001 C CNN
	1    6350 2800
	1    0    0    -1  
$EndComp
Wire Wire Line
	6150 2950 6350 2950
Wire Wire Line
	6150 2800 6150 2650
Wire Wire Line
	6150 2650 6350 2650
Wire Wire Line
	6150 1250 6350 1250
Wire Wire Line
	6150 1100 6150 950 
Wire Wire Line
	6150 950  6350 950 
Wire Wire Line
	3800 2950 3600 2950
Wire Wire Line
	3600 2800 3600 2650
Wire Wire Line
	3600 2650 3800 2650
Wire Wire Line
	3800 1250 3600 1250
Wire Wire Line
	3600 1100 3600 950 
Wire Wire Line
	3600 950  3800 950 
$Comp
L power:GNDPWR #PWR?
U 1 1 5E507BA3
P 3800 1300
AR Path="/5E507BA3" Ref="#PWR?"  Part="1" 
AR Path="/5E5078F8/5E507BA3" Ref="#PWR?"  Part="1" 
F 0 "#PWR?" H 3800 1100 50  0001 C CNN
F 1 "GNDPWR" H 3804 1146 50  0000 C CNN
F 2 "" H 3800 1250 50  0001 C CNN
F 3 "" H 3800 1250 50  0001 C CNN
	1    3800 1300
	1    0    0    -1  
$EndComp
$Comp
L power:GNDPWR #PWR?
U 1 1 5E507BA9
P 3800 3000
AR Path="/5E507BA9" Ref="#PWR?"  Part="1" 
AR Path="/5E5078F8/5E507BA9" Ref="#PWR?"  Part="1" 
F 0 "#PWR?" H 3800 2800 50  0001 C CNN
F 1 "GNDPWR" H 3804 2846 50  0000 C CNN
F 2 "" H 3800 2950 50  0001 C CNN
F 3 "" H 3800 2950 50  0001 C CNN
	1    3800 3000
	1    0    0    -1  
$EndComp
$Comp
L power:GNDPWR #PWR?
U 1 1 5E507BAF
P 6350 1300
AR Path="/5E507BAF" Ref="#PWR?"  Part="1" 
AR Path="/5E5078F8/5E507BAF" Ref="#PWR?"  Part="1" 
F 0 "#PWR?" H 6350 1100 50  0001 C CNN
F 1 "GNDPWR" H 6354 1146 50  0000 C CNN
F 2 "" H 6350 1250 50  0001 C CNN
F 3 "" H 6350 1250 50  0001 C CNN
	1    6350 1300
	1    0    0    -1  
$EndComp
$Comp
L power:GNDPWR #PWR?
U 1 1 5E507BB5
P 6350 3000
AR Path="/5E507BB5" Ref="#PWR?"  Part="1" 
AR Path="/5E5078F8/5E507BB5" Ref="#PWR?"  Part="1" 
F 0 "#PWR?" H 6350 2800 50  0001 C CNN
F 1 "GNDPWR" H 6354 2846 50  0000 C CNN
F 2 "" H 6350 2950 50  0001 C CNN
F 3 "" H 6350 2950 50  0001 C CNN
	1    6350 3000
	1    0    0    -1  
$EndComp
Wire Wire Line
	6350 3000 6350 2950
Connection ~ 6350 2950
Wire Wire Line
	6350 1300 6350 1250
Connection ~ 6350 1250
Wire Wire Line
	3800 3000 3800 2950
Connection ~ 3800 2950
Wire Wire Line
	3800 1300 3800 1250
Connection ~ 3800 1250
Wire Wire Line
	2400 2050 2600 2050
Wire Wire Line
	2600 2200 2400 2200
Wire Wire Line
	2400 3750 2600 3750
Wire Wire Line
	2600 3900 2400 3900
Wire Wire Line
	4900 2050 5150 2050
Wire Wire Line
	4900 2200 5150 2200
Wire Wire Line
	4850 3750 5150 3750
$Comp
L power:GND #PWR?
U 1 1 5E507BD3
P 3700 3900
AR Path="/5E507BD3" Ref="#PWR?"  Part="1" 
AR Path="/5E5078F8/5E507BD3" Ref="#PWR?"  Part="1" 
F 0 "#PWR?" H 3700 3650 50  0001 C CNN
F 1 "GND" H 3705 3727 50  0000 C CNN
F 2 "" H 3700 3900 50  0001 C CNN
F 3 "" H 3700 3900 50  0001 C CNN
	1    3700 3900
	1    0    0    -1  
$EndComp
$Comp
L power:GND #PWR?
U 1 1 5E507BD9
P 6250 2200
AR Path="/5E507BD9" Ref="#PWR?"  Part="1" 
AR Path="/5E5078F8/5E507BD9" Ref="#PWR?"  Part="1" 
F 0 "#PWR?" H 6250 1950 50  0001 C CNN
F 1 "GND" H 6255 2027 50  0000 C CNN
F 2 "" H 6250 2200 50  0001 C CNN
F 3 "" H 6250 2200 50  0001 C CNN
	1    6250 2200
	1    0    0    -1  
$EndComp
$Comp
L power:GND #PWR?
U 1 1 5E507BDF
P 6250 3900
AR Path="/5E507BDF" Ref="#PWR?"  Part="1" 
AR Path="/5E5078F8/5E507BDF" Ref="#PWR?"  Part="1" 
F 0 "#PWR?" H 6250 3650 50  0001 C CNN
F 1 "GND" H 6255 3727 50  0000 C CNN
F 2 "" H 6250 3900 50  0001 C CNN
F 3 "" H 6250 3900 50  0001 C CNN
	1    6250 3900
	1    0    0    -1  
$EndComp
Wire Wire Line
	6250 3900 6150 3900
Wire Wire Line
	6250 2200 6150 2200
Wire Wire Line
	3700 3900 3600 3900
$Comp
L power:GND #PWR?
U 1 1 5E507BE8
P 3700 2200
AR Path="/5E507BE8" Ref="#PWR?"  Part="1" 
AR Path="/5E5078F8/5E507BE8" Ref="#PWR?"  Part="1" 
F 0 "#PWR?" H 3700 1950 50  0001 C CNN
F 1 "GND" H 3705 2027 50  0000 C CNN
F 2 "" H 3700 2200 50  0001 C CNN
F 3 "" H 3700 2200 50  0001 C CNN
	1    3700 2200
	1    0    0    -1  
$EndComp
Wire Wire Line
	3700 2200 3600 2200
Text HLabel 2400 2050 0    50   Input ~ 0
STEP1
Text HLabel 2400 2200 0    50   Input ~ 0
DIR1
Text HLabel 2400 3750 0    50   Input ~ 0
STEP2
Text HLabel 2400 3900 0    50   Input ~ 0
DIR2
Text HLabel 4900 2050 0    50   Input ~ 0
STEP3
Text HLabel 4900 2200 0    50   Input ~ 0
DIR3
Text HLabel 4850 3750 0    50   Input ~ 0
STEP4
Text HLabel 4850 3900 0    50   Input ~ 0
DIR4
Wire Wire Line
	4850 3900 5150 3900
Text GLabel 2550 1250 0    50   Input ~ 0
M0_X
Text GLabel 2550 1400 0    50   Input ~ 0
M1_X
Text GLabel 2550 1550 0    50   Input ~ 0
M2_X
Wire Wire Line
	2600 1550 2550 1550
Wire Wire Line
	2550 1400 2600 1400
Wire Wire Line
	2600 1250 2550 1250
Text GLabel 2550 2950 0    50   Input ~ 0
M0_Z
Text GLabel 2550 3100 0    50   Input ~ 0
M1_Z
Text GLabel 2550 3250 0    50   Input ~ 0
M2_Z
Wire Wire Line
	2600 3250 2550 3250
Wire Wire Line
	2550 3100 2600 3100
Wire Wire Line
	2600 2950 2550 2950
Text GLabel 5100 2950 0    50   Input ~ 0
M0_C
Text GLabel 5100 3100 0    50   Input ~ 0
M1_C
Text GLabel 5100 3250 0    50   Input ~ 0
M2_C
Wire Wire Line
	5150 3250 5100 3250
Wire Wire Line
	5100 3100 5150 3100
Wire Wire Line
	5150 2950 5100 2950
Text GLabel 5100 1250 0    50   Input ~ 0
M0_Y
Text GLabel 5100 1400 0    50   Input ~ 0
M1_Y
Text GLabel 5100 1550 0    50   Input ~ 0
M2_Y
Wire Wire Line
	5150 1550 5100 1550
Wire Wire Line
	5100 1400 5150 1400
Wire Wire Line
	5150 1250 5100 1250
$Comp
L Connector_Generic:Conn_02x03_Counter_Clockwise M_X
U 1 1 5E50D2A6
P 9600 1300
F 0 "M_X" H 9650 1617 50  0000 C CNN
F 1 "Conn_02x03_Counter_Clockwise" H 9650 1526 50  0000 C CNN
F 2 "" H 9600 1300 50  0001 C CNN
F 3 "~" H 9600 1300 50  0001 C CNN
	1    9600 1300
	1    0    0    -1  
$EndComp
$Comp
L Connector_Generic:Conn_02x03_Counter_Clockwise M_Y
U 1 1 5E50D592
P 9600 1750
F 0 "M_Y" H 9650 2067 50  0000 C CNN
F 1 "Conn_02x03_Counter_Clockwise" H 9650 1976 50  0000 C CNN
F 2 "" H 9600 1750 50  0001 C CNN
F 3 "~" H 9600 1750 50  0001 C CNN
	1    9600 1750
	1    0    0    -1  
$EndComp
$Comp
L Connector_Generic:Conn_02x03_Counter_Clockwise M_Z
U 1 1 5E50D5D0
P 9600 2200
F 0 "M_Z" H 9650 2517 50  0000 C CNN
F 1 "Conn_02x03_Counter_Clockwise" H 9650 2426 50  0000 C CNN
F 2 "" H 9600 2200 50  0001 C CNN
F 3 "~" H 9600 2200 50  0001 C CNN
	1    9600 2200
	1    0    0    -1  
$EndComp
$Comp
L Connector_Generic:Conn_02x03_Counter_Clockwise M_C
U 1 1 5E50D602
P 9600 2650
F 0 "M_C" H 9650 2967 50  0000 C CNN
F 1 "Conn_02x03_Counter_Clockwise" H 9650 2876 50  0000 C CNN
F 2 "" H 9600 2650 50  0001 C CNN
F 3 "~" H 9600 2650 50  0001 C CNN
	1    9600 2650
	1    0    0    -1  
$EndComp
Text GLabel 9350 1200 0    50   Input ~ 0
M0_X
Text GLabel 9350 1300 0    50   Input ~ 0
M1_X
Text GLabel 9350 1400 0    50   Input ~ 0
M2_X
Wire Wire Line
	9350 1400 9400 1400
Wire Wire Line
	9350 1300 9400 1300
Wire Wire Line
	9350 1200 9400 1200
Text GLabel 9350 1650 0    50   Input ~ 0
M0_Y
Text GLabel 9350 1750 0    50   Input ~ 0
M1_Y
Text GLabel 9350 1850 0    50   Input ~ 0
M2_Y
Text GLabel 9350 2100 0    50   Input ~ 0
M0_Z
Text GLabel 9350 2200 0    50   Input ~ 0
M1_Z
Text GLabel 9350 2300 0    50   Input ~ 0
M2_Z
Text GLabel 9350 2550 0    50   Input ~ 0
M0_C
Text GLabel 9350 2650 0    50   Input ~ 0
M1_C
Text GLabel 9350 2750 0    50   Input ~ 0
M2_C
Wire Wire Line
	9350 2750 9400 2750
Wire Wire Line
	9350 2650 9400 2650
Wire Wire Line
	9350 2550 9400 2550
Wire Wire Line
	9350 2300 9400 2300
Wire Wire Line
	9350 2200 9400 2200
Wire Wire Line
	9350 2100 9400 2100
Wire Wire Line
	9350 1850 9400 1850
Wire Wire Line
	9350 1750 9400 1750
Wire Wire Line
	9350 1650 9400 1650
Wire Wire Line
	9900 2750 9900 2650
Wire Wire Line
	9900 2550 9900 2650
Connection ~ 9900 2650
Wire Wire Line
	9900 2550 9900 2300
Connection ~ 9900 2550
Wire Wire Line
	9900 2300 9900 2200
Connection ~ 9900 2300
Wire Wire Line
	9900 2200 9900 2100
Connection ~ 9900 2200
Wire Wire Line
	9900 2100 9900 1850
Connection ~ 9900 2100
Wire Wire Line
	9900 1850 9900 1750
Connection ~ 9900 1850
Wire Wire Line
	9900 1750 9900 1650
Connection ~ 9900 1750
Wire Wire Line
	9900 1650 9900 1400
Connection ~ 9900 1650
Wire Wire Line
	9900 1400 9900 1300
Connection ~ 9900 1400
Wire Wire Line
	9900 1300 9900 1200
Connection ~ 9900 1300
Connection ~ 9900 1200
$Comp
L power:VCC #PWR?
U 1 1 5E528BCE
P 9900 950
F 0 "#PWR?" H 9900 800 50  0001 C CNN
F 1 "VCC" H 9917 1123 50  0000 C CNN
F 2 "" H 9900 950 50  0001 C CNN
F 3 "" H 9900 950 50  0001 C CNN
	1    9900 950 
	1    0    0    -1  
$EndComp
Wire Wire Line
	9900 950  9900 1200
Wire Wire Line
	5100 1750 5150 1750
Wire Wire Line
	2550 1750 2600 1750
Wire Wire Line
	2550 3450 2600 3450
Wire Wire Line
	5100 3450 5150 3450
$Comp
L Device:R 10K
U 1 1 5E533552
P 9350 3800
F 0 "10K" H 9420 3846 50  0000 L CNN
F 1 "R" H 9420 3755 50  0000 L CNN
F 2 "" V 9280 3800 50  0001 C CNN
F 3 "~" H 9350 3800 50  0001 C CNN
	1    9350 3800
	1    0    0    -1  
$EndComp
$Comp
L power:VCC #PWR?
U 1 1 5E534C70
P 9350 3250
F 0 "#PWR?" H 9350 3100 50  0001 C CNN
F 1 "VCC" H 9367 3423 50  0000 C CNN
F 2 "" H 9350 3250 50  0001 C CNN
F 3 "" H 9350 3250 50  0001 C CNN
	1    9350 3250
	1    0    0    -1  
$EndComp
$Comp
L Connector:Conn_01x02_Female STOP
U 1 1 5E53639F
P 9550 3450
F 0 "STOP" H 9577 3426 50  0000 L CNN
F 1 "Conn_01x02_Female" H 9577 3335 50  0000 L CNN
F 2 "" H 9550 3450 50  0001 C CNN
F 3 "~" H 9550 3450 50  0001 C CNN
	1    9550 3450
	1    0    0    -1  
$EndComp
$Comp
L power:GND #PWR?
U 1 1 5E537B3F
P 9350 4000
F 0 "#PWR?" H 9350 3750 50  0001 C CNN
F 1 "GND" H 9355 3827 50  0000 C CNN
F 2 "" H 9350 4000 50  0001 C CNN
F 3 "" H 9350 4000 50  0001 C CNN
	1    9350 4000
	1    0    0    -1  
$EndComp
Wire Wire Line
	9350 3550 9350 3650
Wire Wire Line
	2600 3600 2550 3600
Wire Wire Line
	2550 3600 2550 3450
Wire Wire Line
	2600 1900 2550 1900
Wire Wire Line
	2550 1900 2550 1750
Wire Wire Line
	5100 1750 5100 1900
Wire Wire Line
	5100 1900 5150 1900
Wire Wire Line
	5150 3600 5100 3600
Wire Wire Line
	5100 3600 5100 3450
$Comp
L power:VCC #PWR?
U 1 1 5E5406F1
P 4900 1900
F 0 "#PWR?" H 4900 1750 50  0001 C CNN
F 1 "VCC" H 4917 2073 50  0000 C CNN
F 2 "" H 4900 1900 50  0001 C CNN
F 3 "" H 4900 1900 50  0001 C CNN
	1    4900 1900
	1    0    0    -1  
$EndComp
$Comp
L power:VCC #PWR?
U 1 1 5E54075E
P 2350 1900
F 0 "#PWR?" H 2350 1750 50  0001 C CNN
F 1 "VCC" H 2367 2073 50  0000 C CNN
F 2 "" H 2350 1900 50  0001 C CNN
F 3 "" H 2350 1900 50  0001 C CNN
	1    2350 1900
	1    0    0    -1  
$EndComp
$Comp
L power:VCC #PWR?
U 1 1 5E5407D9
P 2350 3600
F 0 "#PWR?" H 2350 3450 50  0001 C CNN
F 1 "VCC" H 2367 3773 50  0000 C CNN
F 2 "" H 2350 3600 50  0001 C CNN
F 3 "" H 2350 3600 50  0001 C CNN
	1    2350 3600
	1    0    0    -1  
$EndComp
$Comp
L power:VCC #PWR?
U 1 1 5E540862
P 4900 3600
F 0 "#PWR?" H 4900 3450 50  0001 C CNN
F 1 "VCC" H 4917 3773 50  0000 C CNN
F 2 "" H 4900 3600 50  0001 C CNN
F 3 "" H 4900 3600 50  0001 C CNN
	1    4900 3600
	1    0    0    -1  
$EndComp
Wire Wire Line
	5100 3600 4900 3600
Connection ~ 5100 3600
Wire Wire Line
	2350 3600 2550 3600
Connection ~ 2550 3600
Wire Wire Line
	2550 1900 2350 1900
Connection ~ 2550 1900
Wire Wire Line
	5100 1900 4900 1900
Connection ~ 5100 1900
Wire Wire Line
	9350 3950 9350 4000
Text GLabel 9300 3550 0    50   Input ~ 0
STOP
Wire Wire Line
	9300 3550 9350 3550
Connection ~ 9350 3550
Text GLabel 5100 2800 0    50   Input ~ 0
STOP
Text GLabel 5100 1100 0    50   Input ~ 0
STOP
Text GLabel 2550 1100 0    50   Input ~ 0
STOP
Text GLabel 2550 2800 0    50   Input ~ 0
STOP
Wire Wire Line
	2550 2800 2600 2800
Wire Wire Line
	2550 1100 2600 1100
Wire Wire Line
	5100 1100 5150 1100
Wire Wire Line
	5100 2800 5150 2800
Wire Wire Line
	9350 3250 9350 3450
Text GLabel 3650 3750 2    50   Input ~ 0
FAULT
Text GLabel 6200 3750 2    50   Input ~ 0
FAULT
Text GLabel 3650 2050 2    50   Input ~ 0
FAULT
Text GLabel 6200 2050 2    50   Input ~ 0
FAULT
Wire Wire Line
	3600 2050 3650 2050
Wire Wire Line
	3600 3750 3650 3750
Wire Wire Line
	6150 3750 6200 3750
Wire Wire Line
	6150 2050 6200 2050
Text GLabel 9300 4600 0    50   Input ~ 0
FAULT
$Comp
L Device:R R?
U 1 1 5E5659B6
P 9500 4600
F 0 "R?" V 9293 4600 50  0000 C CNN
F 1 "R" V 9384 4600 50  0000 C CNN
F 2 "" V 9430 4600 50  0001 C CNN
F 3 "~" H 9500 4600 50  0001 C CNN
	1    9500 4600
	0    1    1    0   
$EndComp
$Comp
L Device:LED LED_FALLA
U 1 1 5E565A41
P 9850 4600
F 0 "LED_FALLA" H 9842 4345 50  0000 C CNN
F 1 "LED" H 9842 4436 50  0000 C CNN
F 2 "" H 9850 4600 50  0001 C CNN
F 3 "~" H 9850 4600 50  0001 C CNN
	1    9850 4600
	-1   0    0    1   
$EndComp
Wire Wire Line
	9300 4600 9350 4600
Wire Wire Line
	9650 4600 9700 4600
$Comp
L power:GND #PWR?
U 1 1 5E56B236
P 10100 4600
F 0 "#PWR?" H 10100 4350 50  0001 C CNN
F 1 "GND" H 10105 4427 50  0000 C CNN
F 2 "" H 10100 4600 50  0001 C CNN
F 3 "" H 10100 4600 50  0001 C CNN
	1    10100 4600
	1    0    0    -1  
$EndComp
Wire Wire Line
	10000 4600 10100 4600
$EndSCHEMATC
