CompositeBuildMap             : IdeCompositeBuildMapImpl
    - builds                      : <ROOT> (IdeBuildImpl)
        buildName                     : :
    gradleSupportsDirectTaskInvocation      : true
MODULE                        : project
    externalProject               : project (DefaultExternalProject)
        name                          : project
        qName                         : project
        version                       : unspecified
        childProjects
            app                           : :app (DefaultExternalProject)
                name                          : app
                qName                         : :app
                group                         : project
                version                       : unspecified
                sourceCompatibility           : <PROJECT_JDK_FEATURE_LEVEL>
                targetCompatibility           : <PROJECT_JDK_FEATURE_LEVEL>
                projectDir                    : <ROOT>/app
                buildDir                      : <ROOT>/app/build
                buildFile                     : <ROOT>/app/build.gradle
                tasks
                    testDebugUnitTest             : testDebugUnitTest (DefaultExternalTask)
                        qName                         : :app:testDebugUnitTest
                    testReleaseUnitTest           : testReleaseUnitTest (DefaultExternalTask)
                        qName                         : :app:testReleaseUnitTest
                externalSystemId              : GRADLE
                artifactsByConfiguration
                    androidApis                   : <empty>
                    androidJacocoAnt              : <empty>
                    androidJdkImage               : <empty>
                    androidTestAnnotationProcessor          : <empty>
                    androidTestCompileOnly        : <empty>
                    androidTestDebugAnnotationProcessor     : <empty>
                    androidTestDebugCompileOnly   : <empty>
                    androidTestDebugImplementation          : <empty>
                    androidTestDebugRuntimeOnly   : <empty>
                    androidTestDebugWearApp       : <empty>
                    androidTestImplementation     : <empty>
                    androidTestReleaseAnnotationProcessor   : <empty>
                    androidTestReleaseCompileOnly : <empty>
                    androidTestReleaseImplementation        : <empty>
                    androidTestReleaseRuntimeOnly : <empty>
                    androidTestReleaseWearApp     : <empty>
                    androidTestRuntimeOnly        : <empty>
                    androidTestUtil               : <empty>
                    androidTestWearApp            : <empty>
                    annotationProcessor           : <empty>
                    api                           : <empty>
                    archives                      : <empty>
                    compileOnly                   : <empty>
                    coreLibraryDesugaring         : <empty>
                    debugAabPublication           : <empty>
                    debugAndroidTestAnnotationProcessorClasspath      : <empty>
                    debugAndroidTestCompileClasspath        : <empty>
                    debugAndroidTestRuntimeClasspath        : <empty>
                    debugAnnotationProcessor      : <empty>
                    debugAnnotationProcessorClasspath       : <empty>
                    debugApi                      : <empty>
                    debugApiElements              : <empty>
                    - debugApkPublication         : <ROOT>/app/build/outputs/apk-zips/debug/apks.zip [-]
                    debugCompileClasspath         : <empty>
                    debugCompileOnly              : <empty>
                    debugImplementation           : <empty>
                    debugReverseMetadataValues    : <empty>
                    debugRuntimeClasspath         : <empty>
                    debugRuntimeElements          : <empty>
                    debugRuntimeOnly              : <empty>
                    debugUnitTestAnnotationProcessorClasspath         : <empty>
                    debugUnitTestCompileClasspath : <empty>
                    debugUnitTestRuntimeClasspath : <empty>
                    debugWearApp                  : <empty>
                    debugWearBundling             : <empty>
                    default                       : <empty>
                    implementation                : <empty>
                    lintChecks                    : <empty>
                    lintPublish                   : <empty>
                    releaseAabPublication         : <empty>
                    releaseAnnotationProcessor    : <empty>
                    releaseAnnotationProcessorClasspath     : <empty>
                    releaseApi                    : <empty>
                    releaseApiElements            : <empty>
                    - releaseApkPublication       : <ROOT>/app/build/outputs/apk-zips/release/apks.zip [-]
                    releaseCompileClasspath       : <empty>
                    releaseCompileOnly            : <empty>
                    releaseImplementation         : <empty>
                    releaseReverseMetadataValues  : <empty>
                    releaseRuntimeClasspath       : <empty>
                    releaseRuntimeElements        : <empty>
                    releaseRuntimeOnly            : <empty>
                    releaseUnitTestAnnotationProcessorClasspath       : <empty>
                    releaseUnitTestCompileClasspath         : <empty>
                    releaseUnitTestRuntimeClasspath         : <empty>
                    releaseWearApp                : <empty>
                    releaseWearBundling           : <empty>
                    runtimeOnly                   : <empty>
                    testAnnotationProcessor       : <empty>
                    testCompileOnly               : <empty>
                    testDebugAnnotationProcessor  : <empty>
                    testDebugCompileOnly          : <empty>
                    testDebugImplementation       : <empty>
                    testDebugRuntimeOnly          : <empty>
                    testDebugWearApp              : <empty>
                    testFixturesAnnotationProcessor         : <empty>
                    testFixturesApi               : <empty>
                    testFixturesCompileOnly       : <empty>
                    testFixturesDebugAnnotationProcessor    : <empty>
                    testFixturesDebugApi          : <empty>
                    testFixturesDebugCompileOnly  : <empty>
                    testFixturesDebugImplementation         : <empty>
                    testFixturesDebugRuntimeOnly  : <empty>
                    testFixturesDebugWearApp      : <empty>
                    testFixturesImplementation    : <empty>
                    testFixturesReleaseAnnotationProcessor  : <empty>
                    testFixturesReleaseApi        : <empty>
                    testFixturesReleaseCompileOnly          : <empty>
                    testFixturesReleaseImplementation       : <empty>
                    testFixturesReleaseRuntimeOnly          : <empty>
                    testFixturesReleaseWearApp    : <empty>
                    testFixturesRuntimeOnly       : <empty>
                    testFixturesWearApp           : <empty>
                    testImplementation            : <empty>
                    testReleaseAnnotationProcessor          : <empty>
                    testReleaseCompileOnly        : <empty>
                    testReleaseImplementation     : <empty>
                    testReleaseRuntimeOnly        : <empty>
                    testReleaseWearApp            : <empty>
                    testRuntimeOnly               : <empty>
                    testWearApp                   : <empty>
                    wearApp                       : <empty>
            lib                           : :lib (DefaultExternalProject)
                name                          : lib
                qName                         : :lib
                group                         : project
                version                       : unspecified
                sourceCompatibility           : <PROJECT_JDK_FEATURE_LEVEL>
                targetCompatibility           : <PROJECT_JDK_FEATURE_LEVEL>
                projectDir                    : <ROOT>/lib
                buildDir                      : <ROOT>/lib/build
                buildFile                     : <ROOT>/lib/build.gradle
                tasks
                    testDebugUnitTest             : testDebugUnitTest (DefaultExternalTask)
                        qName                         : :lib:testDebugUnitTest
                    testReleaseUnitTest           : testReleaseUnitTest (DefaultExternalTask)
                        qName                         : :lib:testReleaseUnitTest
                externalSystemId              : GRADLE
                artifactsByConfiguration
                    androidApis                   : <empty>
                    androidJacocoAnt              : <empty>
                    androidJdkImage               : <empty>
                    androidTestAnnotationProcessor          : <empty>
                    androidTestCompileOnly        : <empty>
                    androidTestDebugAnnotationProcessor     : <empty>
                    androidTestDebugCompileOnly   : <empty>
                    androidTestDebugImplementation          : <empty>
                    androidTestDebugRuntimeOnly   : <empty>
                    androidTestDebugWearApp       : <empty>
                    androidTestImplementation     : <empty>
                    androidTestReleaseAnnotationProcessor   : <empty>
                    androidTestReleaseCompileOnly : <empty>
                    androidTestReleaseImplementation        : <empty>
                    androidTestReleaseRuntimeOnly : <empty>
                    androidTestReleaseWearApp     : <empty>
                    androidTestRuntimeOnly        : <empty>
                    androidTestUtil               : <empty>
                    androidTestWearApp            : <empty>
                    annotationProcessor           : <empty>
                    api                           : <empty>
                    archives                      : <empty>
                    compileOnly                   : <empty>
                    coreLibraryDesugaring         : <empty>
                    debugAndroidTestAnnotationProcessorClasspath      : <empty>
                    debugAndroidTestCompileClasspath        : <empty>
                    debugAndroidTestRuntimeClasspath        : <empty>
                    debugAnnotationProcessor      : <empty>
                    debugAnnotationProcessorClasspath       : <empty>
                    debugApi                      : <empty>
                    debugApiElements              : <empty>
                    debugCompileClasspath         : <empty>
                    debugCompileOnly              : <empty>
                    debugImplementation           : <empty>
                    debugRuntimeClasspath         : <empty>
                    debugRuntimeElements          : <empty>
                    debugRuntimeOnly              : <empty>
                    debugUnitTestAnnotationProcessorClasspath         : <empty>
                    debugUnitTestCompileClasspath : <empty>
                    debugUnitTestRuntimeClasspath : <empty>
                    - debugVariantAllApiPublication         : <ROOT>/lib/build/outputs/aar/lib-debug.aar [-]
                    - debugVariantAllRuntimePublication     : <ROOT>/lib/build/outputs/aar/lib-debug.aar [-]
                    - debugVariantDebugApiPublication       : <ROOT>/lib/build/outputs/aar/lib-debug.aar [-]
                    - debugVariantDebugRuntimePublication   : <ROOT>/lib/build/outputs/aar/lib-debug.aar [-]
                    debugWearApp                  : <empty>
                    default                       : <empty>
                    implementation                : <empty>
                    lintChecks                    : <empty>
                    lintPublish                   : <empty>
                    releaseAnnotationProcessor    : <empty>
                    releaseAnnotationProcessorClasspath     : <empty>
                    releaseApi                    : <empty>
                    releaseApiElements            : <empty>
                    releaseCompileClasspath       : <empty>
                    releaseCompileOnly            : <empty>
                    releaseImplementation         : <empty>
                    releaseRuntimeClasspath       : <empty>
                    releaseRuntimeElements        : <empty>
                    releaseRuntimeOnly            : <empty>
                    releaseUnitTestAnnotationProcessorClasspath       : <empty>
                    releaseUnitTestCompileClasspath         : <empty>
                    releaseUnitTestRuntimeClasspath         : <empty>
                    - releaseVariantAllApiPublication       : <ROOT>/lib/build/outputs/aar/lib-release.aar [-]
                    - releaseVariantAllRuntimePublication   : <ROOT>/lib/build/outputs/aar/lib-release.aar [-]
                    - releaseVariantReleaseApiPublication   : <ROOT>/lib/build/outputs/aar/lib-release.aar [-]
                    - releaseVariantReleaseRuntimePublication         : <ROOT>/lib/build/outputs/aar/lib-release.aar [-]
                    releaseWearApp                : <empty>
                    runtimeOnly                   : <empty>
                    testAnnotationProcessor       : <empty>
                    testCompileOnly               : <empty>
                    testDebugAnnotationProcessor  : <empty>
                    testDebugCompileOnly          : <empty>
                    testDebugImplementation       : <empty>
                    testDebugRuntimeOnly          : <empty>
                    testDebugWearApp              : <empty>
                    testFixturesAnnotationProcessor         : <empty>
                    testFixturesApi               : <empty>
                    testFixturesCompileOnly       : <empty>
                    testFixturesDebugAnnotationProcessor    : <empty>
                    testFixturesDebugApi          : <empty>
                    testFixturesDebugCompileOnly  : <empty>
                    testFixturesDebugImplementation         : <empty>
                    testFixturesDebugRuntimeOnly  : <empty>
                    testFixturesDebugWearApp      : <empty>
                    testFixturesImplementation    : <empty>
                    testFixturesReleaseAnnotationProcessor  : <empty>
                    testFixturesReleaseApi        : <empty>
                    testFixturesReleaseCompileOnly          : <empty>
                    testFixturesReleaseImplementation       : <empty>
                    testFixturesReleaseRuntimeOnly          : <empty>
                    testFixturesReleaseWearApp    : <empty>
                    testFixturesRuntimeOnly       : <empty>
                    testFixturesWearApp           : <empty>
                    testImplementation            : <empty>
                    testReleaseAnnotationProcessor          : <empty>
                    testReleaseCompileOnly        : <empty>
                    testReleaseImplementation     : <empty>
                    testReleaseRuntimeOnly        : <empty>
                    testReleaseWearApp            : <empty>
                    testRuntimeOnly               : <empty>
                    testWearApp                   : <empty>
                    wearApp                       : <empty>
            otherlib                      : :otherlib (DefaultExternalProject)
                name                          : otherlib
                qName                         : :otherlib
                group                         : project
                version                       : unspecified
                sourceCompatibility           : <PROJECT_JDK_FEATURE_LEVEL>
                targetCompatibility           : <PROJECT_JDK_FEATURE_LEVEL>
                projectDir                    : <ROOT>/otherlib
                buildDir                      : <ROOT>/otherlib/build
                buildFile                     : <ROOT>/otherlib/build.gradle
                tasks
                    testDebugUnitTest             : testDebugUnitTest (DefaultExternalTask)
                        qName                         : :otherlib:testDebugUnitTest
                    testReleaseUnitTest           : testReleaseUnitTest (DefaultExternalTask)
                        qName                         : :otherlib:testReleaseUnitTest
                externalSystemId              : GRADLE
                artifactsByConfiguration
                    androidApis                   : <empty>
                    androidJacocoAnt              : <empty>
                    androidJdkImage               : <empty>
                    androidTestAnnotationProcessor          : <empty>
                    androidTestCompileOnly        : <empty>
                    androidTestDebugAnnotationProcessor     : <empty>
                    androidTestDebugCompileOnly   : <empty>
                    androidTestDebugImplementation          : <empty>
                    androidTestDebugRuntimeOnly   : <empty>
                    androidTestDebugWearApp       : <empty>
                    androidTestImplementation     : <empty>
                    androidTestReleaseAnnotationProcessor   : <empty>
                    androidTestReleaseCompileOnly : <empty>
                    androidTestReleaseImplementation        : <empty>
                    androidTestReleaseRuntimeOnly : <empty>
                    androidTestReleaseWearApp     : <empty>
                    androidTestRuntimeOnly        : <empty>
                    androidTestUtil               : <empty>
                    androidTestWearApp            : <empty>
                    annotationProcessor           : <empty>
                    api                           : <empty>
                    archives                      : <empty>
                    compileOnly                   : <empty>
                    coreLibraryDesugaring         : <empty>
                    debugAndroidTestAnnotationProcessorClasspath      : <empty>
                    debugAndroidTestCompileClasspath        : <empty>
                    debugAndroidTestRuntimeClasspath        : <empty>
                    debugAnnotationProcessor      : <empty>
                    debugAnnotationProcessorClasspath       : <empty>
                    debugApi                      : <empty>
                    debugApiElements              : <empty>
                    debugCompileClasspath         : <empty>
                    debugCompileOnly              : <empty>
                    debugImplementation           : <empty>
                    debugRuntimeClasspath         : <empty>
                    debugRuntimeElements          : <empty>
                    debugRuntimeOnly              : <empty>
                    debugUnitTestAnnotationProcessorClasspath         : <empty>
                    debugUnitTestCompileClasspath : <empty>
                    debugUnitTestRuntimeClasspath : <empty>
                    - debugVariantAllApiPublication         : <ROOT>/otherlib/build/outputs/aar/otherlib-debug.aar [-]
                    - debugVariantAllRuntimePublication     : <ROOT>/otherlib/build/outputs/aar/otherlib-debug.aar [-]
                    - debugVariantDebugApiPublication       : <ROOT>/otherlib/build/outputs/aar/otherlib-debug.aar [-]
                    - debugVariantDebugRuntimePublication   : <ROOT>/otherlib/build/outputs/aar/otherlib-debug.aar [-]
                    debugWearApp                  : <empty>
                    default                       : <empty>
                    implementation                : <empty>
                    lintChecks                    : <empty>
                    lintPublish                   : <empty>
                    releaseAnnotationProcessor    : <empty>
                    releaseAnnotationProcessorClasspath     : <empty>
                    releaseApi                    : <empty>
                    releaseApiElements            : <empty>
                    releaseCompileClasspath       : <empty>
                    releaseCompileOnly            : <empty>
                    releaseImplementation         : <empty>
                    releaseRuntimeClasspath       : <empty>
                    releaseRuntimeElements        : <empty>
                    releaseRuntimeOnly            : <empty>
                    releaseUnitTestAnnotationProcessorClasspath       : <empty>
                    releaseUnitTestCompileClasspath         : <empty>
                    releaseUnitTestRuntimeClasspath         : <empty>
                    - releaseVariantAllApiPublication       : <ROOT>/otherlib/build/outputs/aar/otherlib-release.aar [-]
                    - releaseVariantAllRuntimePublication   : <ROOT>/otherlib/build/outputs/aar/otherlib-release.aar [-]
                    - releaseVariantReleaseApiPublication   : <ROOT>/otherlib/build/outputs/aar/otherlib-release.aar [-]
                    - releaseVariantReleaseRuntimePublication         : <ROOT>/otherlib/build/outputs/aar/otherlib-release.aar [-]
                    releaseWearApp                : <empty>
                    runtimeOnly                   : <empty>
                    testAnnotationProcessor       : <empty>
                    testCompileOnly               : <empty>
                    testDebugAnnotationProcessor  : <empty>
                    testDebugCompileOnly          : <empty>
                    testDebugImplementation       : <empty>
                    testDebugRuntimeOnly          : <empty>
                    testDebugWearApp              : <empty>
                    testFixturesAnnotationProcessor         : <empty>
                    testFixturesApi               : <empty>
                    testFixturesCompileOnly       : <empty>
                    testFixturesDebugAnnotationProcessor    : <empty>
                    testFixturesDebugApi          : <empty>
                    testFixturesDebugCompileOnly  : <empty>
                    testFixturesDebugImplementation         : <empty>
                    testFixturesDebugRuntimeOnly  : <empty>
                    testFixturesDebugWearApp      : <empty>
                    testFixturesImplementation    : <empty>
                    testFixturesReleaseAnnotationProcessor  : <empty>
                    testFixturesReleaseApi        : <empty>
                    testFixturesReleaseCompileOnly          : <empty>
                    testFixturesReleaseImplementation       : <empty>
                    testFixturesReleaseRuntimeOnly          : <empty>
                    testFixturesReleaseWearApp    : <empty>
                    testFixturesRuntimeOnly       : <empty>
                    testFixturesWearApp           : <empty>
                    testImplementation            : <empty>
                    testReleaseAnnotationProcessor          : <empty>
                    testReleaseCompileOnly        : <empty>
                    testReleaseImplementation     : <empty>
                    testReleaseRuntimeOnly        : <empty>
                    testReleaseWearApp            : <empty>
                    testRuntimeOnly               : <empty>
                    testWearApp                   : <empty>
                    wearApp                       : <empty>
        projectDir                    : <ROOT>
        buildDir                      : <ROOT>/build [-]
        buildFile                     : <ROOT>/build.gradle
        externalSystemId              : GRADLE
MODULE                        : project.app
    GradleModuleModel
        agpVersion                    : 7.1.0
        gradlePath                    : :app
        gradleVersion                 : 7.2
        buildFile                     : <ROOT>/app/build.gradle
        buildFilePath                 : <ROOT>/app/build.gradle
        rootFolderPath                : <ROOT>
        hasSafeArgsJava               : false
        hasSafeArgsKotlin             : false
    CurrentVariantReportedVersions
        minSdk
            ApiLevel                      : 19
            ApiString                     : 19
        runtimeMinSdk
            ApiLevel                      : 19
            ApiString                     : 19
        targetSdk
            ApiLevel                      : <SDK_VERSION>
            ApiString                     : <SDK_VERSION>
    RootBuildId                   : <ROOT>
    BuildId                       : <ROOT>
    BuildName                     : :
    ProjectPath                   : :app
    ModelVersion                  : 7.1.0
    ProjectType                   : PROJECT_TYPE_APP
    CompileTarget                 : android-32
    BuildFolder                   : <ROOT>/app/build
    buildToolsVersion             : 30.0.3
    IsBaseSplit                   : true
    GroupId                       : project
    Namespace                     : com.example.app
    TestNamespace                 : testData.namespaces.test
    AaptOptions
        NameSpacing                   : REQUIRED
    LintOptions
        IsCheckTestSources            : false
        IsCheckDependencies           : false
        IsAbortOnError                : true
        IsAbsolutePaths               : true
        IsNoLines                     : false
        IsQuiet                       : false
        IsCheckAllWarnings            : false
        IsIgnoreWarnings              : false
        IsWarningsAsErrors            : false
        IsIgnoreTestSources           : false
        IsIgnoreTestFixturesSources   : false
        IsCheckGeneratedSources       : false
        IsCheckReleaseBuilds          : true
        IsExplainIssues               : true
        IsShowAll                     : false
        TextReport                    : false
        HtmlReport                    : true
        XmlReport                     : true
        SarifReport                   : false
    JavaCompileOptions
        Encoding                      : UTF-8
        SourceCompatibility           : 1.8
        TargetCompatibility           : 1.8
        IsCoreLibraryDesugaringEnabled          : false
    AgpFlags
        ApplicationRClassConstantIds  : true
        AestRClassConstantIds         : true
        TransitiveRClasses            : true
        UsesCompose                   : false
        MlModelBindingEnabled         : false
    - basicVariant:               : debug
        applicationId                 : testData.namespaces
        testApplicationId             : testData.namespaces.test
    - basicVariant:               : release
        applicationId                 : testData.namespaces
    BootClassPath                 : <ANDROID_SDK>/platforms/android-32/android.jar
    ViewBindingOptions
        Enabled                       : false
    DependenciesInfo
        IncludeInApk                  : true
        IncludeInBundle               : true
    DefaultConfig
        ProductFlavor
            Name                          : main
            ApplicationId                 : testData.namespaces
            VersionCode                   : 1
            VersionName                   : 1.0
            MinSdkVersion
                ApiLevel                      : 19
                ApiString                     : 19
            TargetSdkVersion
                ApiLevel                      : <SDK_VERSION>
                ApiString                     : <SDK_VERSION>
            VectorDrawables
                UseSupportLibrary             : false
        SourceProvider
            Name                          : main
            Manifest                      : <ROOT>/app/src/main/AndroidManifest.xml
            JavaDirectories               : <ROOT>/app/src/main/java
            KotlinDirectories             : <ROOT>/app/src/main/java
            KotlinDirectories             : <ROOT>/app/src/main/kotlin [-]
            ResourcesDirectories          : <ROOT>/app/src/main/resources [-]
            AidlDirectories               : <ROOT>/app/src/main/aidl [-]
            RenderscriptDirectories       : <ROOT>/app/src/main/rs [-]
            ResDirectories                : <ROOT>/app/src/main/res
            AssetsDirectories             : <ROOT>/app/src/main/assets [-]
            JniLibsDirectories            : <ROOT>/app/src/main/jniLibs [-]
            ShadersDirectories            : <ROOT>/app/src/main/shaders [-]
        ExtraSourceProviders
            ExtraSourceProvider
                ArtifactName                  : _android_test_
                SourceProvider
                    Name                          : androidTest
                    Manifest                      : <ROOT>/app/src/androidTest/AndroidManifest.xml [-]
                    JavaDirectories               : <ROOT>/app/src/androidTest/java [-]
                    KotlinDirectories             : <ROOT>/app/src/androidTest/java [-]
                    KotlinDirectories             : <ROOT>/app/src/androidTest/kotlin [-]
                    ResourcesDirectories          : <ROOT>/app/src/androidTest/resources [-]
                    AidlDirectories               : <ROOT>/app/src/androidTest/aidl [-]
                    RenderscriptDirectories       : <ROOT>/app/src/androidTest/rs [-]
                    ResDirectories                : <ROOT>/app/src/androidTest/res [-]
                    AssetsDirectories             : <ROOT>/app/src/androidTest/assets [-]
                    JniLibsDirectories            : <ROOT>/app/src/androidTest/jniLibs [-]
                    ShadersDirectories            : <ROOT>/app/src/androidTest/shaders [-]
            ExtraSourceProvider
                ArtifactName                  : _unit_test_
                SourceProvider
                    Name                          : test
                    Manifest                      : <ROOT>/app/src/test/AndroidManifest.xml [-]
                    JavaDirectories               : <ROOT>/app/src/test/java [-]
                    KotlinDirectories             : <ROOT>/app/src/test/java [-]
                    KotlinDirectories             : <ROOT>/app/src/test/kotlin [-]
                    ResourcesDirectories          : <ROOT>/app/src/test/resources [-]
                    AidlDirectories               : <ROOT>/app/src/test/aidl [-]
                    RenderscriptDirectories       : <ROOT>/app/src/test/rs [-]
                    ResDirectories                : <ROOT>/app/src/test/res [-]
                    AssetsDirectories             : <ROOT>/app/src/test/assets [-]
                    JniLibsDirectories            : <ROOT>/app/src/test/jniLibs [-]
                    ShadersDirectories            : <ROOT>/app/src/test/shaders [-]
    BuildTypes
        BuildType
            Name                          : debug
            IsDebuggable                  : true
            IsJniDebuggable               : false
            IsRenderscriptDebuggable      : false
            RenderscriptOptimLevel        : 3
            IsMinifyEnabled               : false
            IsZipAlignEnabled             : true
        SourceProvider
            Name                          : debug
            Manifest                      : <ROOT>/app/src/debug/AndroidManifest.xml [-]
            JavaDirectories               : <ROOT>/app/src/debug/java [-]
            KotlinDirectories             : <ROOT>/app/src/debug/java [-]
            KotlinDirectories             : <ROOT>/app/src/debug/kotlin [-]
            ResourcesDirectories          : <ROOT>/app/src/debug/resources [-]
            AidlDirectories               : <ROOT>/app/src/debug/aidl [-]
            RenderscriptDirectories       : <ROOT>/app/src/debug/rs [-]
            ResDirectories                : <ROOT>/app/src/debug/res [-]
            AssetsDirectories             : <ROOT>/app/src/debug/assets [-]
            JniLibsDirectories            : <ROOT>/app/src/debug/jniLibs [-]
            ShadersDirectories            : <ROOT>/app/src/debug/shaders [-]
        ExtraSourceProviders
            ExtraSourceProvider
                ArtifactName                  : _android_test_
                SourceProvider
                    Name                          : androidTestDebug
                    Manifest                      : <ROOT>/app/src/androidTestDebug/AndroidManifest.xml [-]
                    JavaDirectories               : <ROOT>/app/src/androidTestDebug/java [-]
                    KotlinDirectories             : <ROOT>/app/src/androidTestDebug/java [-]
                    KotlinDirectories             : <ROOT>/app/src/androidTestDebug/kotlin [-]
                    ResourcesDirectories          : <ROOT>/app/src/androidTestDebug/resources [-]
                    AidlDirectories               : <ROOT>/app/src/androidTestDebug/aidl [-]
                    RenderscriptDirectories       : <ROOT>/app/src/androidTestDebug/rs [-]
                    ResDirectories                : <ROOT>/app/src/androidTestDebug/res [-]
                    AssetsDirectories             : <ROOT>/app/src/androidTestDebug/assets [-]
                    JniLibsDirectories            : <ROOT>/app/src/androidTestDebug/jniLibs [-]
                    ShadersDirectories            : <ROOT>/app/src/androidTestDebug/shaders [-]
        ExtraSourceProviders
            ExtraSourceProvider
                ArtifactName                  : _unit_test_
                SourceProvider
                    Name                          : testDebug
                    Manifest                      : <ROOT>/app/src/testDebug/AndroidManifest.xml [-]
                    JavaDirectories               : <ROOT>/app/src/testDebug/java [-]
                    KotlinDirectories             : <ROOT>/app/src/testDebug/java [-]
                    KotlinDirectories             : <ROOT>/app/src/testDebug/kotlin [-]
                    ResourcesDirectories          : <ROOT>/app/src/testDebug/resources [-]
                    AidlDirectories               : <ROOT>/app/src/testDebug/aidl [-]
                    RenderscriptDirectories       : <ROOT>/app/src/testDebug/rs [-]
                    ResDirectories                : <ROOT>/app/src/testDebug/res [-]
                    AssetsDirectories             : <ROOT>/app/src/testDebug/assets [-]
                    JniLibsDirectories            : <ROOT>/app/src/testDebug/jniLibs [-]
                    ShadersDirectories            : <ROOT>/app/src/testDebug/shaders [-]
        BuildType
            Name                          : release
            IsDebuggable                  : false
            IsJniDebuggable               : false
            IsRenderscriptDebuggable      : false
            RenderscriptOptimLevel        : 3
            IsMinifyEnabled               : false
            IsZipAlignEnabled             : true
        SourceProvider
            Name                          : release
            Manifest                      : <ROOT>/app/src/release/AndroidManifest.xml [-]
            JavaDirectories               : <ROOT>/app/src/release/java [-]
            KotlinDirectories             : <ROOT>/app/src/release/java [-]
            KotlinDirectories             : <ROOT>/app/src/release/kotlin [-]
            ResourcesDirectories          : <ROOT>/app/src/release/resources [-]
            AidlDirectories               : <ROOT>/app/src/release/aidl [-]
            RenderscriptDirectories       : <ROOT>/app/src/release/rs [-]
            ResDirectories                : <ROOT>/app/src/release/res [-]
            AssetsDirectories             : <ROOT>/app/src/release/assets [-]
            JniLibsDirectories            : <ROOT>/app/src/release/jniLibs [-]
            ShadersDirectories            : <ROOT>/app/src/release/shaders [-]
        ExtraSourceProviders
            ExtraSourceProvider
                ArtifactName                  : _android_test_
                SourceProvider
                    Name                          : androidTestRelease
                    Manifest                      : <ROOT>/app/src/androidTestRelease/AndroidManifest.xml [-]
                    JavaDirectories               : <ROOT>/app/src/androidTestRelease/java [-]
                    KotlinDirectories             : <ROOT>/app/src/androidTestRelease/java [-]
                    KotlinDirectories             : <ROOT>/app/src/androidTestRelease/kotlin [-]
                    ResourcesDirectories          : <ROOT>/app/src/androidTestRelease/resources [-]
                    AidlDirectories               : <ROOT>/app/src/androidTestRelease/aidl [-]
                    RenderscriptDirectories       : <ROOT>/app/src/androidTestRelease/rs [-]
                    ResDirectories                : <ROOT>/app/src/androidTestRelease/res [-]
                    AssetsDirectories             : <ROOT>/app/src/androidTestRelease/assets [-]
                    JniLibsDirectories            : <ROOT>/app/src/androidTestRelease/jniLibs [-]
                    ShadersDirectories            : <ROOT>/app/src/androidTestRelease/shaders [-]
        ExtraSourceProviders
            ExtraSourceProvider
                ArtifactName                  : _unit_test_
                SourceProvider
                    Name                          : testRelease
                    Manifest                      : <ROOT>/app/src/testRelease/AndroidManifest.xml [-]
                    JavaDirectories               : <ROOT>/app/src/testRelease/java [-]
                    KotlinDirectories             : <ROOT>/app/src/testRelease/java [-]
                    KotlinDirectories             : <ROOT>/app/src/testRelease/kotlin [-]
                    ResourcesDirectories          : <ROOT>/app/src/testRelease/resources [-]
                    AidlDirectories               : <ROOT>/app/src/testRelease/aidl [-]
                    RenderscriptDirectories       : <ROOT>/app/src/testRelease/rs [-]
                    ResDirectories                : <ROOT>/app/src/testRelease/res [-]
                    AssetsDirectories             : <ROOT>/app/src/testRelease/assets [-]
                    JniLibsDirectories            : <ROOT>/app/src/testRelease/jniLibs [-]
                    ShadersDirectories            : <ROOT>/app/src/testRelease/shaders [-]
    SigningConfigs
        SigningConfig
            Name                          : debug
            StoreFile                     : debug.keystore
            StorePassword                 : android
            KeyAlias                      : AndroidDebugKey
    VariantBuildInformation
        VariantBuildInformation
            VariantName                   : debug
            BuildTasksAndOutputInformation
                AssembleTaskName              : assembleDebug
                AssembleTaskOutputListingFile : <ROOT>/app/build/intermediates/apk_ide_redirect_file/debug/redirect.txt [-]
                BundleTaskName                : bundleDebug
                ApkFromBundleTaskName         : extractApksForDebug
        VariantBuildInformation
            VariantName                   : release
            BuildTasksAndOutputInformation
                AssembleTaskName              : assembleRelease
                AssembleTaskOutputListingFile : <ROOT>/app/build/intermediates/apk_ide_redirect_file/release/redirect.txt [-]
                BundleTaskName                : bundleRelease
                ApkFromBundleTaskName         : extractApksForRelease
    IdeVariants
        IdeVariant
            Name                          : debug
            BuildType                     : debug
            DisplayName                   : debug
            InstantAppCompatible          : false
            MinSdkVersion
                ApiLevel                      : 19
                ApiString                     : 19
            TargetSdkVersion
                ApiLevel                      : <SDK_VERSION>
                ApiString                     : <SDK_VERSION>
            VersionCode                   : 1
            VersionNameWithSuffix         : 1.0
            DeprecatedPreMergedApplicationId        : testData.namespaces
            MainArtifact
                Name                          : MAIN
                CompileTaskName               : compileDebugSources
                AssembleTaskName              : assembleDebug
                IsTestArtifact                : false
                IdeSetupTaskNames             : generateDebugSources
                GeneratedSourceFolders        : <ROOT>/app/build/generated/aidl_source_output_dir/debug/out [-]
                GeneratedSourceFolders        : <ROOT>/app/build/generated/ap_generated_sources/debug/out [-]
                GeneratedSourceFolders        : <ROOT>/app/build/generated/renderscript_source_output_dir/debug/out [-]
                GeneratedSourceFolders        : <ROOT>/app/build/generated/source/buildConfig/debug [-]
                ClassesFolder                 : <ROOT>/app/build/intermediates/javac/debug/classes [-]
                Dependencies
                    - compileClasspath            : <ROOT>::lib@debug (IdeModuleLibraryImpl)
                        buildId                       : <ROOT>
                        lintJar                       : <ROOT>/lib/build/intermediates/lint_publish_jar/global/lint.jar [-]
                        projectPath                   : :lib
                        sourceSet                     : MAIN
                        variant                       : debug
                    - compileClasspath            : <ROOT>::otherlib@debug (IdeModuleLibraryImpl)
                        buildId                       : <ROOT>
                        lintJar                       : <ROOT>/otherlib/build/intermediates/lint_publish_jar/global/lint.jar [-]
                        projectPath                   : :otherlib
                        sourceSet                     : MAIN
                        variant                       : debug
                    - runtimeClasspath            : <ROOT>::lib@debug (IdeModuleLibraryImpl) (*seen*)
                    - runtimeClasspath            : <ROOT>::otherlib@debug (IdeModuleLibraryImpl) (*seen*)
                ApplicationId                 : testData.namespaces
                SigningConfigName             : debug
                IsSigned                      : true
                CodeShrinker                  : null
                BuildTasksAndOutputInformation
                    AssembleTaskName              : assembleDebug
                    AssembleTaskOutputListingFile : <ROOT>/app/build/intermediates/apk_ide_redirect_file/debug/redirect.txt [-]
                    BundleTaskName                : bundleDebug
                    ApkFromBundleTaskName         : extractApksForDebug
                GeneratedResourceFolders      : <ROOT>/app/build/generated/res/rs/debug [-]
                GeneratedResourceFolders      : <ROOT>/app/build/generated/res/resValues/debug [-]
            AndroidTestArtifact
                Name                          : ANDROID_TEST
                CompileTaskName               : compileDebugAndroidTestSources
                AssembleTaskName              : assembleDebugAndroidTest
                IsTestArtifact                : true
                IdeSetupTaskNames             : generateDebugAndroidTestSources
                GeneratedSourceFolders        : <ROOT>/app/build/generated/aidl_source_output_dir/debugAndroidTest/out [-]
                GeneratedSourceFolders        : <ROOT>/app/build/generated/ap_generated_sources/debugAndroidTest/out [-]
                GeneratedSourceFolders        : <ROOT>/app/build/generated/renderscript_source_output_dir/debugAndroidTest/out [-]
                GeneratedSourceFolders        : <ROOT>/app/build/generated/source/buildConfig/androidTest/debug [-]
                ClassesFolder                 : <ROOT>/app/build/intermediates/compile_r_class_jar/debug/R.jar [-]
                ClassesFolder                 : <ROOT>/app/build/intermediates/javac/debugAndroidTest/classes [-]
                Dependencies
                    - compileClasspath            : <ROOT>::app@debug (IdeModuleLibraryImpl)
                        buildId                       : <ROOT>
                        projectPath                   : :app
                        sourceSet                     : MAIN
                        variant                       : debug
                    - compileClasspath            : <ROOT>::lib@debug (IdeModuleLibraryImpl) (*seen*)
                    - compileClasspath            : <ROOT>::otherlib@debug (IdeModuleLibraryImpl) (*seen*)
                    - runtimeClasspath            : <ROOT>::lib@debug (IdeModuleLibraryImpl) (*seen*)
                    - runtimeClasspath            : <ROOT>::otherlib@debug (IdeModuleLibraryImpl) (*seen*)
                    - runtimeClasspath            : <ROOT>::app@debug (IdeModuleLibraryImpl) (*seen*)
                ApplicationId                 : testData.namespaces.test
                SigningConfigName             : debug
                IsSigned                      : true
                CodeShrinker                  : null
                BuildTasksAndOutputInformation
                    AssembleTaskName              : assembleDebugAndroidTest
                    AssembleTaskOutputListingFile : <ROOT>/app/build/intermediates/apk_ide_redirect_file/debugAndroidTest/redirect.txt [-]
                GeneratedResourceFolders      : <ROOT>/app/build/generated/res/rs/androidTest/debug [-]
                GeneratedResourceFolders      : <ROOT>/app/build/generated/res/resValues/androidTest/debug [-]
                TestOptions
                    AnimationsDisabled            : false
                    Execution                     : HOST
            UnitTestArtifact
                Name                          : UNIT_TEST
                CompileTaskName               : compileDebugUnitTestSources
                AssembleTaskName              : assembleDebugUnitTest
                IsTestArtifact                : true
                IdeSetupTaskNames             : createMockableJar
                GeneratedSourceFolders        : <ROOT>/app/build/generated/ap_generated_sources/debugUnitTest/out [-]
                ClassesFolder                 : <ROOT>/app/build/intermediates/javac/debugUnitTest/classes [-]
                Dependencies
                    - compileClasspath            : <ROOT>::app@debug (IdeModuleLibraryImpl) (*seen*)
                    - compileClasspath            : <ROOT>::lib@debug (IdeModuleLibraryImpl) (*seen*)
                    - compileClasspath            : <ROOT>::otherlib@debug (IdeModuleLibraryImpl) (*seen*)
                    - runtimeClasspath            : <ROOT>::lib@debug (IdeModuleLibraryImpl) (*seen*)
                    - runtimeClasspath            : <ROOT>::otherlib@debug (IdeModuleLibraryImpl) (*seen*)
                    - runtimeClasspath            : <ROOT>::app@debug (IdeModuleLibraryImpl) (*seen*)
                MockablePlatformJar           : <GRADLE>/caches/transforms-3/xxxxxxxxxxxxxxxxxxxxxxxxxxxxxxxx/transformed/android.jar
    externalProject               : :app (DefaultExternalProject) (*seen*)
MODULE                        : project.app.androidTest
MODULE                        : project.app.main
MODULE                        : project.app.unitTest
MODULE                        : project.lib
    GradleModuleModel
        agpVersion                    : 7.1.0
        gradlePath                    : :lib
        gradleVersion                 : 7.2
        buildFile                     : <ROOT>/lib/build.gradle
        buildFilePath                 : <ROOT>/lib/build.gradle
        rootFolderPath                : <ROOT>
        hasSafeArgsJava               : false
        hasSafeArgsKotlin             : false
    CurrentVariantReportedVersions
        minSdk
            ApiLevel                      : 19
            ApiString                     : 19
        runtimeMinSdk
            ApiLevel                      : 19
            ApiString                     : 19
        targetSdk
            ApiLevel                      : <SDK_VERSION>
            ApiString                     : <SDK_VERSION>
    RootBuildId                   : <ROOT>
    BuildId                       : <ROOT>
    BuildName                     : :
    ProjectPath                   : :lib
    ModelVersion                  : 7.1.0
    ProjectType                   : PROJECT_TYPE_LIBRARY
    CompileTarget                 : android-32
    BuildFolder                   : <ROOT>/lib/build
    buildToolsVersion             : 30.0.3
    IsBaseSplit                   : false
    GroupId                       : project
    Namespace                     : com.example.lib
    TestNamespace                 : com.example.lib.test
    AaptOptions
        NameSpacing                   : REQUIRED
    LintOptions
        IsCheckTestSources            : false
        IsCheckDependencies           : false
        IsAbortOnError                : true
        IsAbsolutePaths               : true
        IsNoLines                     : false
        IsQuiet                       : false
        IsCheckAllWarnings            : false
        IsIgnoreWarnings              : false
        IsWarningsAsErrors            : false
        IsIgnoreTestSources           : false
        IsIgnoreTestFixturesSources   : false
        IsCheckGeneratedSources       : false
        IsCheckReleaseBuilds          : true
        IsExplainIssues               : true
        IsShowAll                     : false
        TextReport                    : false
        HtmlReport                    : true
        XmlReport                     : true
        SarifReport                   : false
    JavaCompileOptions
        Encoding                      : UTF-8
        SourceCompatibility           : 1.8
        TargetCompatibility           : 1.8
        IsCoreLibraryDesugaringEnabled          : false
    AgpFlags
        ApplicationRClassConstantIds  : true
        AestRClassConstantIds         : true
        TransitiveRClasses            : true
        UsesCompose                   : false
        MlModelBindingEnabled         : false
    - basicVariant:               : debug
        testApplicationId             : com.example.lib.test
    - basicVariant:               : release
    BootClassPath                 : <ANDROID_SDK>/platforms/android-32/android.jar
    ViewBindingOptions
        Enabled                       : false
    DefaultConfig
        ProductFlavor
            Name                          : main
            VersionCode                   : 1
            VersionName                   : 1.0
            MinSdkVersion
                ApiLevel                      : 19
                ApiString                     : 19
            TargetSdkVersion
                ApiLevel                      : <SDK_VERSION>
                ApiString                     : <SDK_VERSION>
            VectorDrawables
                UseSupportLibrary             : false
        SourceProvider
            Name                          : main
            Manifest                      : <ROOT>/lib/src/main/AndroidManifest.xml
            JavaDirectories               : <ROOT>/lib/src/main/java [-]
            KotlinDirectories             : <ROOT>/lib/src/main/java [-]
            KotlinDirectories             : <ROOT>/lib/src/main/kotlin [-]
            ResourcesDirectories          : <ROOT>/lib/src/main/resources [-]
            AidlDirectories               : <ROOT>/lib/src/main/aidl [-]
            RenderscriptDirectories       : <ROOT>/lib/src/main/rs [-]
            ResDirectories                : <ROOT>/lib/src/main/res
            AssetsDirectories             : <ROOT>/lib/src/main/assets [-]
            JniLibsDirectories            : <ROOT>/lib/src/main/jniLibs [-]
            ShadersDirectories            : <ROOT>/lib/src/main/shaders [-]
        ExtraSourceProviders
            ExtraSourceProvider
                ArtifactName                  : _android_test_
                SourceProvider
                    Name                          : androidTest
                    Manifest                      : <ROOT>/lib/src/androidTest/AndroidManifest.xml [-]
                    JavaDirectories               : <ROOT>/lib/src/androidTest/java [-]
                    KotlinDirectories             : <ROOT>/lib/src/androidTest/java [-]
                    KotlinDirectories             : <ROOT>/lib/src/androidTest/kotlin [-]
                    ResourcesDirectories          : <ROOT>/lib/src/androidTest/resources [-]
                    AidlDirectories               : <ROOT>/lib/src/androidTest/aidl [-]
                    RenderscriptDirectories       : <ROOT>/lib/src/androidTest/rs [-]
                    ResDirectories                : <ROOT>/lib/src/androidTest/res [-]
                    AssetsDirectories             : <ROOT>/lib/src/androidTest/assets [-]
                    JniLibsDirectories            : <ROOT>/lib/src/androidTest/jniLibs [-]
                    ShadersDirectories            : <ROOT>/lib/src/androidTest/shaders [-]
            ExtraSourceProvider
                ArtifactName                  : _unit_test_
                SourceProvider
                    Name                          : test
                    Manifest                      : <ROOT>/lib/src/test/AndroidManifest.xml [-]
                    JavaDirectories               : <ROOT>/lib/src/test/java [-]
                    KotlinDirectories             : <ROOT>/lib/src/test/java [-]
                    KotlinDirectories             : <ROOT>/lib/src/test/kotlin [-]
                    ResourcesDirectories          : <ROOT>/lib/src/test/resources [-]
                    AidlDirectories               : <ROOT>/lib/src/test/aidl [-]
                    RenderscriptDirectories       : <ROOT>/lib/src/test/rs [-]
                    ResDirectories                : <ROOT>/lib/src/test/res [-]
                    AssetsDirectories             : <ROOT>/lib/src/test/assets [-]
                    JniLibsDirectories            : <ROOT>/lib/src/test/jniLibs [-]
                    ShadersDirectories            : <ROOT>/lib/src/test/shaders [-]
    BuildTypes
        BuildType
            Name                          : debug
            IsDebuggable                  : true
            IsJniDebuggable               : false
            IsRenderscriptDebuggable      : false
            RenderscriptOptimLevel        : 3
            IsMinifyEnabled               : false
            IsZipAlignEnabled             : true
        SourceProvider
            Name                          : debug
            Manifest                      : <ROOT>/lib/src/debug/AndroidManifest.xml [-]
            JavaDirectories               : <ROOT>/lib/src/debug/java [-]
            KotlinDirectories             : <ROOT>/lib/src/debug/java [-]
            KotlinDirectories             : <ROOT>/lib/src/debug/kotlin [-]
            ResourcesDirectories          : <ROOT>/lib/src/debug/resources [-]
            AidlDirectories               : <ROOT>/lib/src/debug/aidl [-]
            RenderscriptDirectories       : <ROOT>/lib/src/debug/rs [-]
            ResDirectories                : <ROOT>/lib/src/debug/res [-]
            AssetsDirectories             : <ROOT>/lib/src/debug/assets [-]
            JniLibsDirectories            : <ROOT>/lib/src/debug/jniLibs [-]
            ShadersDirectories            : <ROOT>/lib/src/debug/shaders [-]
        ExtraSourceProviders
            ExtraSourceProvider
                ArtifactName                  : _android_test_
                SourceProvider
                    Name                          : androidTestDebug
                    Manifest                      : <ROOT>/lib/src/androidTestDebug/AndroidManifest.xml [-]
                    JavaDirectories               : <ROOT>/lib/src/androidTestDebug/java [-]
                    KotlinDirectories             : <ROOT>/lib/src/androidTestDebug/java [-]
                    KotlinDirectories             : <ROOT>/lib/src/androidTestDebug/kotlin [-]
                    ResourcesDirectories          : <ROOT>/lib/src/androidTestDebug/resources [-]
                    AidlDirectories               : <ROOT>/lib/src/androidTestDebug/aidl [-]
                    RenderscriptDirectories       : <ROOT>/lib/src/androidTestDebug/rs [-]
                    ResDirectories                : <ROOT>/lib/src/androidTestDebug/res [-]
                    AssetsDirectories             : <ROOT>/lib/src/androidTestDebug/assets [-]
                    JniLibsDirectories            : <ROOT>/lib/src/androidTestDebug/jniLibs [-]
                    ShadersDirectories            : <ROOT>/lib/src/androidTestDebug/shaders [-]
        ExtraSourceProviders
            ExtraSourceProvider
                ArtifactName                  : _unit_test_
                SourceProvider
                    Name                          : testDebug
                    Manifest                      : <ROOT>/lib/src/testDebug/AndroidManifest.xml [-]
                    JavaDirectories               : <ROOT>/lib/src/testDebug/java [-]
                    KotlinDirectories             : <ROOT>/lib/src/testDebug/java [-]
                    KotlinDirectories             : <ROOT>/lib/src/testDebug/kotlin [-]
                    ResourcesDirectories          : <ROOT>/lib/src/testDebug/resources [-]
                    AidlDirectories               : <ROOT>/lib/src/testDebug/aidl [-]
                    RenderscriptDirectories       : <ROOT>/lib/src/testDebug/rs [-]
                    ResDirectories                : <ROOT>/lib/src/testDebug/res [-]
                    AssetsDirectories             : <ROOT>/lib/src/testDebug/assets [-]
                    JniLibsDirectories            : <ROOT>/lib/src/testDebug/jniLibs [-]
                    ShadersDirectories            : <ROOT>/lib/src/testDebug/shaders [-]
        BuildType
            Name                          : release
            IsDebuggable                  : false
            IsJniDebuggable               : false
            IsRenderscriptDebuggable      : false
            RenderscriptOptimLevel        : 3
            IsMinifyEnabled               : false
            IsZipAlignEnabled             : true
        SourceProvider
            Name                          : release
            Manifest                      : <ROOT>/lib/src/release/AndroidManifest.xml [-]
            JavaDirectories               : <ROOT>/lib/src/release/java [-]
            KotlinDirectories             : <ROOT>/lib/src/release/java [-]
            KotlinDirectories             : <ROOT>/lib/src/release/kotlin [-]
            ResourcesDirectories          : <ROOT>/lib/src/release/resources [-]
            AidlDirectories               : <ROOT>/lib/src/release/aidl [-]
            RenderscriptDirectories       : <ROOT>/lib/src/release/rs [-]
            ResDirectories                : <ROOT>/lib/src/release/res [-]
            AssetsDirectories             : <ROOT>/lib/src/release/assets [-]
            JniLibsDirectories            : <ROOT>/lib/src/release/jniLibs [-]
            ShadersDirectories            : <ROOT>/lib/src/release/shaders [-]
        ExtraSourceProviders
            ExtraSourceProvider
                ArtifactName                  : _android_test_
                SourceProvider
                    Name                          : androidTestRelease
                    Manifest                      : <ROOT>/lib/src/androidTestRelease/AndroidManifest.xml [-]
                    JavaDirectories               : <ROOT>/lib/src/androidTestRelease/java [-]
                    KotlinDirectories             : <ROOT>/lib/src/androidTestRelease/java [-]
                    KotlinDirectories             : <ROOT>/lib/src/androidTestRelease/kotlin [-]
                    ResourcesDirectories          : <ROOT>/lib/src/androidTestRelease/resources [-]
                    AidlDirectories               : <ROOT>/lib/src/androidTestRelease/aidl [-]
                    RenderscriptDirectories       : <ROOT>/lib/src/androidTestRelease/rs [-]
                    ResDirectories                : <ROOT>/lib/src/androidTestRelease/res [-]
                    AssetsDirectories             : <ROOT>/lib/src/androidTestRelease/assets [-]
                    JniLibsDirectories            : <ROOT>/lib/src/androidTestRelease/jniLibs [-]
                    ShadersDirectories            : <ROOT>/lib/src/androidTestRelease/shaders [-]
        ExtraSourceProviders
            ExtraSourceProvider
                ArtifactName                  : _unit_test_
                SourceProvider
                    Name                          : testRelease
                    Manifest                      : <ROOT>/lib/src/testRelease/AndroidManifest.xml [-]
                    JavaDirectories               : <ROOT>/lib/src/testRelease/java [-]
                    KotlinDirectories             : <ROOT>/lib/src/testRelease/java [-]
                    KotlinDirectories             : <ROOT>/lib/src/testRelease/kotlin [-]
                    ResourcesDirectories          : <ROOT>/lib/src/testRelease/resources [-]
                    AidlDirectories               : <ROOT>/lib/src/testRelease/aidl [-]
                    RenderscriptDirectories       : <ROOT>/lib/src/testRelease/rs [-]
                    ResDirectories                : <ROOT>/lib/src/testRelease/res [-]
                    AssetsDirectories             : <ROOT>/lib/src/testRelease/assets [-]
                    JniLibsDirectories            : <ROOT>/lib/src/testRelease/jniLibs [-]
                    ShadersDirectories            : <ROOT>/lib/src/testRelease/shaders [-]
    SigningConfigs
        SigningConfig
            Name                          : debug
            StoreFile                     : debug.keystore
            StorePassword                 : android
            KeyAlias                      : AndroidDebugKey
    VariantBuildInformation
        VariantBuildInformation
            VariantName                   : debug
            BuildTasksAndOutputInformation
                AssembleTaskName              : assembleDebug
        VariantBuildInformation
            VariantName                   : release
            BuildTasksAndOutputInformation
                AssembleTaskName              : assembleRelease
    IdeVariants
        IdeVariant
            Name                          : debug
            BuildType                     : debug
            DisplayName                   : debug
            InstantAppCompatible          : false
            MinSdkVersion
                ApiLevel                      : 19
                ApiString                     : 19
            TargetSdkVersion
                ApiLevel                      : <SDK_VERSION>
                ApiString                     : <SDK_VERSION>
            VersionCode                   : 1
            VersionNameWithSuffix         : 1.0
            DeprecatedPreMergedApplicationId        : com.example.lib
            MainArtifact
                Name                          : MAIN
                CompileTaskName               : compileDebugSources
                AssembleTaskName              : assembleDebug
                IsTestArtifact                : false
                IdeSetupTaskNames             : generateDebugSources
                GeneratedSourceFolders        : <ROOT>/lib/build/generated/aidl_source_output_dir/debug/out [-]
                GeneratedSourceFolders        : <ROOT>/lib/build/generated/ap_generated_sources/debug/out [-]
                GeneratedSourceFolders        : <ROOT>/lib/build/generated/renderscript_source_output_dir/debug/out [-]
                GeneratedSourceFolders        : <ROOT>/lib/build/generated/source/buildConfig/debug [-]
                ClassesFolder                 : <ROOT>/lib/build/intermediates/javac/debug/classes [-]
                Dependencies
                    - compileClasspath            : <ROOT>::otherlib@debug (IdeModuleLibraryImpl) (*seen*)
                    - runtimeClasspath            : <ROOT>::otherlib@debug (IdeModuleLibraryImpl) (*seen*)
                IsSigned                      : false
                CodeShrinker                  : null
                BuildTasksAndOutputInformation
                    AssembleTaskName              : assembleDebug
                GeneratedResourceFolders      : <ROOT>/lib/build/generated/res/rs/debug [-]
                GeneratedResourceFolders      : <ROOT>/lib/build/generated/res/resValues/debug [-]
            AndroidTestArtifact
                Name                          : ANDROID_TEST
                CompileTaskName               : compileDebugAndroidTestSources
                AssembleTaskName              : assembleDebugAndroidTest
                IsTestArtifact                : true
                IdeSetupTaskNames             : generateDebugAndroidTestSources
                GeneratedSourceFolders        : <ROOT>/lib/build/generated/aidl_source_output_dir/debugAndroidTest/out [-]
                GeneratedSourceFolders        : <ROOT>/lib/build/generated/ap_generated_sources/debugAndroidTest/out [-]
                GeneratedSourceFolders        : <ROOT>/lib/build/generated/renderscript_source_output_dir/debugAndroidTest/out [-]
                GeneratedSourceFolders        : <ROOT>/lib/build/generated/source/buildConfig/androidTest/debug [-]
                ClassesFolder                 : <ROOT>/lib/build/intermediates/compile_r_class_jar/debug/R.jar [-]
                ClassesFolder                 : <ROOT>/lib/build/intermediates/javac/debugAndroidTest/classes [-]
                Dependencies
                    - compileClasspath            : <ROOT>::lib@debug (IdeModuleLibraryImpl) (*seen*)
                    - compileClasspath            : <ROOT>::otherlib@debug (IdeModuleLibraryImpl) (*seen*)
                    - runtimeClasspath            : <ROOT>::lib@debug (IdeModuleLibraryImpl) (*seen*)
                    - runtimeClasspath            : <ROOT>::otherlib@debug (IdeModuleLibraryImpl) (*seen*)
                ApplicationId                 : com.example.lib.test
                SigningConfigName             : debug
                IsSigned                      : true
                CodeShrinker                  : null
                BuildTasksAndOutputInformation
                    AssembleTaskName              : assembleDebugAndroidTest
                    AssembleTaskOutputListingFile : <ROOT>/lib/build/intermediates/apk_ide_redirect_file/debugAndroidTest/redirect.txt [-]
                GeneratedResourceFolders      : <ROOT>/lib/build/generated/res/rs/androidTest/debug [-]
                GeneratedResourceFolders      : <ROOT>/lib/build/generated/res/resValues/androidTest/debug [-]
                TestOptions
                    AnimationsDisabled            : false
                    Execution                     : HOST
            UnitTestArtifact
                Name                          : UNIT_TEST
                CompileTaskName               : compileDebugUnitTestSources
                AssembleTaskName              : assembleDebugUnitTest
                IsTestArtifact                : true
                IdeSetupTaskNames             : createMockableJar
                GeneratedSourceFolders        : <ROOT>/lib/build/generated/ap_generated_sources/debugUnitTest/out [-]
                ClassesFolder                 : <ROOT>/lib/build/intermediates/javac/debugUnitTest/classes [-]
                Dependencies
                    - compileClasspath            : <ROOT>::lib@debug (IdeModuleLibraryImpl) (*seen*)
                    - compileClasspath            : <ROOT>::otherlib@debug (IdeModuleLibraryImpl) (*seen*)
                    - runtimeClasspath            : <ROOT>::lib@debug (IdeModuleLibraryImpl) (*seen*)
                    - runtimeClasspath            : <ROOT>::otherlib@debug (IdeModuleLibraryImpl) (*seen*)
                MockablePlatformJar           : <GRADLE>/caches/transforms-3/xxxxxxxxxxxxxxxxxxxxxxxxxxxxxxxx/transformed/android.jar
    externalProject               : :lib (DefaultExternalProject) (*seen*)
MODULE                        : project.lib.androidTest
MODULE                        : project.lib.main
MODULE                        : project.lib.unitTest
MODULE                        : project.otherlib
    GradleModuleModel
        agpVersion                    : 7.1.0
        gradlePath                    : :otherlib
        gradleVersion                 : 7.2
        buildFile                     : <ROOT>/otherlib/build.gradle
        buildFilePath                 : <ROOT>/otherlib/build.gradle
        rootFolderPath                : <ROOT>
        hasSafeArgsJava               : false
        hasSafeArgsKotlin             : false
    CurrentVariantReportedVersions
        minSdk
            ApiLevel                      : 19
            ApiString                     : 19
        runtimeMinSdk
            ApiLevel                      : 19
            ApiString                     : 19
        targetSdk
            ApiLevel                      : <SDK_VERSION>
            ApiString                     : <SDK_VERSION>
    RootBuildId                   : <ROOT>
    BuildId                       : <ROOT>
    BuildName                     : :
    ProjectPath                   : :otherlib
    ModelVersion                  : 7.1.0
    ProjectType                   : PROJECT_TYPE_LIBRARY
    CompileTarget                 : android-32
    BuildFolder                   : <ROOT>/otherlib/build
    buildToolsVersion             : 30.0.3
    IsBaseSplit                   : false
    GroupId                       : project
    Namespace                     : com.example.otherlib
    TestNamespace                 : com.example.otherlib.test
    AaptOptions
        NameSpacing                   : REQUIRED
    LintOptions
        IsCheckTestSources            : false
        IsCheckDependencies           : false
        IsAbortOnError                : true
        IsAbsolutePaths               : true
        IsNoLines                     : false
        IsQuiet                       : false
        IsCheckAllWarnings            : false
        IsIgnoreWarnings              : false
        IsWarningsAsErrors            : false
        IsIgnoreTestSources           : false
        IsIgnoreTestFixturesSources   : false
        IsCheckGeneratedSources       : false
        IsCheckReleaseBuilds          : true
        IsExplainIssues               : true
        IsShowAll                     : false
        TextReport                    : false
        HtmlReport                    : true
        XmlReport                     : true
        SarifReport                   : false
    JavaCompileOptions
        Encoding                      : UTF-8
        SourceCompatibility           : 1.8
        TargetCompatibility           : 1.8
        IsCoreLibraryDesugaringEnabled          : false
    AgpFlags
        ApplicationRClassConstantIds  : true
        AestRClassConstantIds         : true
        TransitiveRClasses            : true
        UsesCompose                   : false
        MlModelBindingEnabled         : false
    - basicVariant:               : debug
        testApplicationId             : com.example.otherlib.test
    - basicVariant:               : release
    BootClassPath                 : <ANDROID_SDK>/platforms/android-32/android.jar
    ViewBindingOptions
        Enabled                       : false
    DefaultConfig
        ProductFlavor
            Name                          : main
            VersionCode                   : 1
            VersionName                   : 1.0
            MinSdkVersion
                ApiLevel                      : 19
                ApiString                     : 19
            TargetSdkVersion
                ApiLevel                      : <SDK_VERSION>
                ApiString                     : <SDK_VERSION>
            VectorDrawables
                UseSupportLibrary             : false
        SourceProvider
            Name                          : main
            Manifest                      : <ROOT>/otherlib/src/main/AndroidManifest.xml
            JavaDirectories               : <ROOT>/otherlib/src/main/java [-]
            KotlinDirectories             : <ROOT>/otherlib/src/main/java [-]
            KotlinDirectories             : <ROOT>/otherlib/src/main/kotlin [-]
            ResourcesDirectories          : <ROOT>/otherlib/src/main/resources [-]
            AidlDirectories               : <ROOT>/otherlib/src/main/aidl [-]
            RenderscriptDirectories       : <ROOT>/otherlib/src/main/rs [-]
            ResDirectories                : <ROOT>/otherlib/src/main/res
            AssetsDirectories             : <ROOT>/otherlib/src/main/assets [-]
            JniLibsDirectories            : <ROOT>/otherlib/src/main/jniLibs [-]
            ShadersDirectories            : <ROOT>/otherlib/src/main/shaders [-]
        ExtraSourceProviders
            ExtraSourceProvider
                ArtifactName                  : _android_test_
                SourceProvider
                    Name                          : androidTest
                    Manifest                      : <ROOT>/otherlib/src/androidTest/AndroidManifest.xml [-]
                    JavaDirectories               : <ROOT>/otherlib/src/androidTest/java [-]
                    KotlinDirectories             : <ROOT>/otherlib/src/androidTest/java [-]
                    KotlinDirectories             : <ROOT>/otherlib/src/androidTest/kotlin [-]
                    ResourcesDirectories          : <ROOT>/otherlib/src/androidTest/resources [-]
                    AidlDirectories               : <ROOT>/otherlib/src/androidTest/aidl [-]
                    RenderscriptDirectories       : <ROOT>/otherlib/src/androidTest/rs [-]
                    ResDirectories                : <ROOT>/otherlib/src/androidTest/res [-]
                    AssetsDirectories             : <ROOT>/otherlib/src/androidTest/assets [-]
                    JniLibsDirectories            : <ROOT>/otherlib/src/androidTest/jniLibs [-]
                    ShadersDirectories            : <ROOT>/otherlib/src/androidTest/shaders [-]
            ExtraSourceProvider
                ArtifactName                  : _unit_test_
                SourceProvider
                    Name                          : test
                    Manifest                      : <ROOT>/otherlib/src/test/AndroidManifest.xml [-]
                    JavaDirectories               : <ROOT>/otherlib/src/test/java [-]
                    KotlinDirectories             : <ROOT>/otherlib/src/test/java [-]
                    KotlinDirectories             : <ROOT>/otherlib/src/test/kotlin [-]
                    ResourcesDirectories          : <ROOT>/otherlib/src/test/resources [-]
                    AidlDirectories               : <ROOT>/otherlib/src/test/aidl [-]
                    RenderscriptDirectories       : <ROOT>/otherlib/src/test/rs [-]
                    ResDirectories                : <ROOT>/otherlib/src/test/res [-]
                    AssetsDirectories             : <ROOT>/otherlib/src/test/assets [-]
                    JniLibsDirectories            : <ROOT>/otherlib/src/test/jniLibs [-]
                    ShadersDirectories            : <ROOT>/otherlib/src/test/shaders [-]
    BuildTypes
        BuildType
            Name                          : debug
            IsDebuggable                  : true
            IsJniDebuggable               : false
            IsRenderscriptDebuggable      : false
            RenderscriptOptimLevel        : 3
            IsMinifyEnabled               : false
            IsZipAlignEnabled             : true
        SourceProvider
            Name                          : debug
            Manifest                      : <ROOT>/otherlib/src/debug/AndroidManifest.xml [-]
            JavaDirectories               : <ROOT>/otherlib/src/debug/java [-]
            KotlinDirectories             : <ROOT>/otherlib/src/debug/java [-]
            KotlinDirectories             : <ROOT>/otherlib/src/debug/kotlin [-]
            ResourcesDirectories          : <ROOT>/otherlib/src/debug/resources [-]
            AidlDirectories               : <ROOT>/otherlib/src/debug/aidl [-]
            RenderscriptDirectories       : <ROOT>/otherlib/src/debug/rs [-]
            ResDirectories                : <ROOT>/otherlib/src/debug/res [-]
            AssetsDirectories             : <ROOT>/otherlib/src/debug/assets [-]
            JniLibsDirectories            : <ROOT>/otherlib/src/debug/jniLibs [-]
            ShadersDirectories            : <ROOT>/otherlib/src/debug/shaders [-]
        ExtraSourceProviders
            ExtraSourceProvider
                ArtifactName                  : _android_test_
                SourceProvider
                    Name                          : androidTestDebug
                    Manifest                      : <ROOT>/otherlib/src/androidTestDebug/AndroidManifest.xml [-]
                    JavaDirectories               : <ROOT>/otherlib/src/androidTestDebug/java [-]
                    KotlinDirectories             : <ROOT>/otherlib/src/androidTestDebug/java [-]
                    KotlinDirectories             : <ROOT>/otherlib/src/androidTestDebug/kotlin [-]
                    ResourcesDirectories          : <ROOT>/otherlib/src/androidTestDebug/resources [-]
                    AidlDirectories               : <ROOT>/otherlib/src/androidTestDebug/aidl [-]
                    RenderscriptDirectories       : <ROOT>/otherlib/src/androidTestDebug/rs [-]
                    ResDirectories                : <ROOT>/otherlib/src/androidTestDebug/res [-]
                    AssetsDirectories             : <ROOT>/otherlib/src/androidTestDebug/assets [-]
                    JniLibsDirectories            : <ROOT>/otherlib/src/androidTestDebug/jniLibs [-]
                    ShadersDirectories            : <ROOT>/otherlib/src/androidTestDebug/shaders [-]
        ExtraSourceProviders
            ExtraSourceProvider
                ArtifactName                  : _unit_test_
                SourceProvider
                    Name                          : testDebug
                    Manifest                      : <ROOT>/otherlib/src/testDebug/AndroidManifest.xml [-]
                    JavaDirectories               : <ROOT>/otherlib/src/testDebug/java [-]
                    KotlinDirectories             : <ROOT>/otherlib/src/testDebug/java [-]
                    KotlinDirectories             : <ROOT>/otherlib/src/testDebug/kotlin [-]
                    ResourcesDirectories          : <ROOT>/otherlib/src/testDebug/resources [-]
                    AidlDirectories               : <ROOT>/otherlib/src/testDebug/aidl [-]
                    RenderscriptDirectories       : <ROOT>/otherlib/src/testDebug/rs [-]
                    ResDirectories                : <ROOT>/otherlib/src/testDebug/res [-]
                    AssetsDirectories             : <ROOT>/otherlib/src/testDebug/assets [-]
                    JniLibsDirectories            : <ROOT>/otherlib/src/testDebug/jniLibs [-]
                    ShadersDirectories            : <ROOT>/otherlib/src/testDebug/shaders [-]
        BuildType
            Name                          : release
            IsDebuggable                  : false
            IsJniDebuggable               : false
            IsRenderscriptDebuggable      : false
            RenderscriptOptimLevel        : 3
            IsMinifyEnabled               : false
            IsZipAlignEnabled             : true
        SourceProvider
            Name                          : release
            Manifest                      : <ROOT>/otherlib/src/release/AndroidManifest.xml [-]
            JavaDirectories               : <ROOT>/otherlib/src/release/java [-]
            KotlinDirectories             : <ROOT>/otherlib/src/release/java [-]
            KotlinDirectories             : <ROOT>/otherlib/src/release/kotlin [-]
            ResourcesDirectories          : <ROOT>/otherlib/src/release/resources [-]
            AidlDirectories               : <ROOT>/otherlib/src/release/aidl [-]
            RenderscriptDirectories       : <ROOT>/otherlib/src/release/rs [-]
            ResDirectories                : <ROOT>/otherlib/src/release/res [-]
            AssetsDirectories             : <ROOT>/otherlib/src/release/assets [-]
            JniLibsDirectories            : <ROOT>/otherlib/src/release/jniLibs [-]
            ShadersDirectories            : <ROOT>/otherlib/src/release/shaders [-]
        ExtraSourceProviders
            ExtraSourceProvider
                ArtifactName                  : _android_test_
                SourceProvider
                    Name                          : androidTestRelease
                    Manifest                      : <ROOT>/otherlib/src/androidTestRelease/AndroidManifest.xml [-]
                    JavaDirectories               : <ROOT>/otherlib/src/androidTestRelease/java [-]
                    KotlinDirectories             : <ROOT>/otherlib/src/androidTestRelease/java [-]
                    KotlinDirectories             : <ROOT>/otherlib/src/androidTestRelease/kotlin [-]
                    ResourcesDirectories          : <ROOT>/otherlib/src/androidTestRelease/resources [-]
                    AidlDirectories               : <ROOT>/otherlib/src/androidTestRelease/aidl [-]
                    RenderscriptDirectories       : <ROOT>/otherlib/src/androidTestRelease/rs [-]
                    ResDirectories                : <ROOT>/otherlib/src/androidTestRelease/res [-]
                    AssetsDirectories             : <ROOT>/otherlib/src/androidTestRelease/assets [-]
                    JniLibsDirectories            : <ROOT>/otherlib/src/androidTestRelease/jniLibs [-]
                    ShadersDirectories            : <ROOT>/otherlib/src/androidTestRelease/shaders [-]
        ExtraSourceProviders
            ExtraSourceProvider
                ArtifactName                  : _unit_test_
                SourceProvider
                    Name                          : testRelease
                    Manifest                      : <ROOT>/otherlib/src/testRelease/AndroidManifest.xml [-]
                    JavaDirectories               : <ROOT>/otherlib/src/testRelease/java [-]
                    KotlinDirectories             : <ROOT>/otherlib/src/testRelease/java [-]
                    KotlinDirectories             : <ROOT>/otherlib/src/testRelease/kotlin [-]
                    ResourcesDirectories          : <ROOT>/otherlib/src/testRelease/resources [-]
                    AidlDirectories               : <ROOT>/otherlib/src/testRelease/aidl [-]
                    RenderscriptDirectories       : <ROOT>/otherlib/src/testRelease/rs [-]
                    ResDirectories                : <ROOT>/otherlib/src/testRelease/res [-]
                    AssetsDirectories             : <ROOT>/otherlib/src/testRelease/assets [-]
                    JniLibsDirectories            : <ROOT>/otherlib/src/testRelease/jniLibs [-]
                    ShadersDirectories            : <ROOT>/otherlib/src/testRelease/shaders [-]
    SigningConfigs
        SigningConfig
            Name                          : debug
            StoreFile                     : debug.keystore
            StorePassword                 : android
            KeyAlias                      : AndroidDebugKey
    VariantBuildInformation
        VariantBuildInformation
            VariantName                   : debug
            BuildTasksAndOutputInformation
                AssembleTaskName              : assembleDebug
        VariantBuildInformation
            VariantName                   : release
            BuildTasksAndOutputInformation
                AssembleTaskName              : assembleRelease
    IdeVariants
        IdeVariant
            Name                          : debug
            BuildType                     : debug
            DisplayName                   : debug
            InstantAppCompatible          : false
            MinSdkVersion
                ApiLevel                      : 19
                ApiString                     : 19
            TargetSdkVersion
                ApiLevel                      : <SDK_VERSION>
                ApiString                     : <SDK_VERSION>
            VersionCode                   : 1
            VersionNameWithSuffix         : 1.0
            DeprecatedPreMergedApplicationId        : com.example.otherlib
            MainArtifact
                Name                          : MAIN
                CompileTaskName               : compileDebugSources
                AssembleTaskName              : assembleDebug
                IsTestArtifact                : false
                IdeSetupTaskNames             : generateDebugSources
                GeneratedSourceFolders        : <ROOT>/otherlib/build/generated/aidl_source_output_dir/debug/out [-]
                GeneratedSourceFolders        : <ROOT>/otherlib/build/generated/ap_generated_sources/debug/out [-]
                GeneratedSourceFolders        : <ROOT>/otherlib/build/generated/renderscript_source_output_dir/debug/out [-]
                GeneratedSourceFolders        : <ROOT>/otherlib/build/generated/source/buildConfig/debug [-]
                ClassesFolder                 : <ROOT>/otherlib/build/intermediates/javac/debug/classes [-]
                Dependencies
                IsSigned                      : false
                CodeShrinker                  : null
                BuildTasksAndOutputInformation
                    AssembleTaskName              : assembleDebug
                GeneratedResourceFolders      : <ROOT>/otherlib/build/generated/res/rs/debug [-]
                GeneratedResourceFolders      : <ROOT>/otherlib/build/generated/res/resValues/debug [-]
            AndroidTestArtifact
                Name                          : ANDROID_TEST
                CompileTaskName               : compileDebugAndroidTestSources
                AssembleTaskName              : assembleDebugAndroidTest
                IsTestArtifact                : true
                IdeSetupTaskNames             : generateDebugAndroidTestSources
                GeneratedSourceFolders        : <ROOT>/otherlib/build/generated/aidl_source_output_dir/debugAndroidTest/out [-]
                GeneratedSourceFolders        : <ROOT>/otherlib/build/generated/ap_generated_sources/debugAndroidTest/out [-]
                GeneratedSourceFolders        : <ROOT>/otherlib/build/generated/renderscript_source_output_dir/debugAndroidTest/out [-]
                GeneratedSourceFolders        : <ROOT>/otherlib/build/generated/source/buildConfig/androidTest/debug [-]
                ClassesFolder                 : <ROOT>/otherlib/build/intermediates/compile_r_class_jar/debug/R.jar [-]
                ClassesFolder                 : <ROOT>/otherlib/build/intermediates/javac/debugAndroidTest/classes [-]
                Dependencies
                    - compileClasspath            : <ROOT>::otherlib@debug (IdeModuleLibraryImpl) (*seen*)
                    - runtimeClasspath            : <ROOT>::otherlib@debug (IdeModuleLibraryImpl) (*seen*)
                ApplicationId                 : com.example.otherlib.test
                SigningConfigName             : debug
                IsSigned                      : true
                CodeShrinker                  : null
                BuildTasksAndOutputInformation
                    AssembleTaskName              : assembleDebugAndroidTest
                    AssembleTaskOutputListingFile : <ROOT>/otherlib/build/intermediates/apk_ide_redirect_file/debugAndroidTest/redirect.txt [-]
                GeneratedResourceFolders      : <ROOT>/otherlib/build/generated/res/rs/androidTest/debug [-]
                GeneratedResourceFolders      : <ROOT>/otherlib/build/generated/res/resValues/androidTest/debug [-]
                TestOptions
                    AnimationsDisabled            : false
                    Execution                     : HOST
            UnitTestArtifact
                Name                          : UNIT_TEST
                CompileTaskName               : compileDebugUnitTestSources
                AssembleTaskName              : assembleDebugUnitTest
                IsTestArtifact                : true
                IdeSetupTaskNames             : createMockableJar
                GeneratedSourceFolders        : <ROOT>/otherlib/build/generated/ap_generated_sources/debugUnitTest/out [-]
                ClassesFolder                 : <ROOT>/otherlib/build/intermediates/javac/debugUnitTest/classes [-]
                Dependencies
                    - compileClasspath            : <ROOT>::otherlib@debug (IdeModuleLibraryImpl) (*seen*)
                    - runtimeClasspath            : <ROOT>::otherlib@debug (IdeModuleLibraryImpl) (*seen*)
                MockablePlatformJar           : <GRADLE>/caches/transforms-3/xxxxxxxxxxxxxxxxxxxxxxxxxxxxxxxx/transformed/android.jar
    externalProject               : :otherlib (DefaultExternalProject) (*seen*)
MODULE                        : project.otherlib.androidTest
MODULE                        : project.otherlib.main
MODULE                        : project.otherlib.unitTest