PROJECT                       : project
    PROJECT_JDK                   : <JDK_NAME>
        Version                       : <JDK_VERSION>
    MODULE                        : project
        ExternalModuleGroup           :
        ExternalModuleVersion         : unspecified
        LinkedProjectId               : project
        LinkedProjectPath             : <PROJECT>
        RootProjectPath               : <PROJECT>
        COMPILER_MODULE_EXTENSION
            compilerSourceOutputPath      : file://<PROJECT>/build/classes/production/project [-]
            compilerTestOutputPath        : file://<PROJECT>/build/classes/test/project [-]
            isCompilerPathInherited       : true
            isExcludeOutput               : true
        ModuleFile                    : <PROJECT>/.idea/modules/project.iml [-]
        ModuleTypeName                : JAVA_MODULE
        CONENT_ENTRY                  : file://<PROJECT>
            EXCLUDE_FOLDER                : file://<PROJECT>/.gradle
            EXCLUDE_FOLDER                : file://<PROJECT>/build [-]
        JDK                           : <NAME_CUT> JavaSDK
        *isInherited                  : true
        ORDER_ENTRY                   : <Module source>
        BUILD_TASKS
            TEST_COMPILE_MODE             : All
            TEST_COMPILE_MODE             : Android tests
            TEST_COMPILE_MODE             : Unit tests
            TEST_COMPILE_MODE             : None
    MODULE                        : project.app
        LINKED_ANDROID_MODULE_GROUP
            holder                        : project.app
            main                          : project.app.main
            unitTest                      : project.app.unitTest
            androidTest                   : project.app.androidTest
        ExternalModuleGroup           : project
        ExternalModuleVersion         : unspecified
        LinkedProjectId               : :app
        LinkedProjectPath             : <PROJECT>/app
        RootProjectPath               : <PROJECT>
        COMPILER_MODULE_EXTENSION
            isCompilerPathInherited       : false
            isExcludeOutput               : true
        ModuleFile                    : <PROJECT>/.idea/modules/app/project.app.iml [-]
        ModuleTypeName                : JAVA_MODULE
        FACET                         : Android
            TypeId                        : android
            ExternalSource                : GRADLE
            SelectedBuildVariant          : debug
            AllowUserConfiguration        : false
            GenFolderRelativePathApt      : /gen
            GenFolderRelativePathAidl     : /gen
            ManifestFileRelativePath      : /src/main/AndroidManifest.xml
            ResFolderRelativePath         : /src/main/res
            - ResFoldersRelativePath      :  [-]
            - TestResFoldersRelativePath  :  [-]
            AssetsFolderRelativePath      : /src/main/assets
            LibsFolderRelativePath        : /libs
            ProjectType                   : 0
            PackTestCode                  : false
            RunProguard                   : false
            ProguardLogsFolderRelativePath          : /proguard_logs
            UseCustomManifestPackage      : false
            - ProGuardCfgFiles            : file://%MODULE_SDK_HOME%/tools/proguard/proguard-android.txt
        FACET                         : Android-Gradle
            TypeId                        : android-gradle
            ExternalSource                : GRADLE
        CONENT_ENTRY                  : file://<PROJECT>/app
            EXCLUDE_FOLDER                : file://<PROJECT>/app/.gradle [-]
            EXCLUDE_FOLDER                : file://<PROJECT>/app/build [-]
        JDK                           : <NAME_CUT> Android SDK
        *isInherited                  : false
            SdkType                       : Android SDK
            HomePath                      : <ANDROID_SDK>
            VersionString                 : <JDK_VERSION>
        ORDER_ENTRY                   : <Module source>
        BUILD_TASKS
            TEST_COMPILE_MODE             : All
                CLEAN                         : :app:createMockableJar, :app:generateDebugAndroidTestSources, :app:generateDebugSources
                ASSEMBLE                      : :app:assembleDebug, :app:assembleDebugAndroidTest, :app:assembleDebugUnitTest
                REBUILD                       : :app:assembleDebug, :app:assembleDebugAndroidTest, :app:assembleDebugUnitTest, :app:clean
                COMPILE_JAVA                  : :app:compileDebugAndroidTestSources, :app:compileDebugSources, :app:compileDebugUnitTestSources
                SOURCE_GEN                    : :app:createMockableJar, :app:generateDebugAndroidTestSources, :app:generateDebugSources
                BUNDLE                        : :app:bundleDebug
                APK_FROM_BUNDLE               : :app:extractApksForDebug
            TEST_COMPILE_MODE             : Android tests
                CLEAN                         : :app:generateDebugAndroidTestSources, :app:generateDebugSources
                ASSEMBLE                      : :app:assembleDebug, :app:assembleDebugAndroidTest
                REBUILD                       : :app:assembleDebug, :app:assembleDebugAndroidTest, :app:clean
                COMPILE_JAVA                  : :app:compileDebugAndroidTestSources, :app:compileDebugSources
                SOURCE_GEN                    : :app:generateDebugAndroidTestSources, :app:generateDebugSources
                BUNDLE                        : :app:bundleDebug
                APK_FROM_BUNDLE               : :app:extractApksForDebug
            TEST_COMPILE_MODE             : Unit tests
                CLEAN                         : :app:createMockableJar, :app:generateDebugSources
                ASSEMBLE                      : :app:assembleDebug, :app:assembleDebugUnitTest
                REBUILD                       : :app:assembleDebug, :app:assembleDebugUnitTest, :app:clean
                COMPILE_JAVA                  : :app:compileDebugUnitTestSources
                SOURCE_GEN                    : :app:createMockableJar, :app:generateDebugSources
                BUNDLE                        : :app:bundleDebug
                APK_FROM_BUNDLE               : :app:extractApksForDebug
            TEST_COMPILE_MODE             : None
                CLEAN                         : :app:generateDebugSources
                ASSEMBLE                      : :app:assembleDebug
                REBUILD                       : :app:assembleDebug, :app:clean
                COMPILE_JAVA                  : :app:compileDebugSources
                SOURCE_GEN                    : :app:generateDebugSources
                BUNDLE                        : :app:bundleDebug
                APK_FROM_BUNDLE               : :app:extractApksForDebug
    MODULE                        : project.app.androidTest
        LINKED_ANDROID_MODULE_GROUP
            holder                        : project.app
            main                          : project.app.main
            unitTest                      : project.app.unitTest
            androidTest                   : project.app.androidTest
        ExternalModuleType            : sourceSet
        LinkedProjectId               : :app:androidTest
        LinkedProjectPath             : <PROJECT>/app
        RootProjectPath               : <PROJECT>
        COMPILER_MODULE_EXTENSION
            compilerTestOutputPath        : file://<PROJECT>/app/build/intermediates/javac/debugAndroidTest/classes [-]
            isCompilerPathInherited       : false
            isExcludeOutput               : true
        TEST_MODULE_PROPERTIES
            productionModuleName          : project.app.main
        ModuleFile                    : <PROJECT>/.idea/modules/app/project.app.androidTest.iml [-]
        ModuleTypeName                : JAVA_MODULE
        FACET                         : Android
            TypeId                        : android
            ExternalSource                : GRADLE
            SelectedBuildVariant          : debug
            AllowUserConfiguration        : false
            GenFolderRelativePathApt      : /gen
            GenFolderRelativePathAidl     : /gen
            ManifestFileRelativePath      : /src/main/AndroidManifest.xml
            ResFolderRelativePath         : /src/main/res
            - ResFoldersRelativePath      :  [-]
            - TestResFoldersRelativePath  : file://<PROJECT>/app/src/androidTest/res [-]
            - TestResFoldersRelativePath  : file://<PROJECT>/app/src/androidTestDebug/res [-]
            - TestResFoldersRelativePath  : file://<PROJECT>/app/build/generated/res/resValues/androidTest/debug [-]
            AssetsFolderRelativePath      : /src/main/assets
            LibsFolderRelativePath        : /libs
            ProjectType                   : 0
            PackTestCode                  : false
            RunProguard                   : false
            ProguardLogsFolderRelativePath          : /proguard_logs
            UseCustomManifestPackage      : false
            - ProGuardCfgFiles            : file://%MODULE_SDK_HOME%/tools/proguard/proguard-android.txt
        CONENT_ENTRY                  : file://<PROJECT>/app/build/generated/ap_generated_sources/debugAndroidTest/out [-]
        CONENT_ENTRY                  : file://<PROJECT>/app/build/generated/res/resValues/androidTest/debug [-]
        CONENT_ENTRY                  : file://<PROJECT>/app/src/androidTest
            JavaSource (test)             : file://<PROJECT>/app/src/androidTest/java
        CONENT_ENTRY                  : file://<PROJECT>/app/src/androidTestDebug [-]
        WATCHED_TEST_SOURCE_FOLDER    : file://<PROJECT>/app/build/generated/ap_generated_sources/debugAndroidTest/out [-]
            Generated                     : true
        WATCHED_TEST_RESOURCE_FOLDER  : file://<PROJECT>/app/build/generated/res/resValues/androidTest/debug [-]
            Generated                     : true
        WATCHED_TEST_RESOURCE_FOLDER  : file://<PROJECT>/app/src/androidTest/assets [-]
        WATCHED_TEST_RESOURCE_FOLDER  : file://<PROJECT>/app/src/androidTest/baselineProfiles [-]
        WATCHED_TEST_SOURCE_FOLDER    : file://<PROJECT>/app/src/androidTest/kotlin [-]
        WATCHED_TEST_RESOURCE_FOLDER  : file://<PROJECT>/app/src/androidTest/ml [-]
        WATCHED_TEST_RESOURCE_FOLDER  : file://<PROJECT>/app/src/androidTest/res [-]
        WATCHED_TEST_RESOURCE_FOLDER  : file://<PROJECT>/app/src/androidTest/resources [-]
        WATCHED_TEST_SOURCE_FOLDER    : file://<PROJECT>/app/src/androidTest/shaders [-]
        WATCHED_TEST_RESOURCE_FOLDER  : file://<PROJECT>/app/src/androidTestDebug/assets [-]
        WATCHED_TEST_RESOURCE_FOLDER  : file://<PROJECT>/app/src/androidTestDebug/baselineProfiles [-]
        WATCHED_TEST_SOURCE_FOLDER    : file://<PROJECT>/app/src/androidTestDebug/java [-]
        WATCHED_TEST_SOURCE_FOLDER    : file://<PROJECT>/app/src/androidTestDebug/kotlin [-]
        WATCHED_TEST_RESOURCE_FOLDER  : file://<PROJECT>/app/src/androidTestDebug/ml [-]
        WATCHED_TEST_RESOURCE_FOLDER  : file://<PROJECT>/app/src/androidTestDebug/res [-]
        WATCHED_TEST_RESOURCE_FOLDER  : file://<PROJECT>/app/src/androidTestDebug/resources [-]
        WATCHED_TEST_SOURCE_FOLDER    : file://<PROJECT>/app/src/androidTestDebug/shaders [-]
        JDK                           : <NAME_CUT> Android SDK
        *isInherited                  : false
            SdkType                       : Android SDK
            HomePath                      : <ANDROID_SDK>
            VersionString                 : <JDK_VERSION>
        ORDER_ENTRY                   : <Module source>
        LIBRARY                       : Gradle: <ANDROID_SDK>/platforms/android-<SDK_VERSION>/optional/org.apache.http.legacy.jar [=]
            Scope                         : Test
        LIBRARY                       : Gradle: android.arch.core:common:<VERSION> [=]
            Scope                         : Test
        LIBRARY                       : Gradle: android.arch.core:runtime:<VERSION>@aar [=]
            Scope                         : Test
        LIBRARY                       : Gradle: android.arch.lifecycle:common:<VERSION> [=]
            Scope                         : Test
        LIBRARY                       : Gradle: android.arch.lifecycle:livedata-core:<VERSION>@aar [=]
            Scope                         : Test
        LIBRARY                       : Gradle: android.arch.lifecycle:livedata:<VERSION>@aar [=]
            Scope                         : Test
        LIBRARY                       : Gradle: android.arch.lifecycle:runtime:<VERSION>@aar [=]
            Scope                         : Test
        LIBRARY                       : Gradle: android.arch.lifecycle:viewmodel:<VERSION>@aar [=]
            Scope                         : Test
        LIBRARY                       : Gradle: com.android.support.constraint:constraint-layout-solver:<VERSION> [=]
            Scope                         : Test
        LIBRARY                       : Gradle: com.android.support.constraint:constraint-layout:<VERSION>@aar [=]
            Scope                         : Test
        LIBRARY                       : Gradle: com.android.support.test.espresso:espresso-core:<VERSION>@aar [=]
            Scope                         : Test
        LIBRARY                       : Gradle: com.android.support.test.espresso:espresso-idling-resource:<VERSION>@aar [=]
            Scope                         : Test
        LIBRARY                       : Gradle: com.android.support.test:monitor:<VERSION>@aar [=]
            Scope                         : Test
        LIBRARY                       : Gradle: com.android.support.test:runner:<VERSION>@aar [=]
            Scope                         : Test
        LIBRARY                       : Gradle: com.android.support:animated-vector-drawable:<VERSION>@aar [=]
            Scope                         : Test
        LIBRARY                       : Gradle: com.android.support:appcompat-v7:<VERSION>@aar [=]
            Scope                         : Test
        LIBRARY                       : Gradle: com.android.support:asynclayoutinflater:<VERSION>@aar [=]
            Scope                         : Test
        LIBRARY                       : Gradle: com.android.support:collections:<VERSION> [=]
            Scope                         : Test
        LIBRARY                       : Gradle: com.android.support:coordinatorlayout:<VERSION>@aar [=]
            Scope                         : Test
        LIBRARY                       : Gradle: com.android.support:cursoradapter:<VERSION>@aar [=]
            Scope                         : Test
        LIBRARY                       : Gradle: com.android.support:customview:<VERSION>@aar [=]
            Scope                         : Test
        LIBRARY                       : Gradle: com.android.support:documentfile:<VERSION>@aar [=]
            Scope                         : Test
        LIBRARY                       : Gradle: com.android.support:drawerlayout:<VERSION>@aar [=]
            Scope                         : Test
        LIBRARY                       : Gradle: com.android.support:interpolator:<VERSION>@aar [=]
            Scope                         : Test
        LIBRARY                       : Gradle: com.android.support:loader:<VERSION>@aar [=]
            Scope                         : Test
        LIBRARY                       : Gradle: com.android.support:localbroadcastmanager:<VERSION>@aar [=]
            Scope                         : Test
        LIBRARY                       : Gradle: com.android.support:print:<VERSION>@aar [=]
            Scope                         : Test
        LIBRARY                       : Gradle: com.android.support:slidingpanelayout:<VERSION>@aar [=]
            Scope                         : Test
        LIBRARY                       : Gradle: com.android.support:support-annotations:<VERSION> [=]
            Scope                         : Test
        LIBRARY                       : Gradle: com.android.support:support-compat:<VERSION>@aar [=]
            Scope                         : Test
        LIBRARY                       : Gradle: com.android.support:support-core-ui:<VERSION>@aar [=]
            Scope                         : Test
        LIBRARY                       : Gradle: com.android.support:support-core-utils:<VERSION>@aar [=]
            Scope                         : Test
        LIBRARY                       : Gradle: com.android.support:support-fragment:<VERSION>@aar [=]
            Scope                         : Test
        LIBRARY                       : Gradle: com.android.support:support-vector-drawable:<VERSION>@aar [=]
            Scope                         : Test
        LIBRARY                       : Gradle: com.android.support:swiperefreshlayout:<VERSION>@aar [=]
            Scope                         : Test
        LIBRARY                       : Gradle: com.android.support:versionedparcelable:<VERSION>@aar [=]
            Scope                         : Test
        LIBRARY                       : Gradle: com.android.support:viewpager:<VERSION>@aar [=]
            Scope                         : Test
        LIBRARY                       : Gradle: com.google.code.findbugs:jsr305:2.0.1 [=]
            Scope                         : Test
        LIBRARY                       : Gradle: com.google.guava:guava:19.0 [=]
            Scope                         : Test
        LIBRARY                       : Gradle: com.squareup:javawriter:2.1.1 [=]
            Scope                         : Test
        LIBRARY                       : Gradle: javax.inject:javax.inject:1 [=]
            Scope                         : Test
        LIBRARY                       : Gradle: junit:junit:4.12 [=]
            Scope                         : Test
        LIBRARY                       : Gradle: net.sf.kxml:kxml2:2.3.0 [=]
            Scope                         : Test
        LIBRARY                       : Gradle: org.hamcrest:hamcrest-core:1.3 [=]
            Scope                         : Test
        LIBRARY                       : Gradle: org.hamcrest:hamcrest-integration:1.3 [=]
            Scope                         : Test
        LIBRARY                       : Gradle: org.hamcrest:hamcrest-library:1.3 [=]
            Scope                         : Test
        ORDER_ENTRY                   : project.app.main
            Scope                         : Test
        Classes
            -                             : file://<PROJECT>/app/build/intermediates/javac/debugAndroidTest/classes
            -                             : file://<PROJECT>/app/build/intermediates/javac/debugUnitTest/classes
            -                             : jar://<PROJECT>/app/build/intermediates/compile_and_runtime_not_namespaced_r_class_jar/debug/R.jar!/
            -                             : jar://<PROJECT>/app/build/intermediates/compile_and_runtime_not_namespaced_r_class_jar/debugAndroidTest/R.jar!/
            -                             : file://<PROJECT>/app/build/generated/res/resValues/androidTest/debug
        BUILD_TASKS
            TEST_COMPILE_MODE             : All
                CLEAN                         : :app:createMockableJar, :app:generateDebugAndroidTestSources, :app:generateDebugSources
                ASSEMBLE                      : :app:assembleDebug, :app:assembleDebugAndroidTest, :app:assembleDebugUnitTest
                REBUILD                       : :app:assembleDebug, :app:assembleDebugAndroidTest, :app:assembleDebugUnitTest, :app:clean
                COMPILE_JAVA                  : :app:compileDebugAndroidTestSources, :app:compileDebugSources, :app:compileDebugUnitTestSources
                SOURCE_GEN                    : :app:createMockableJar, :app:generateDebugAndroidTestSources, :app:generateDebugSources
                BUNDLE                        : :app:bundleDebug
                APK_FROM_BUNDLE               : :app:extractApksForDebug
            TEST_COMPILE_MODE             : Android tests
                CLEAN                         : :app:generateDebugAndroidTestSources, :app:generateDebugSources
                ASSEMBLE                      : :app:assembleDebug, :app:assembleDebugAndroidTest
                REBUILD                       : :app:assembleDebug, :app:assembleDebugAndroidTest, :app:clean
                COMPILE_JAVA                  : :app:compileDebugAndroidTestSources, :app:compileDebugSources
                SOURCE_GEN                    : :app:generateDebugAndroidTestSources, :app:generateDebugSources
                BUNDLE                        : :app:bundleDebug
                APK_FROM_BUNDLE               : :app:extractApksForDebug
            TEST_COMPILE_MODE             : Unit tests
                CLEAN                         : :app:createMockableJar, :app:generateDebugSources
                ASSEMBLE                      : :app:assembleDebug, :app:assembleDebugUnitTest
                REBUILD                       : :app:assembleDebug, :app:assembleDebugUnitTest, :app:clean
                COMPILE_JAVA                  : :app:compileDebugUnitTestSources
                SOURCE_GEN                    : :app:createMockableJar, :app:generateDebugSources
                BUNDLE                        : :app:bundleDebug
                APK_FROM_BUNDLE               : :app:extractApksForDebug
            TEST_COMPILE_MODE             : None
                CLEAN                         : :app:generateDebugSources
                ASSEMBLE                      : :app:assembleDebug
                REBUILD                       : :app:assembleDebug, :app:clean
                COMPILE_JAVA                  : :app:compileDebugSources
                SOURCE_GEN                    : :app:generateDebugSources
                BUNDLE                        : :app:bundleDebug
                APK_FROM_BUNDLE               : :app:extractApksForDebug
    MODULE                        : project.app.main
        LINKED_ANDROID_MODULE_GROUP
            holder                        : project.app
            main                          : project.app.main
            unitTest                      : project.app.unitTest
            androidTest                   : project.app.androidTest
        ExternalModuleType            : sourceSet
        LinkedProjectId               : :app:main
        LinkedProjectPath             : <PROJECT>/app
        RootProjectPath               : <PROJECT>
        COMPILER_MODULE_EXTENSION
            compilerSourceOutputPath      : file://<PROJECT>/app/build/intermediates/javac/debug/classes [-]
            isCompilerPathInherited       : false
            isExcludeOutput               : true
        ModuleFile                    : <PROJECT>/.idea/modules/app/project.app.main.iml [-]
        ModuleTypeName                : JAVA_MODULE
        FACET                         : Android
            TypeId                        : android
            ExternalSource                : GRADLE
            SelectedBuildVariant          : debug
            AllowUserConfiguration        : false
            GenFolderRelativePathApt      : /gen
            GenFolderRelativePathAidl     : /gen
            ManifestFileRelativePath      : /src/main/AndroidManifest.xml
            ResFolderRelativePath         : /src/main/res
            - ResFoldersRelativePath      : file://<PROJECT>/app/src/main/res
            - ResFoldersRelativePath      : file://<PROJECT>/app/src/debug/res [-]
            - ResFoldersRelativePath      : file://<PROJECT>/app/build/generated/res/resValues/debug [-]
            - TestResFoldersRelativePath  :  [-]
            AssetsFolderRelativePath      : /src/main/assets
            LibsFolderRelativePath        : /libs
            ProjectType                   : 0
            PackTestCode                  : false
            RunProguard                   : false
            ProguardLogsFolderRelativePath          : /proguard_logs
            UseCustomManifestPackage      : false
            - ProGuardCfgFiles            : file://%MODULE_SDK_HOME%/tools/proguard/proguard-android.txt
        CONENT_ENTRY                  : file://<PROJECT>/app/build/generated/ap_generated_sources/debug/out [-]
        CONENT_ENTRY                  : file://<PROJECT>/app/build/generated/res/resValues/debug [-]
        CONENT_ENTRY                  : file://<PROJECT>/app/src/debug [-]
        CONENT_ENTRY                  : file://<PROJECT>/app/src/main
            JavaSource                    : file://<PROJECT>/app/src/main/java
            JavaResource                  : file://<PROJECT>/app/src/main/ml
            JavaResource                  : file://<PROJECT>/app/src/main/res
        WATCHED_SOURCE_FOLDER         : file://<PROJECT>/app/build/generated/ap_generated_sources/debug/out [-]
            Generated                     : true
        WATCHED_RESOURCE_FOLDER       : file://<PROJECT>/app/build/generated/res/resValues/debug [-]
            Generated                     : true
        WATCHED_RESOURCE_FOLDER       : file://<PROJECT>/app/src/debug/assets [-]
        WATCHED_RESOURCE_FOLDER       : file://<PROJECT>/app/src/debug/baselineProfiles [-]
        WATCHED_SOURCE_FOLDER         : file://<PROJECT>/app/src/debug/java [-]
        WATCHED_SOURCE_FOLDER         : file://<PROJECT>/app/src/debug/kotlin [-]
        WATCHED_RESOURCE_FOLDER       : file://<PROJECT>/app/src/debug/ml [-]
        WATCHED_RESOURCE_FOLDER       : file://<PROJECT>/app/src/debug/res [-]
        WATCHED_RESOURCE_FOLDER       : file://<PROJECT>/app/src/debug/resources [-]
        WATCHED_SOURCE_FOLDER         : file://<PROJECT>/app/src/debug/shaders [-]
        WATCHED_RESOURCE_FOLDER       : file://<PROJECT>/app/src/main/assets [-]
        WATCHED_RESOURCE_FOLDER       : file://<PROJECT>/app/src/main/baselineProfiles [-]
        WATCHED_SOURCE_FOLDER         : file://<PROJECT>/app/src/main/kotlin [-]
        WATCHED_RESOURCE_FOLDER       : file://<PROJECT>/app/src/main/resources [-]
        WATCHED_SOURCE_FOLDER         : file://<PROJECT>/app/src/main/shaders [-]
        JDK                           : <NAME_CUT> Android SDK
        *isInherited                  : false
            SdkType                       : Android SDK
            HomePath                      : <ANDROID_SDK>
            VersionString                 : <JDK_VERSION>
        ORDER_ENTRY                   : <Module source>
        LIBRARY                       : Gradle: <ANDROID_SDK>/platforms/android-<SDK_VERSION>/optional/org.apache.http.legacy.jar [=]
        LIBRARY                       : Gradle: android.arch.core:common:<VERSION> [=]
        LIBRARY                       : Gradle: android.arch.core:runtime:<VERSION>@aar [=]
        LIBRARY                       : Gradle: android.arch.lifecycle:common:<VERSION> [=]
        LIBRARY                       : Gradle: android.arch.lifecycle:livedata-core:<VERSION>@aar [=]
        LIBRARY                       : Gradle: android.arch.lifecycle:livedata:<VERSION>@aar [=]
        LIBRARY                       : Gradle: android.arch.lifecycle:runtime:<VERSION>@aar [=]
        LIBRARY                       : Gradle: android.arch.lifecycle:viewmodel:<VERSION>@aar [=]
        LIBRARY                       : Gradle: com.android.support.constraint:constraint-layout-solver:<VERSION> [=]
        LIBRARY                       : Gradle: com.android.support.constraint:constraint-layout:<VERSION>@aar [=]
        LIBRARY                       : Gradle: com.android.support:animated-vector-drawable:<VERSION>@aar [=]
        LIBRARY                       : Gradle: com.android.support:appcompat-v7:<VERSION>@aar [=]
        LIBRARY                       : Gradle: com.android.support:asynclayoutinflater:<VERSION>@aar [=]
        LIBRARY                       : Gradle: com.android.support:collections:<VERSION> [=]
        LIBRARY                       : Gradle: com.android.support:coordinatorlayout:<VERSION>@aar [=]
        LIBRARY                       : Gradle: com.android.support:cursoradapter:<VERSION>@aar [=]
        LIBRARY                       : Gradle: com.android.support:customview:<VERSION>@aar [=]
        LIBRARY                       : Gradle: com.android.support:documentfile:<VERSION>@aar [=]
        LIBRARY                       : Gradle: com.android.support:drawerlayout:<VERSION>@aar [=]
        LIBRARY                       : Gradle: com.android.support:interpolator:<VERSION>@aar [=]
        LIBRARY                       : Gradle: com.android.support:loader:<VERSION>@aar [=]
        LIBRARY                       : Gradle: com.android.support:localbroadcastmanager:<VERSION>@aar [=]
        LIBRARY                       : Gradle: com.android.support:print:<VERSION>@aar [=]
        LIBRARY                       : Gradle: com.android.support:slidingpanelayout:<VERSION>@aar [=]
        LIBRARY                       : Gradle: com.android.support:support-annotations:<VERSION> [=]
        LIBRARY                       : Gradle: com.android.support:support-compat:<VERSION>@aar [=]
        LIBRARY                       : Gradle: com.android.support:support-core-ui:<VERSION>@aar [=]
        LIBRARY                       : Gradle: com.android.support:support-core-utils:<VERSION>@aar [=]
        LIBRARY                       : Gradle: com.android.support:support-fragment:<VERSION>@aar [=]
        LIBRARY                       : Gradle: com.android.support:support-vector-drawable:<VERSION>@aar [=]
        LIBRARY                       : Gradle: com.android.support:swiperefreshlayout:<VERSION>@aar [=]
        LIBRARY                       : Gradle: com.android.support:versionedparcelable:<VERSION>@aar [=]
        LIBRARY                       : Gradle: com.android.support:viewpager:<VERSION>@aar [=]
        LIBRARY                       : Gradle: com.google.guava:guava:19.0 [=]
        Classes
            -                             : file://<PROJECT>/app/build/intermediates/javac/debug/classes
            -                             : jar://<PROJECT>/app/build/intermediates/compile_and_runtime_not_namespaced_r_class_jar/debug/R.jar!/
            -                             : file://<PROJECT>/app/build/generated/res/resValues/debug
        BUILD_TASKS
            TEST_COMPILE_MODE             : All
                CLEAN                         : :app:createMockableJar, :app:generateDebugAndroidTestSources, :app:generateDebugSources
                ASSEMBLE                      : :app:assembleDebug, :app:assembleDebugAndroidTest, :app:assembleDebugUnitTest
                REBUILD                       : :app:assembleDebug, :app:assembleDebugAndroidTest, :app:assembleDebugUnitTest, :app:clean
                COMPILE_JAVA                  : :app:compileDebugAndroidTestSources, :app:compileDebugSources, :app:compileDebugUnitTestSources
                SOURCE_GEN                    : :app:createMockableJar, :app:generateDebugAndroidTestSources, :app:generateDebugSources
                BUNDLE                        : :app:bundleDebug
                APK_FROM_BUNDLE               : :app:extractApksForDebug
            TEST_COMPILE_MODE             : Android tests
                CLEAN                         : :app:generateDebugAndroidTestSources, :app:generateDebugSources
                ASSEMBLE                      : :app:assembleDebug, :app:assembleDebugAndroidTest
                REBUILD                       : :app:assembleDebug, :app:assembleDebugAndroidTest, :app:clean
                COMPILE_JAVA                  : :app:compileDebugAndroidTestSources, :app:compileDebugSources
                SOURCE_GEN                    : :app:generateDebugAndroidTestSources, :app:generateDebugSources
                BUNDLE                        : :app:bundleDebug
                APK_FROM_BUNDLE               : :app:extractApksForDebug
            TEST_COMPILE_MODE             : Unit tests
                CLEAN                         : :app:createMockableJar, :app:generateDebugSources
                ASSEMBLE                      : :app:assembleDebug, :app:assembleDebugUnitTest
                REBUILD                       : :app:assembleDebug, :app:assembleDebugUnitTest, :app:clean
                COMPILE_JAVA                  : :app:compileDebugUnitTestSources
                SOURCE_GEN                    : :app:createMockableJar, :app:generateDebugSources
                BUNDLE                        : :app:bundleDebug
                APK_FROM_BUNDLE               : :app:extractApksForDebug
            TEST_COMPILE_MODE             : None
                CLEAN                         : :app:generateDebugSources
                ASSEMBLE                      : :app:assembleDebug
                REBUILD                       : :app:assembleDebug, :app:clean
                COMPILE_JAVA                  : :app:compileDebugSources
                SOURCE_GEN                    : :app:generateDebugSources
                BUNDLE                        : :app:bundleDebug
                APK_FROM_BUNDLE               : :app:extractApksForDebug
    MODULE                        : project.app.unitTest
        LINKED_ANDROID_MODULE_GROUP
            holder                        : project.app
            main                          : project.app.main
            unitTest                      : project.app.unitTest
            androidTest                   : project.app.androidTest
        ExternalModuleType            : sourceSet
        LinkedProjectId               : :app:unitTest
        LinkedProjectPath             : <PROJECT>/app
        RootProjectPath               : <PROJECT>
        COMPILER_MODULE_EXTENSION
            compilerTestOutputPath        : file://<PROJECT>/app/build/intermediates/javac/debugUnitTest/classes [-]
            isCompilerPathInherited       : false
            isExcludeOutput               : true
        TEST_MODULE_PROPERTIES
            productionModuleName          : project.app.main
        ModuleFile                    : <PROJECT>/.idea/modules/app/project.app.unitTest.iml [-]
        ModuleTypeName                : JAVA_MODULE
        FACET                         : Android
            TypeId                        : android
            ExternalSource                : GRADLE
            SelectedBuildVariant          : debug
            AllowUserConfiguration        : false
            GenFolderRelativePathApt      : /gen
            GenFolderRelativePathAidl     : /gen
            ManifestFileRelativePath      : /src/main/AndroidManifest.xml
            ResFolderRelativePath         : /src/main/res
            - ResFoldersRelativePath      :  [-]
            - TestResFoldersRelativePath  :  [-]
            AssetsFolderRelativePath      : /src/main/assets
            LibsFolderRelativePath        : /libs
            ProjectType                   : 0
            PackTestCode                  : false
            RunProguard                   : false
            ProguardLogsFolderRelativePath          : /proguard_logs
            UseCustomManifestPackage      : false
            - ProGuardCfgFiles            : file://%MODULE_SDK_HOME%/tools/proguard/proguard-android.txt
        CONENT_ENTRY                  : file://<PROJECT>/app/build/generated/ap_generated_sources/debugUnitTest/out [-]
        CONENT_ENTRY                  : file://<PROJECT>/app/src/test
            JavaSource (test)             : file://<PROJECT>/app/src/test/java
        CONENT_ENTRY                  : file://<PROJECT>/app/src/testDebug [-]
        WATCHED_TEST_SOURCE_FOLDER    : file://<PROJECT>/app/build/generated/ap_generated_sources/debugUnitTest/out [-]
            Generated                     : true
        WATCHED_TEST_RESOURCE_FOLDER  : file://<PROJECT>/app/src/test/assets [-]
        WATCHED_TEST_RESOURCE_FOLDER  : file://<PROJECT>/app/src/test/baselineProfiles [-]
        WATCHED_TEST_SOURCE_FOLDER    : file://<PROJECT>/app/src/test/kotlin [-]
        WATCHED_TEST_RESOURCE_FOLDER  : file://<PROJECT>/app/src/test/ml [-]
        WATCHED_TEST_RESOURCE_FOLDER  : file://<PROJECT>/app/src/test/res [-]
        WATCHED_TEST_RESOURCE_FOLDER  : file://<PROJECT>/app/src/test/resources [-]
        WATCHED_TEST_SOURCE_FOLDER    : file://<PROJECT>/app/src/test/shaders [-]
        WATCHED_TEST_RESOURCE_FOLDER  : file://<PROJECT>/app/src/testDebug/assets [-]
        WATCHED_TEST_RESOURCE_FOLDER  : file://<PROJECT>/app/src/testDebug/baselineProfiles [-]
        WATCHED_TEST_SOURCE_FOLDER    : file://<PROJECT>/app/src/testDebug/java [-]
        WATCHED_TEST_SOURCE_FOLDER    : file://<PROJECT>/app/src/testDebug/kotlin [-]
        WATCHED_TEST_RESOURCE_FOLDER  : file://<PROJECT>/app/src/testDebug/ml [-]
        WATCHED_TEST_RESOURCE_FOLDER  : file://<PROJECT>/app/src/testDebug/res [-]
        WATCHED_TEST_RESOURCE_FOLDER  : file://<PROJECT>/app/src/testDebug/resources [-]
        WATCHED_TEST_SOURCE_FOLDER    : file://<PROJECT>/app/src/testDebug/shaders [-]
        JDK                           : <NAME_CUT> Android SDK
        *isInherited                  : false
            SdkType                       : Android SDK
            HomePath                      : <ANDROID_SDK>
            VersionString                 : <JDK_VERSION>
        ORDER_ENTRY                   : <Module source>
        LIBRARY                       : Gradle: <ANDROID_SDK>/platforms/android-<SDK_VERSION>/optional/org.apache.http.legacy.jar [=]
            Scope                         : Test
        LIBRARY                       : Gradle: android.arch.core:common:<VERSION> [=]
            Scope                         : Test
        LIBRARY                       : Gradle: android.arch.core:runtime:<VERSION>@aar [=]
            Scope                         : Test
        LIBRARY                       : Gradle: android.arch.lifecycle:common:<VERSION> [=]
            Scope                         : Test
        LIBRARY                       : Gradle: android.arch.lifecycle:livedata-core:<VERSION>@aar [=]
            Scope                         : Test
        LIBRARY                       : Gradle: android.arch.lifecycle:livedata:<VERSION>@aar [=]
            Scope                         : Test
        LIBRARY                       : Gradle: android.arch.lifecycle:runtime:<VERSION>@aar [=]
            Scope                         : Test
        LIBRARY                       : Gradle: android.arch.lifecycle:viewmodel:<VERSION>@aar [=]
            Scope                         : Test
        LIBRARY                       : Gradle: com.android.support.constraint:constraint-layout-solver:<VERSION> [=]
            Scope                         : Test
        LIBRARY                       : Gradle: com.android.support.constraint:constraint-layout:<VERSION>@aar [=]
            Scope                         : Test
        LIBRARY                       : Gradle: com.android.support:animated-vector-drawable:<VERSION>@aar [=]
            Scope                         : Test
        LIBRARY                       : Gradle: com.android.support:appcompat-v7:<VERSION>@aar [=]
            Scope                         : Test
        LIBRARY                       : Gradle: com.android.support:asynclayoutinflater:<VERSION>@aar [=]
            Scope                         : Test
        LIBRARY                       : Gradle: com.android.support:collections:<VERSION> [=]
            Scope                         : Test
        LIBRARY                       : Gradle: com.android.support:coordinatorlayout:<VERSION>@aar [=]
            Scope                         : Test
        LIBRARY                       : Gradle: com.android.support:cursoradapter:<VERSION>@aar [=]
            Scope                         : Test
        LIBRARY                       : Gradle: com.android.support:customview:<VERSION>@aar [=]
            Scope                         : Test
        LIBRARY                       : Gradle: com.android.support:documentfile:<VERSION>@aar [=]
            Scope                         : Test
        LIBRARY                       : Gradle: com.android.support:drawerlayout:<VERSION>@aar [=]
            Scope                         : Test
        LIBRARY                       : Gradle: com.android.support:interpolator:<VERSION>@aar [=]
            Scope                         : Test
        LIBRARY                       : Gradle: com.android.support:loader:<VERSION>@aar [=]
            Scope                         : Test
        LIBRARY                       : Gradle: com.android.support:localbroadcastmanager:<VERSION>@aar [=]
            Scope                         : Test
        LIBRARY                       : Gradle: com.android.support:print:<VERSION>@aar [=]
            Scope                         : Test
        LIBRARY                       : Gradle: com.android.support:slidingpanelayout:<VERSION>@aar [=]
            Scope                         : Test
        LIBRARY                       : Gradle: com.android.support:support-annotations:<VERSION> [=]
            Scope                         : Test
        LIBRARY                       : Gradle: com.android.support:support-compat:<VERSION>@aar [=]
            Scope                         : Test
        LIBRARY                       : Gradle: com.android.support:support-core-ui:<VERSION>@aar [=]
            Scope                         : Test
        LIBRARY                       : Gradle: com.android.support:support-core-utils:<VERSION>@aar [=]
            Scope                         : Test
        LIBRARY                       : Gradle: com.android.support:support-fragment:<VERSION>@aar [=]
            Scope                         : Test
        LIBRARY                       : Gradle: com.android.support:support-vector-drawable:<VERSION>@aar [=]
            Scope                         : Test
        LIBRARY                       : Gradle: com.android.support:swiperefreshlayout:<VERSION>@aar [=]
            Scope                         : Test
        LIBRARY                       : Gradle: com.android.support:versionedparcelable:<VERSION>@aar [=]
            Scope                         : Test
        LIBRARY                       : Gradle: com.android.support:viewpager:<VERSION>@aar [=]
            Scope                         : Test
        LIBRARY                       : Gradle: com.google.guava:guava:19.0 [=]
            Scope                         : Test
        LIBRARY                       : Gradle: junit:junit:4.12 [=]
            Scope                         : Test
        LIBRARY                       : Gradle: org.hamcrest:hamcrest-core:1.3 [=]
            Scope                         : Test
        ORDER_ENTRY                   : project.app.main
            Scope                         : Test
        Classes
            -                             : file://<PROJECT>/app/build/intermediates/javac/debugUnitTest/classes
            -                             : jar://<PROJECT>/app/build/intermediates/compile_and_runtime_not_namespaced_r_class_jar/debug/R.jar!/
            -                             : file://<PROJECT>/app/build/intermediates/javac/debugAndroidTest/classes
            -                             : jar://<PROJECT>/app/build/intermediates/compile_and_runtime_not_namespaced_r_class_jar/debugAndroidTest/R.jar!/
            -                             : file://<PROJECT>/app/build/generated/res/resValues/androidTest/debug
        BUILD_TASKS
            TEST_COMPILE_MODE             : All
                CLEAN                         : :app:createMockableJar, :app:generateDebugAndroidTestSources, :app:generateDebugSources
                ASSEMBLE                      : :app:assembleDebug, :app:assembleDebugAndroidTest, :app:assembleDebugUnitTest
                REBUILD                       : :app:assembleDebug, :app:assembleDebugAndroidTest, :app:assembleDebugUnitTest, :app:clean
                COMPILE_JAVA                  : :app:compileDebugAndroidTestSources, :app:compileDebugSources, :app:compileDebugUnitTestSources
                SOURCE_GEN                    : :app:createMockableJar, :app:generateDebugAndroidTestSources, :app:generateDebugSources
                BUNDLE                        : :app:bundleDebug
                APK_FROM_BUNDLE               : :app:extractApksForDebug
            TEST_COMPILE_MODE             : Android tests
                CLEAN                         : :app:generateDebugAndroidTestSources, :app:generateDebugSources
                ASSEMBLE                      : :app:assembleDebug, :app:assembleDebugAndroidTest
                REBUILD                       : :app:assembleDebug, :app:assembleDebugAndroidTest, :app:clean
                COMPILE_JAVA                  : :app:compileDebugAndroidTestSources, :app:compileDebugSources
                SOURCE_GEN                    : :app:generateDebugAndroidTestSources, :app:generateDebugSources
                BUNDLE                        : :app:bundleDebug
                APK_FROM_BUNDLE               : :app:extractApksForDebug
            TEST_COMPILE_MODE             : Unit tests
                CLEAN                         : :app:createMockableJar, :app:generateDebugSources
                ASSEMBLE                      : :app:assembleDebug, :app:assembleDebugUnitTest
                REBUILD                       : :app:assembleDebug, :app:assembleDebugUnitTest, :app:clean
                COMPILE_JAVA                  : :app:compileDebugUnitTestSources
                SOURCE_GEN                    : :app:createMockableJar, :app:generateDebugSources
                BUNDLE                        : :app:bundleDebug
                APK_FROM_BUNDLE               : :app:extractApksForDebug
            TEST_COMPILE_MODE             : None
                CLEAN                         : :app:generateDebugSources
                ASSEMBLE                      : :app:assembleDebug
                REBUILD                       : :app:assembleDebug, :app:clean
                COMPILE_JAVA                  : :app:compileDebugSources
                SOURCE_GEN                    : :app:generateDebugSources
                BUNDLE                        : :app:bundleDebug
                APK_FROM_BUNDLE               : :app:extractApksForDebug
    RUN_CONFIGURATION             : app
        *class*                       : AndroidRunConfiguration
        ModuleName                    : project.app.main
        Module                        : project.app.main
    LIBRARY_TABLE
        LIBRARY                       : Gradle: <ANDROID_SDK>/platforms/android-<SDK_VERSION>/optional/org.apache.http.legacy.jar
            *CLASSES                      : jar://<ANDROID_SDK>/platforms/android-<SDK_VERSION>/optional/org.apache.http.legacy.jar!/
        LIBRARY                       : Gradle: android.arch.core:common:<VERSION>
            *CLASSES                      : jar://<M2>/android/arch/core/common/1.1.1/common-<VERSION>.jar!/
        LIBRARY                       : Gradle: android.arch.core:runtime:<VERSION>@aar
            *CLASSES                      : file://<GRADLE>/caches/transforms-3/xxxxxxxxxxxxxxxxxxxxxxxxxxxxxxxx/transformed/runtime-<VERSION>/AndroidManifest.xml
            *CLASSES                      : jar://<GRADLE>/caches/transforms-3/xxxxxxxxxxxxxxxxxxxxxxxxxxxxxxxx/transformed/runtime-<VERSION>/jars/classes.jar!/
        LIBRARY                       : Gradle: android.arch.lifecycle:common:<VERSION>
            *CLASSES                      : jar://<M2>/android/arch/lifecycle/common/1.1.1/common-<VERSION>.jar!/
        LIBRARY                       : Gradle: android.arch.lifecycle:livedata-core:<VERSION>@aar
            *CLASSES                      : file://<GRADLE>/caches/transforms-3/xxxxxxxxxxxxxxxxxxxxxxxxxxxxxxxx/transformed/livedata-core-<VERSION>/AndroidManifest.xml
            *CLASSES                      : jar://<GRADLE>/caches/transforms-3/xxxxxxxxxxxxxxxxxxxxxxxxxxxxxxxx/transformed/livedata-core-<VERSION>/jars/classes.jar!/
        LIBRARY                       : Gradle: android.arch.lifecycle:livedata:<VERSION>@aar
            *CLASSES                      : file://<GRADLE>/caches/transforms-3/xxxxxxxxxxxxxxxxxxxxxxxxxxxxxxxx/transformed/livedata-<VERSION>/AndroidManifest.xml
            *CLASSES                      : jar://<GRADLE>/caches/transforms-3/xxxxxxxxxxxxxxxxxxxxxxxxxxxxxxxx/transformed/livedata-<VERSION>/jars/classes.jar!/
        LIBRARY                       : Gradle: android.arch.lifecycle:runtime:<VERSION>@aar
            *CLASSES                      : file://<GRADLE>/caches/transforms-3/xxxxxxxxxxxxxxxxxxxxxxxxxxxxxxxx/transformed/runtime-<VERSION>/AndroidManifest.xml
            *CLASSES                      : jar://<GRADLE>/caches/transforms-3/xxxxxxxxxxxxxxxxxxxxxxxxxxxxxxxx/transformed/runtime-<VERSION>/jars/classes.jar!/
        LIBRARY                       : Gradle: android.arch.lifecycle:viewmodel:<VERSION>@aar
            *CLASSES                      : file://<GRADLE>/caches/transforms-3/xxxxxxxxxxxxxxxxxxxxxxxxxxxxxxxx/transformed/viewmodel-<VERSION>/AndroidManifest.xml
            *CLASSES                      : jar://<GRADLE>/caches/transforms-3/xxxxxxxxxxxxxxxxxxxxxxxxxxxxxxxx/transformed/viewmodel-<VERSION>/jars/classes.jar!/
        LIBRARY                       : Gradle: com.android.support.constraint:constraint-layout-solver:<VERSION>
            *CLASSES                      : jar://<M2>/com/android/support/constraint/constraint-layout-solver/<VERSION>/constraint-layout-solver-<VERSION>.jar!/
        LIBRARY                       : Gradle: com.android.support.constraint:constraint-layout:<VERSION>@aar
            *CLASSES                      : file://<GRADLE>/caches/transforms-3/xxxxxxxxxxxxxxxxxxxxxxxxxxxxxxxx/transformed/constraint-layout-<VERSION>/AndroidManifest.xml
            *CLASSES                      : file://<GRADLE>/caches/transforms-3/xxxxxxxxxxxxxxxxxxxxxxxxxxxxxxxx/transformed/constraint-layout-<VERSION>/res
            *CLASSES                      : jar://<GRADLE>/caches/transforms-3/xxxxxxxxxxxxxxxxxxxxxxxxxxxxxxxx/transformed/constraint-layout-<VERSION>/jars/classes.jar!/
        LIBRARY                       : Gradle: com.android.support.test.espresso:espresso-core:<VERSION>@aar
            *CLASSES                      : file://<GRADLE>/caches/transforms-3/xxxxxxxxxxxxxxxxxxxxxxxxxxxxxxxx/transformed/espresso-core-<VERSION>/AndroidManifest.xml
            *CLASSES                      : jar://<GRADLE>/caches/transforms-3/xxxxxxxxxxxxxxxxxxxxxxxxxxxxxxxx/transformed/espresso-core-<VERSION>/jars/classes.jar!/
        LIBRARY                       : Gradle: com.android.support.test.espresso:espresso-idling-resource:<VERSION>@aar
            *CLASSES                      : file://<GRADLE>/caches/transforms-3/xxxxxxxxxxxxxxxxxxxxxxxxxxxxxxxx/transformed/espresso-idling-resource-<VERSION>/AndroidManifest.xml
            *CLASSES                      : jar://<GRADLE>/caches/transforms-3/xxxxxxxxxxxxxxxxxxxxxxxxxxxxxxxx/transformed/espresso-idling-resource-<VERSION>/jars/classes.jar!/
        LIBRARY                       : Gradle: com.android.support.test:monitor:<VERSION>@aar
            *CLASSES                      : file://<GRADLE>/caches/transforms-3/xxxxxxxxxxxxxxxxxxxxxxxxxxxxxxxx/transformed/monitor-<VERSION>/AndroidManifest.xml
            *CLASSES                      : jar://<GRADLE>/caches/transforms-3/xxxxxxxxxxxxxxxxxxxxxxxxxxxxxxxx/transformed/monitor-<VERSION>/jars/classes.jar!/
        LIBRARY                       : Gradle: com.android.support.test:runner:<VERSION>@aar
            *CLASSES                      : file://<GRADLE>/caches/transforms-3/xxxxxxxxxxxxxxxxxxxxxxxxxxxxxxxx/transformed/runner-<VERSION>/AndroidManifest.xml
            *CLASSES                      : jar://<GRADLE>/caches/transforms-3/xxxxxxxxxxxxxxxxxxxxxxxxxxxxxxxx/transformed/runner-<VERSION>/jars/classes.jar!/
        LIBRARY                       : Gradle: com.android.support:animated-vector-drawable:<VERSION>@aar
            *CLASSES                      : file://<GRADLE>/caches/transforms-3/xxxxxxxxxxxxxxxxxxxxxxxxxxxxxxxx/transformed/animated-vector-drawable-<VERSION>/AndroidManifest.xml
            *CLASSES                      : jar://<GRADLE>/caches/transforms-3/xxxxxxxxxxxxxxxxxxxxxxxxxxxxxxxx/transformed/animated-vector-drawable-<VERSION>/jars/classes.jar!/
        LIBRARY                       : Gradle: com.android.support:appcompat-v7:<VERSION>@aar
            *CLASSES                      : file://<GRADLE>/caches/transforms-3/xxxxxxxxxxxxxxxxxxxxxxxxxxxxxxxx/transformed/appcompat-v7-<VERSION>/AndroidManifest.xml
            *CLASSES                      : file://<GRADLE>/caches/transforms-3/xxxxxxxxxxxxxxxxxxxxxxxxxxxxxxxx/transformed/appcompat-v7-<VERSION>/res
            *CLASSES                      : jar://<GRADLE>/caches/transforms-3/xxxxxxxxxxxxxxxxxxxxxxxxxxxxxxxx/transformed/appcompat-v7-<VERSION>/jars/classes.jar!/
            *ANNOTATIONS                  : jar://<GRADLE>/caches/transforms-3/xxxxxxxxxxxxxxxxxxxxxxxxxxxxxxxx/transformed/appcompat-v7-<VERSION>/annotations.zip!/
        LIBRARY                       : Gradle: com.android.support:asynclayoutinflater:<VERSION>@aar
            *CLASSES                      : file://<GRADLE>/caches/transforms-3/xxxxxxxxxxxxxxxxxxxxxxxxxxxxxxxx/transformed/asynclayoutinflater-<VERSION>/AndroidManifest.xml
            *CLASSES                      : jar://<GRADLE>/caches/transforms-3/xxxxxxxxxxxxxxxxxxxxxxxxxxxxxxxx/transformed/asynclayoutinflater-<VERSION>/jars/classes.jar!/
        LIBRARY                       : Gradle: com.android.support:collections:<VERSION>
            *CLASSES                      : jar://<M2>/com/android/support/collections/<VERSION>/collections-<VERSION>.jar!/
        LIBRARY                       : Gradle: com.android.support:coordinatorlayout:<VERSION>@aar
            *CLASSES                      : file://<GRADLE>/caches/transforms-3/xxxxxxxxxxxxxxxxxxxxxxxxxxxxxxxx/transformed/coordinatorlayout-<VERSION>/AndroidManifest.xml
            *CLASSES                      : file://<GRADLE>/caches/transforms-3/xxxxxxxxxxxxxxxxxxxxxxxxxxxxxxxx/transformed/coordinatorlayout-<VERSION>/res
            *CLASSES                      : jar://<GRADLE>/caches/transforms-3/xxxxxxxxxxxxxxxxxxxxxxxxxxxxxxxx/transformed/coordinatorlayout-<VERSION>/jars/classes.jar!/
            *ANNOTATIONS                  : jar://<GRADLE>/caches/transforms-3/xxxxxxxxxxxxxxxxxxxxxxxxxxxxxxxx/transformed/coordinatorlayout-<VERSION>/annotations.zip!/
        LIBRARY                       : Gradle: com.android.support:cursoradapter:<VERSION>@aar
            *CLASSES                      : file://<GRADLE>/caches/transforms-3/xxxxxxxxxxxxxxxxxxxxxxxxxxxxxxxx/transformed/cursoradapter-<VERSION>/AndroidManifest.xml
            *CLASSES                      : jar://<GRADLE>/caches/transforms-3/xxxxxxxxxxxxxxxxxxxxxxxxxxxxxxxx/transformed/cursoradapter-<VERSION>/jars/classes.jar!/
        LIBRARY                       : Gradle: com.android.support:customview:<VERSION>@aar
            *CLASSES                      : file://<GRADLE>/caches/transforms-3/xxxxxxxxxxxxxxxxxxxxxxxxxxxxxxxx/transformed/customview-<VERSION>/AndroidManifest.xml
            *CLASSES                      : jar://<GRADLE>/caches/transforms-3/xxxxxxxxxxxxxxxxxxxxxxxxxxxxxxxx/transformed/customview-<VERSION>/jars/classes.jar!/
        LIBRARY                       : Gradle: com.android.support:documentfile:<VERSION>@aar
            *CLASSES                      : file://<GRADLE>/caches/transforms-3/xxxxxxxxxxxxxxxxxxxxxxxxxxxxxxxx/transformed/documentfile-<VERSION>/AndroidManifest.xml
            *CLASSES                      : jar://<GRADLE>/caches/transforms-3/xxxxxxxxxxxxxxxxxxxxxxxxxxxxxxxx/transformed/documentfile-<VERSION>/jars/classes.jar!/
        LIBRARY                       : Gradle: com.android.support:drawerlayout:<VERSION>@aar
            *CLASSES                      : file://<GRADLE>/caches/transforms-3/xxxxxxxxxxxxxxxxxxxxxxxxxxxxxxxx/transformed/drawerlayout-<VERSION>/AndroidManifest.xml
            *CLASSES                      : jar://<GRADLE>/caches/transforms-3/xxxxxxxxxxxxxxxxxxxxxxxxxxxxxxxx/transformed/drawerlayout-<VERSION>/jars/classes.jar!/
            *ANNOTATIONS                  : jar://<GRADLE>/caches/transforms-3/xxxxxxxxxxxxxxxxxxxxxxxxxxxxxxxx/transformed/drawerlayout-<VERSION>/annotations.zip!/
        LIBRARY                       : Gradle: com.android.support:interpolator:<VERSION>@aar
            *CLASSES                      : file://<GRADLE>/caches/transforms-3/xxxxxxxxxxxxxxxxxxxxxxxxxxxxxxxx/transformed/interpolator-<VERSION>/AndroidManifest.xml
            *CLASSES                      : jar://<GRADLE>/caches/transforms-3/xxxxxxxxxxxxxxxxxxxxxxxxxxxxxxxx/transformed/interpolator-<VERSION>/jars/classes.jar!/
        LIBRARY                       : Gradle: com.android.support:loader:<VERSION>@aar
            *CLASSES                      : file://<GRADLE>/caches/transforms-3/xxxxxxxxxxxxxxxxxxxxxxxxxxxxxxxx/transformed/loader-<VERSION>/AndroidManifest.xml
            *CLASSES                      : jar://<GRADLE>/caches/transforms-3/xxxxxxxxxxxxxxxxxxxxxxxxxxxxxxxx/transformed/loader-<VERSION>/jars/classes.jar!/
        LIBRARY                       : Gradle: com.android.support:localbroadcastmanager:<VERSION>@aar
            *CLASSES                      : file://<GRADLE>/caches/transforms-3/xxxxxxxxxxxxxxxxxxxxxxxxxxxxxxxx/transformed/localbroadcastmanager-<VERSION>/AndroidManifest.xml
            *CLASSES                      : jar://<GRADLE>/caches/transforms-3/xxxxxxxxxxxxxxxxxxxxxxxxxxxxxxxx/transformed/localbroadcastmanager-<VERSION>/jars/classes.jar!/
        LIBRARY                       : Gradle: com.android.support:print:<VERSION>@aar
            *CLASSES                      : file://<GRADLE>/caches/transforms-3/xxxxxxxxxxxxxxxxxxxxxxxxxxxxxxxx/transformed/print-<VERSION>/AndroidManifest.xml
            *CLASSES                      : jar://<GRADLE>/caches/transforms-3/xxxxxxxxxxxxxxxxxxxxxxxxxxxxxxxx/transformed/print-<VERSION>/jars/classes.jar!/
            *ANNOTATIONS                  : jar://<GRADLE>/caches/transforms-3/xxxxxxxxxxxxxxxxxxxxxxxxxxxxxxxx/transformed/print-<VERSION>/annotations.zip!/
        LIBRARY                       : Gradle: com.android.support:slidingpanelayout:<VERSION>@aar
            *CLASSES                      : file://<GRADLE>/caches/transforms-3/xxxxxxxxxxxxxxxxxxxxxxxxxxxxxxxx/transformed/slidingpanelayout-<VERSION>/AndroidManifest.xml
            *CLASSES                      : jar://<GRADLE>/caches/transforms-3/xxxxxxxxxxxxxxxxxxxxxxxxxxxxxxxx/transformed/slidingpanelayout-<VERSION>/jars/classes.jar!/
        LIBRARY                       : Gradle: com.android.support:support-annotations:<VERSION>
            *CLASSES                      : jar://<M2>/com/android/support/support-annotations/<VERSION>/support-annotations-<VERSION>.jar!/
        LIBRARY                       : Gradle: com.android.support:support-compat:<VERSION>@aar
            *CLASSES                      : file://<GRADLE>/caches/transforms-3/xxxxxxxxxxxxxxxxxxxxxxxxxxxxxxxx/transformed/support-compat-<VERSION>/AndroidManifest.xml
            *CLASSES                      : file://<GRADLE>/caches/transforms-3/xxxxxxxxxxxxxxxxxxxxxxxxxxxxxxxx/transformed/support-compat-<VERSION>/res
            *CLASSES                      : jar://<GRADLE>/caches/transforms-3/xxxxxxxxxxxxxxxxxxxxxxxxxxxxxxxx/transformed/support-compat-<VERSION>/jars/classes.jar!/
            *ANNOTATIONS                  : jar://<GRADLE>/caches/transforms-3/xxxxxxxxxxxxxxxxxxxxxxxxxxxxxxxx/transformed/support-compat-<VERSION>/annotations.zip!/
        LIBRARY                       : Gradle: com.android.support:support-core-ui:<VERSION>@aar
            *CLASSES                      : file://<GRADLE>/caches/transforms-3/xxxxxxxxxxxxxxxxxxxxxxxxxxxxxxxx/transformed/support-core-ui-<VERSION>/AndroidManifest.xml
            *CLASSES                      : jar://<GRADLE>/caches/transforms-3/xxxxxxxxxxxxxxxxxxxxxxxxxxxxxxxx/transformed/support-core-ui-<VERSION>/jars/classes.jar!/
        LIBRARY                       : Gradle: com.android.support:support-core-utils:<VERSION>@aar
            *CLASSES                      : file://<GRADLE>/caches/transforms-3/xxxxxxxxxxxxxxxxxxxxxxxxxxxxxxxx/transformed/support-core-utils-<VERSION>/AndroidManifest.xml
            *CLASSES                      : jar://<GRADLE>/caches/transforms-3/xxxxxxxxxxxxxxxxxxxxxxxxxxxxxxxx/transformed/support-core-utils-<VERSION>/jars/classes.jar!/
        LIBRARY                       : Gradle: com.android.support:support-fragment:<VERSION>@aar
            *CLASSES                      : file://<GRADLE>/caches/transforms-3/xxxxxxxxxxxxxxxxxxxxxxxxxxxxxxxx/transformed/support-fragment-<VERSION>/AndroidManifest.xml
            *CLASSES                      : jar://<GRADLE>/caches/transforms-3/xxxxxxxxxxxxxxxxxxxxxxxxxxxxxxxx/transformed/support-fragment-<VERSION>/jars/classes.jar!/
            *ANNOTATIONS                  : jar://<GRADLE>/caches/transforms-3/xxxxxxxxxxxxxxxxxxxxxxxxxxxxxxxx/transformed/support-fragment-<VERSION>/annotations.zip!/
        LIBRARY                       : Gradle: com.android.support:support-vector-drawable:<VERSION>@aar
            *CLASSES                      : file://<GRADLE>/caches/transforms-3/xxxxxxxxxxxxxxxxxxxxxxxxxxxxxxxx/transformed/support-vector-drawable-<VERSION>/AndroidManifest.xml
            *CLASSES                      : jar://<GRADLE>/caches/transforms-3/xxxxxxxxxxxxxxxxxxxxxxxxxxxxxxxx/transformed/support-vector-drawable-<VERSION>/jars/classes.jar!/
        LIBRARY                       : Gradle: com.android.support:swiperefreshlayout:<VERSION>@aar
            *CLASSES                      : file://<GRADLE>/caches/transforms-3/xxxxxxxxxxxxxxxxxxxxxxxxxxxxxxxx/transformed/swiperefreshlayout-<VERSION>/AndroidManifest.xml
            *CLASSES                      : jar://<GRADLE>/caches/transforms-3/xxxxxxxxxxxxxxxxxxxxxxxxxxxxxxxx/transformed/swiperefreshlayout-<VERSION>/jars/classes.jar!/
            *ANNOTATIONS                  : jar://<GRADLE>/caches/transforms-3/xxxxxxxxxxxxxxxxxxxxxxxxxxxxxxxx/transformed/swiperefreshlayout-<VERSION>/annotations.zip!/
        LIBRARY                       : Gradle: com.android.support:versionedparcelable:<VERSION>@aar
            *CLASSES                      : file://<GRADLE>/caches/transforms-3/xxxxxxxxxxxxxxxxxxxxxxxxxxxxxxxx/transformed/versionedparcelable-<VERSION>/AndroidManifest.xml
            *CLASSES                      : jar://<GRADLE>/caches/transforms-3/xxxxxxxxxxxxxxxxxxxxxxxxxxxxxxxx/transformed/versionedparcelable-<VERSION>/jars/classes.jar!/
        LIBRARY                       : Gradle: com.android.support:viewpager:<VERSION>@aar
            *CLASSES                      : file://<GRADLE>/caches/transforms-3/xxxxxxxxxxxxxxxxxxxxxxxxxxxxxxxx/transformed/viewpager-<VERSION>/AndroidManifest.xml
            *CLASSES                      : jar://<GRADLE>/caches/transforms-3/xxxxxxxxxxxxxxxxxxxxxxxxxxxxxxxx/transformed/viewpager-<VERSION>/jars/classes.jar!/
        LIBRARY                       : Gradle: com.google.code.findbugs:jsr305:2.0.1
            *CLASSES                      : jar://<M2>/com/google/code/findbugs/jsr305/2.0.1/jsr305-2.0.1.jar!/
        LIBRARY                       : Gradle: com.google.guava:guava:19.0
            *CLASSES                      : jar://<M2>/com/google/guava/guava/19.0/guava-19.0.jar!/
        LIBRARY                       : Gradle: com.squareup:javawriter:2.1.1
            *CLASSES                      : jar://<M2>/com/squareup/javawriter/2.1.1/javawriter-2.1.1.jar!/
        LIBRARY                       : Gradle: javax.inject:javax.inject:1
            *CLASSES                      : jar://<M2>/javax/inject/javax.inject/1/javax.inject-1.jar!/
        LIBRARY                       : Gradle: junit:junit:4.12
            *CLASSES                      : jar://<M2>/junit/junit/4.12/junit-4.12.jar!/
        LIBRARY                       : Gradle: net.sf.kxml:kxml2:2.3.0
            *CLASSES                      : jar://<M2>/net/sf/kxml/kxml2/2.3.0/kxml2-2.3.0.jar!/
        LIBRARY                       : Gradle: org.hamcrest:hamcrest-core:1.3
            *CLASSES                      : jar://<M2>/org/hamcrest/hamcrest-core/1.3/hamcrest-core-1.3.jar!/
        LIBRARY                       : Gradle: org.hamcrest:hamcrest-integration:1.3
            *CLASSES                      : jar://<M2>/org/hamcrest/hamcrest-integration/1.3/hamcrest-integration-1.3.jar!/
        LIBRARY                       : Gradle: org.hamcrest:hamcrest-library:1.3
            *CLASSES                      : jar://<M2>/org/hamcrest/hamcrest-library/1.3/hamcrest-library-1.3.jar!/
    BUILD_TASKS
        TEST_COMPILE_MODE             : All
            CLEAN                         : <PROJECT>::app:createMockableJar, <PROJECT>::app:generateDebugAndroidTestSources, <PROJECT>::app:generateDebugSources
            ASSEMBLE                      : :app:assembleDebug, :app:assembleDebugAndroidTest, :app:assembleDebugUnitTest
            REBUILD                       : <PROJECT>::app:assembleDebug, <PROJECT>::app:assembleDebugAndroidTest, <PROJECT>::app:assembleDebugUnitTest, <PROJECT>::app:clean
            COMPILE_JAVA                  : <PROJECT>::app:compileDebugAndroidTestSources, <PROJECT>::app:compileDebugSources, <PROJECT>::app:compileDebugUnitTestSources
            SOURCE_GEN                    : <PROJECT>::app:createMockableJar, <PROJECT>::app:generateDebugAndroidTestSources, <PROJECT>::app:generateDebugSources
            BUNDLE                        : :app:bundleDebug
            APK_FROM_BUNDLE               : :app:extractApksForDebug
        TEST_COMPILE_MODE             : Android tests
            CLEAN                         : <PROJECT>::app:generateDebugAndroidTestSources, <PROJECT>::app:generateDebugSources
            ASSEMBLE                      : :app:assembleDebug, :app:assembleDebugAndroidTest
            REBUILD                       : <PROJECT>::app:assembleDebug, <PROJECT>::app:assembleDebugAndroidTest, <PROJECT>::app:clean
            COMPILE_JAVA                  : <PROJECT>::app:compileDebugAndroidTestSources, <PROJECT>::app:compileDebugSources
            SOURCE_GEN                    : <PROJECT>::app:generateDebugAndroidTestSources, <PROJECT>::app:generateDebugSources
            BUNDLE                        : :app:bundleDebug
            APK_FROM_BUNDLE               : :app:extractApksForDebug
        TEST_COMPILE_MODE             : Unit tests
            CLEAN                         : <PROJECT>::app:createMockableJar, <PROJECT>::app:generateDebugSources
            ASSEMBLE                      : :app:assembleDebug, :app:assembleDebugUnitTest
            REBUILD                       : <PROJECT>::app:assembleDebug, <PROJECT>::app:assembleDebugUnitTest, <PROJECT>::app:clean
            COMPILE_JAVA                  : <PROJECT>::app:compileDebugUnitTestSources
            SOURCE_GEN                    : <PROJECT>::app:createMockableJar, <PROJECT>::app:generateDebugSources
            BUNDLE                        : :app:bundleDebug
            APK_FROM_BUNDLE               : :app:extractApksForDebug
        TEST_COMPILE_MODE             : None
            CLEAN                         : <PROJECT>::app:generateDebugSources
            ASSEMBLE                      : :app:assembleDebug
            REBUILD                       : <PROJECT>::app:assembleDebug, <PROJECT>::app:clean
            COMPILE_JAVA                  : <PROJECT>::app:compileDebugSources
            SOURCE_GEN                    : <PROJECT>::app:generateDebugSources
            BUNDLE                        : :app:bundleDebug
            APK_FROM_BUNDLE               : :app:extractApksForDebug