CompositeBuildMap             : IdeCompositeBuildMapImpl
    - builds                      : <ROOT> (IdeBuildImpl)
        buildName                     : :
    gradleSupportsDirectTaskInvocation      : true
MODULE                        : MultiFlavor
    externalProject               : MultiFlavor (DefaultExternalProject)
        name                          : MultiFlavor
        qName                         : MultiFlavor
        version                       : unspecified
        childProjects
            app                           : :app (DefaultExternalProject)
                name                          : app
                qName                         : :app
                group                         : MultiFlavor
                version                       : unspecified
                sourceCompatibility           : <PROJECT_JDK_FEATURE_LEVEL>
                targetCompatibility           : <PROJECT_JDK_FEATURE_LEVEL>
                projectDir                    : <ROOT>/app
                buildDir                      : <ROOT>/app/build [-]
                buildFile                     : <ROOT>/app/build.gradle
                tasks
                    testFirstAbcSecondAbcDebugUnitTest      : testFirstAbcSecondAbcDebugUnitTest (DefaultExternalTask)
                        qName                         : :app:testFirstAbcSecondAbcDebugUnitTest
                    testFirstAbcSecondAbcReleaseUnitTest    : testFirstAbcSecondAbcReleaseUnitTest (DefaultExternalTask)
                        qName                         : :app:testFirstAbcSecondAbcReleaseUnitTest
                externalSystemId              : GRADLE
                artifactsByConfiguration
                    androidApis                   : <empty>
                    androidJdkImage               : <empty>
                    androidTestAnnotationProcessor          : <empty>
                    androidTestCompileOnly        : <empty>
                    androidTestDebugAnnotationProcessor     : <empty>
                    androidTestDebugCompileOnly   : <empty>
                    androidTestDebugImplementation          : <empty>
                    androidTestDebugRuntimeOnly   : <empty>
                    androidTestDebugWearApp       : <empty>
                    androidTestFirstAbcAnnotationProcessor  : <empty>
                    androidTestFirstAbcCompileOnly          : <empty>
                    androidTestFirstAbcImplementation       : <empty>
                    androidTestFirstAbcRuntimeOnly          : <empty>
                    androidTestFirstAbcSecondAbcAnnotationProcessor   : <empty>
                    androidTestFirstAbcSecondAbcCompileOnly : <empty>
                    androidTestFirstAbcSecondAbcDebugAnnotationProcessor        : <empty>
                    androidTestFirstAbcSecondAbcDebugCompileOnly      : <empty>
                    androidTestFirstAbcSecondAbcDebugImplementation   : <empty>
                    androidTestFirstAbcSecondAbcDebugRuntimeOnly      : <empty>
                    androidTestFirstAbcSecondAbcDebugWearApp          : <empty>
                    androidTestFirstAbcSecondAbcImplementation        : <empty>
                    androidTestFirstAbcSecondAbcRuntimeOnly : <empty>
                    androidTestFirstAbcSecondAbcWearApp     : <empty>
                    androidTestFirstAbcWearApp    : <empty>
                    androidTestFirstXyzAnnotationProcessor  : <empty>
                    androidTestFirstXyzCompileOnly          : <empty>
                    androidTestFirstXyzImplementation       : <empty>
                    androidTestFirstXyzRuntimeOnly          : <empty>
                    androidTestFirstXyzWearApp    : <empty>
                    androidTestImplementation     : <empty>
                    androidTestReleaseAnnotationProcessor   : <empty>
                    androidTestReleaseCompileOnly : <empty>
                    androidTestReleaseImplementation        : <empty>
                    androidTestReleaseRuntimeOnly : <empty>
                    androidTestReleaseWearApp     : <empty>
                    androidTestRuntimeOnly        : <empty>
                    androidTestSecondAbcAnnotationProcessor : <empty>
                    androidTestSecondAbcCompileOnly         : <empty>
                    androidTestSecondAbcImplementation      : <empty>
                    androidTestSecondAbcRuntimeOnly         : <empty>
                    androidTestSecondAbcWearApp   : <empty>
                    androidTestSecondXyzAnnotationProcessor : <empty>
                    androidTestSecondXyzCompileOnly         : <empty>
                    androidTestSecondXyzImplementation      : <empty>
                    androidTestSecondXyzRuntimeOnly         : <empty>
                    androidTestSecondXyzWearApp   : <empty>
                    androidTestUtil               : <empty>
                    androidTestWearApp            : <empty>
                    annotationProcessor           : <empty>
                    api                           : <empty>
                    archives                      : <empty>
                    compileOnly                   : <empty>
                    coreLibraryDesugaring         : <empty>
                    debugAnnotationProcessor      : <empty>
                    debugApi                      : <empty>
                    debugCompileOnly              : <empty>
                    debugImplementation           : <empty>
                    debugRuntimeOnly              : <empty>
                    debugWearApp                  : <empty>
                    default                       : <empty>
                    firstAbcAnnotationProcessor   : <empty>
                    firstAbcApi                   : <empty>
                    firstAbcCompileOnly           : <empty>
                    firstAbcImplementation        : <empty>
                    firstAbcRuntimeOnly           : <empty>
                    firstAbcSecondAbcAnnotationProcessor    : <empty>
                    firstAbcSecondAbcApi          : <empty>
                    firstAbcSecondAbcCompileOnly  : <empty>
                    firstAbcSecondAbcDebugAndroidTestAnnotationProcessorClasspath         : <empty>
                    firstAbcSecondAbcDebugAndroidTestCompileClasspath : <empty>
                    firstAbcSecondAbcDebugAndroidTestRuntimeClasspath : <empty>
                    firstAbcSecondAbcDebugAnnotationProcessor         : <empty>
                    firstAbcSecondAbcDebugAnnotationProcessorClasspath          : <empty>
                    firstAbcSecondAbcDebugApi     : <empty>
                    firstAbcSecondAbcDebugApiElements       : <empty>
                    firstAbcSecondAbcDebugCompileClasspath  : <empty>
                    firstAbcSecondAbcDebugCompileOnly       : <empty>
                    firstAbcSecondAbcDebugImplementation    : <empty>
                    firstAbcSecondAbcDebugReverseMetadataValues       : <empty>
                    firstAbcSecondAbcDebugRuntimeClasspath  : <empty>
                    firstAbcSecondAbcDebugRuntimeElements   : <empty>
                    firstAbcSecondAbcDebugRuntimeOnly       : <empty>
                    firstAbcSecondAbcDebugUnitTestAnnotationProcessorClasspath  : <empty>
                    firstAbcSecondAbcDebugUnitTestCompileClasspath    : <empty>
                    firstAbcSecondAbcDebugUnitTestRuntimeClasspath    : <empty>
                    firstAbcSecondAbcDebugWearApp : <empty>
                    firstAbcSecondAbcDebugWearBundling      : <empty>
                    firstAbcSecondAbcImplementation         : <empty>
                    firstAbcSecondAbcReleaseAnnotationProcessor       : <empty>
                    firstAbcSecondAbcReleaseAnnotationProcessorClasspath        : <empty>
                    firstAbcSecondAbcReleaseApi   : <empty>
                    firstAbcSecondAbcReleaseApiElements     : <empty>
                    firstAbcSecondAbcReleaseCompileClasspath          : <empty>
                    firstAbcSecondAbcReleaseCompileOnly     : <empty>
                    firstAbcSecondAbcReleaseImplementation  : <empty>
                    firstAbcSecondAbcReleaseReverseMetadataValues     : <empty>
                    firstAbcSecondAbcReleaseRuntimeClasspath          : <empty>
                    firstAbcSecondAbcReleaseRuntimeElements : <empty>
                    firstAbcSecondAbcReleaseRuntimeOnly     : <empty>
                    firstAbcSecondAbcReleaseUnitTestAnnotationProcessorClasspath          : <empty>
                    firstAbcSecondAbcReleaseUnitTestCompileClasspath  : <empty>
                    firstAbcSecondAbcReleaseUnitTestRuntimeClasspath  : <empty>
                    firstAbcSecondAbcReleaseWearApp         : <empty>
                    firstAbcSecondAbcReleaseWearBundling    : <empty>
                    firstAbcSecondAbcRuntimeOnly  : <empty>
                    firstAbcSecondAbcWearApp      : <empty>
                    firstAbcWearApp               : <empty>
                    firstXyzAnnotationProcessor   : <empty>
                    firstXyzApi                   : <empty>
                    firstXyzCompileOnly           : <empty>
                    firstXyzImplementation        : <empty>
                    firstXyzRuntimeOnly           : <empty>
                    firstXyzWearApp               : <empty>
                    implementation                : <empty>
                    lintChecks                    : <empty>
                    lintPublish                   : <empty>
                    releaseAnnotationProcessor    : <empty>
                    releaseApi                    : <empty>
                    releaseCompileOnly            : <empty>
                    releaseImplementation         : <empty>
                    releaseRuntimeOnly            : <empty>
                    releaseWearApp                : <empty>
                    runtimeOnly                   : <empty>
                    secondAbcAnnotationProcessor  : <empty>
                    secondAbcApi                  : <empty>
                    secondAbcCompileOnly          : <empty>
                    secondAbcImplementation       : <empty>
                    secondAbcRuntimeOnly          : <empty>
                    secondAbcWearApp              : <empty>
                    secondXyzAnnotationProcessor  : <empty>
                    secondXyzApi                  : <empty>
                    secondXyzCompileOnly          : <empty>
                    secondXyzImplementation       : <empty>
                    secondXyzRuntimeOnly          : <empty>
                    secondXyzWearApp              : <empty>
                    testAnnotationProcessor       : <empty>
                    testCompileOnly               : <empty>
                    testDebugAnnotationProcessor  : <empty>
                    testDebugCompileOnly          : <empty>
                    testDebugImplementation       : <empty>
                    testDebugRuntimeOnly          : <empty>
                    testDebugWearApp              : <empty>
                    testFirstAbcAnnotationProcessor         : <empty>
                    testFirstAbcCompileOnly       : <empty>
                    testFirstAbcImplementation    : <empty>
                    testFirstAbcRuntimeOnly       : <empty>
                    testFirstAbcSecondAbcAnnotationProcessor          : <empty>
                    testFirstAbcSecondAbcCompileOnly        : <empty>
                    testFirstAbcSecondAbcDebugAnnotationProcessor     : <empty>
                    testFirstAbcSecondAbcDebugCompileOnly   : <empty>
                    testFirstAbcSecondAbcDebugImplementation          : <empty>
                    testFirstAbcSecondAbcDebugRuntimeOnly   : <empty>
                    testFirstAbcSecondAbcDebugWearApp       : <empty>
                    testFirstAbcSecondAbcImplementation     : <empty>
                    testFirstAbcSecondAbcReleaseAnnotationProcessor   : <empty>
                    testFirstAbcSecondAbcReleaseCompileOnly : <empty>
                    testFirstAbcSecondAbcReleaseImplementation        : <empty>
                    testFirstAbcSecondAbcReleaseRuntimeOnly : <empty>
                    testFirstAbcSecondAbcReleaseWearApp     : <empty>
                    testFirstAbcSecondAbcRuntimeOnly        : <empty>
                    testFirstAbcSecondAbcWearApp  : <empty>
                    testFirstAbcWearApp           : <empty>
                    testFirstXyzAnnotationProcessor         : <empty>
                    testFirstXyzCompileOnly       : <empty>
                    testFirstXyzImplementation    : <empty>
                    testFirstXyzRuntimeOnly       : <empty>
                    testFirstXyzWearApp           : <empty>
                    testFixturesAnnotationProcessor         : <empty>
                    testFixturesApi               : <empty>
                    testFixturesCompileOnly       : <empty>
                    testFixturesDebugAnnotationProcessor    : <empty>
                    testFixturesDebugApi          : <empty>
                    testFixturesDebugCompileOnly  : <empty>
                    testFixturesDebugImplementation         : <empty>
                    testFixturesDebugRuntimeOnly  : <empty>
                    testFixturesDebugWearApp      : <empty>
                    testFixturesFirstAbcAnnotationProcessor : <empty>
                    testFixturesFirstAbcApi       : <empty>
                    testFixturesFirstAbcCompileOnly         : <empty>
                    testFixturesFirstAbcImplementation      : <empty>
                    testFixturesFirstAbcRuntimeOnly         : <empty>
                    testFixturesFirstAbcWearApp   : <empty>
                    testFixturesFirstXyzAnnotationProcessor : <empty>
                    testFixturesFirstXyzApi       : <empty>
                    testFixturesFirstXyzCompileOnly         : <empty>
                    testFixturesFirstXyzImplementation      : <empty>
                    testFixturesFirstXyzRuntimeOnly         : <empty>
                    testFixturesFirstXyzWearApp   : <empty>
                    testFixturesImplementation    : <empty>
                    testFixturesReleaseAnnotationProcessor  : <empty>
                    testFixturesReleaseApi        : <empty>
                    testFixturesReleaseCompileOnly          : <empty>
                    testFixturesReleaseImplementation       : <empty>
                    testFixturesReleaseRuntimeOnly          : <empty>
                    testFixturesReleaseWearApp    : <empty>
                    testFixturesRuntimeOnly       : <empty>
                    testFixturesSecondAbcAnnotationProcessor          : <empty>
                    testFixturesSecondAbcApi      : <empty>
                    testFixturesSecondAbcCompileOnly        : <empty>
                    testFixturesSecondAbcImplementation     : <empty>
                    testFixturesSecondAbcRuntimeOnly        : <empty>
                    testFixturesSecondAbcWearApp  : <empty>
                    testFixturesSecondXyzAnnotationProcessor          : <empty>
                    testFixturesSecondXyzApi      : <empty>
                    testFixturesSecondXyzCompileOnly        : <empty>
                    testFixturesSecondXyzImplementation     : <empty>
                    testFixturesSecondXyzRuntimeOnly        : <empty>
                    testFixturesSecondXyzWearApp  : <empty>
                    testFixturesWearApp           : <empty>
                    testImplementation            : <empty>
                    testReleaseAnnotationProcessor          : <empty>
                    testReleaseCompileOnly        : <empty>
                    testReleaseImplementation     : <empty>
                    testReleaseRuntimeOnly        : <empty>
                    testReleaseWearApp            : <empty>
                    testRuntimeOnly               : <empty>
                    testSecondAbcAnnotationProcessor        : <empty>
                    testSecondAbcCompileOnly      : <empty>
                    testSecondAbcImplementation   : <empty>
                    testSecondAbcRuntimeOnly      : <empty>
                    testSecondAbcWearApp          : <empty>
                    testSecondXyzAnnotationProcessor        : <empty>
                    testSecondXyzCompileOnly      : <empty>
                    testSecondXyzImplementation   : <empty>
                    testSecondXyzRuntimeOnly      : <empty>
                    testSecondXyzWearApp          : <empty>
                    testWearApp                   : <empty>
                    wearApp                       : <empty>
        projectDir                    : <ROOT>
        buildDir                      : <ROOT>/build [-]
        buildFile                     : <ROOT>/build.gradle
        externalSystemId              : GRADLE
MODULE                        : MultiFlavor.app
    GradleModuleModel
        agpVersion                    : <AGP_VERSION>
        gradlePath                    : :app
        gradleVersion                 : <GRADLE_VERSION>
        buildFile                     : <ROOT>/app/build.gradle
        buildFilePath                 : <ROOT>/app/build.gradle
        rootFolderPath                : <ROOT>
        hasSafeArgsJava               : false
        hasSafeArgsKotlin             : false
    CurrentVariantReportedVersions
        minSdk
            ApiLevel                      : 16
            ApiString                     : 16
        runtimeMinSdk
            ApiLevel                      : 16
            ApiString                     : 16
        targetSdk
            ApiLevel                      : <SDK_VERSION>
            ApiString                     : <SDK_VERSION>
    RootBuildId                   : <ROOT>
    BuildId                       : <ROOT>
    BuildName                     : :
    ProjectPath                   : :app
    ModelVersion                  : <AGP_VERSION>
    ProjectType                   : PROJECT_TYPE_APP
    CompileTarget                 : android-<SDK_VERSION>
    BuildFolder                   : <ROOT>/app/build [-]
    buildToolsVersion             : <CURRENT_BUILD_TOOLS_VERSION>
    IsBaseSplit                   : true
    GroupId                       : MultiFlavor
    Namespace                     : com.example.multiflavor
    TestNamespace                 : com.example.multiflavor.test
    AaptOptions
        NameSpacing                   : DISABLED
    LintOptions
        IsCheckTestSources            : false
        IsCheckDependencies           : false
        IsAbortOnError                : true
        IsAbsolutePaths               : true
        IsNoLines                     : false
        IsQuiet                       : false
        IsCheckAllWarnings            : false
        IsIgnoreWarnings              : false
        IsWarningsAsErrors            : false
        IsIgnoreTestSources           : false
        IsIgnoreTestFixturesSources   : false
        IsCheckGeneratedSources       : false
        IsCheckReleaseBuilds          : true
        IsExplainIssues               : true
        IsShowAll                     : false
        TextReport                    : false
        HtmlReport                    : true
        XmlReport                     : true
        SarifReport                   : false
    JavaCompileOptions
        Encoding                      : UTF-8
        SourceCompatibility           : 1.8
        TargetCompatibility           : 1.8
        IsCoreLibraryDesugaringEnabled          : false
    AgpFlags
        ApplicationRClassConstantIds  : false
        AestRClassConstantIds         : false
        TransitiveRClasses            : false
        UsesCompose                   : false
        MlModelBindingEnabled         : false
    - basicVariant:               : firstAbcSecondAbcDebug
        applicationId                 : com.example.multiflavor.firstAbc.secondAbc.debug
        testApplicationId             : com.example.multiflavor.firstAbc.secondAbc.debug.test
    - basicVariant:               : firstAbcSecondAbcRelease
        applicationId                 : com.example.multiflavor.firstAbc.secondAbc.release
    FlavorDimensions              : Dim1
    FlavorDimensions              : Dim2
    BootClassPath                 : <ANDROID_SDK>/platforms/android-<SDK_VERSION>/android.jar
    ViewBindingOptions
        Enabled                       : false
    DependenciesInfo
        IncludeInApk                  : true
        IncludeInBundle               : true
    DefaultConfig
        ProductFlavor
            Name                          : main
            ResValues
                string/v_a                    : (string, v_a, default)
            ProguardFiles                 : <ROOT>/app/default.pro [-]
            ManifestPlaceholders
                a                             : default
            ApplicationId                 : com.example.multiflavor
            VersionCode                   : 1
            VersionName                   : 1.0
            TestInstrumentationRunner     : androidx.test.runner.AndroidJUnitRunner
            MinSdkVersion
                ApiLevel                      : 16
                ApiString                     : 16
            TargetSdkVersion
                ApiLevel                      : <SDK_VERSION>
                ApiString                     : <SDK_VERSION>
            VectorDrawables
                UseSupportLibrary             : false
        SourceProvider
            Name                          : main
            Manifest                      : <ROOT>/app/src/main/AndroidManifest.xml
            JavaDirectories               : <ROOT>/app/src/main/java
            KotlinDirectories             : <ROOT>/app/src/main/java
            KotlinDirectories             : <ROOT>/app/src/main/kotlin [-]
            ResourcesDirectories          : <ROOT>/app/src/main/resources [-]
            ResDirectories                : <ROOT>/app/src/main/res
            AssetsDirectories             : <ROOT>/app/src/main/assets [-]
            JniLibsDirectories            : <ROOT>/app/src/main/jniLibs [-]
            ShadersDirectories            : <ROOT>/app/src/main/shaders [-]
            BaselineProfileDirectories    : <ROOT>/app/src/main/baselineProfiles [-]
        ExtraSourceProviders
            ExtraSourceProvider
                ArtifactName                  : _android_test_
                SourceProvider
                    Name                          : androidTest
                    Manifest                      : <ROOT>/app/src/androidTest/AndroidManifest.xml [-]
                    JavaDirectories               : <ROOT>/app/src/androidTest/java
                    KotlinDirectories             : <ROOT>/app/src/androidTest/java
                    KotlinDirectories             : <ROOT>/app/src/androidTest/kotlin [-]
                    ResourcesDirectories          : <ROOT>/app/src/androidTest/resources [-]
                    ResDirectories                : <ROOT>/app/src/androidTest/res [-]
                    AssetsDirectories             : <ROOT>/app/src/androidTest/assets [-]
                    JniLibsDirectories            : <ROOT>/app/src/androidTest/jniLibs [-]
                    ShadersDirectories            : <ROOT>/app/src/androidTest/shaders [-]
                    BaselineProfileDirectories    : <ROOT>/app/src/androidTest/baselineProfiles [-]
            ExtraSourceProvider
                ArtifactName                  : _unit_test_
                SourceProvider
                    Name                          : test
                    Manifest                      : <ROOT>/app/src/test/AndroidManifest.xml [-]
                    JavaDirectories               : <ROOT>/app/src/test/java
                    KotlinDirectories             : <ROOT>/app/src/test/java
                    KotlinDirectories             : <ROOT>/app/src/test/kotlin [-]
                    ResourcesDirectories          : <ROOT>/app/src/test/resources [-]
                    ResDirectories                : <ROOT>/app/src/test/res [-]
                    AssetsDirectories             : <ROOT>/app/src/test/assets [-]
                    JniLibsDirectories            : <ROOT>/app/src/test/jniLibs [-]
                    ShadersDirectories            : <ROOT>/app/src/test/shaders [-]
                    BaselineProfileDirectories    : <ROOT>/app/src/test/baselineProfiles [-]
    BuildTypes
        BuildType
            Name                          : debug
            ApplicationIdSuffix           : .debug
            VersionNameSuffix             : -debug
            ResValues
                string/v_b                    : (string, v_b, debug)
            ProguardFiles                 : <ROOT>/app/debug.pro [-]
            ManifestPlaceholders
                b                             : debug
            IsDebuggable                  : true
            IsJniDebuggable               : false
            IsRenderscriptDebuggable      : false
            RenderscriptOptimLevel        : 3
            IsMinifyEnabled               : false
            IsZipAlignEnabled             : true
        SourceProvider
            Name                          : debug
            Manifest                      : <ROOT>/app/src/debug/AndroidManifest.xml [-]
            JavaDirectories               : <ROOT>/app/src/debug/java [-]
            KotlinDirectories             : <ROOT>/app/src/debug/java [-]
            KotlinDirectories             : <ROOT>/app/src/debug/kotlin [-]
            ResourcesDirectories          : <ROOT>/app/src/debug/resources [-]
            ResDirectories                : <ROOT>/app/src/debug/res [-]
            AssetsDirectories             : <ROOT>/app/src/debug/assets [-]
            JniLibsDirectories            : <ROOT>/app/src/debug/jniLibs [-]
            ShadersDirectories            : <ROOT>/app/src/debug/shaders [-]
            BaselineProfileDirectories    : <ROOT>/app/src/debug/baselineProfiles [-]
        ExtraSourceProviders
            ExtraSourceProvider
                ArtifactName                  : _android_test_
                SourceProvider
                    Name                          : androidTestDebug
                    Manifest                      : <ROOT>/app/src/androidTestDebug/AndroidManifest.xml [-]
                    JavaDirectories               : <ROOT>/app/src/androidTestDebug/java [-]
                    KotlinDirectories             : <ROOT>/app/src/androidTestDebug/java [-]
                    KotlinDirectories             : <ROOT>/app/src/androidTestDebug/kotlin [-]
                    ResourcesDirectories          : <ROOT>/app/src/androidTestDebug/resources [-]
                    ResDirectories                : <ROOT>/app/src/androidTestDebug/res [-]
                    AssetsDirectories             : <ROOT>/app/src/androidTestDebug/assets [-]
                    JniLibsDirectories            : <ROOT>/app/src/androidTestDebug/jniLibs [-]
                    ShadersDirectories            : <ROOT>/app/src/androidTestDebug/shaders [-]
                    BaselineProfileDirectories    : <ROOT>/app/src/androidTestDebug/baselineProfiles [-]
        ExtraSourceProviders
            ExtraSourceProvider
                ArtifactName                  : _unit_test_
                SourceProvider
                    Name                          : testDebug
                    Manifest                      : <ROOT>/app/src/testDebug/AndroidManifest.xml [-]
                    JavaDirectories               : <ROOT>/app/src/testDebug/java [-]
                    KotlinDirectories             : <ROOT>/app/src/testDebug/java [-]
                    KotlinDirectories             : <ROOT>/app/src/testDebug/kotlin [-]
                    ResourcesDirectories          : <ROOT>/app/src/testDebug/resources [-]
                    ResDirectories                : <ROOT>/app/src/testDebug/res [-]
                    AssetsDirectories             : <ROOT>/app/src/testDebug/assets [-]
                    JniLibsDirectories            : <ROOT>/app/src/testDebug/jniLibs [-]
                    ShadersDirectories            : <ROOT>/app/src/testDebug/shaders [-]
                    BaselineProfileDirectories    : <ROOT>/app/src/testDebug/baselineProfiles [-]
        BuildType
            Name                          : release
            ApplicationIdSuffix           : .release
            VersionNameSuffix             : -release
            ResValues
                string/v_b                    : (string, v_b, release)
            ProguardFiles                 : <ROOT>/app/build/intermediates/default_proguard_files/global/proguard-android-optimize.txt-<AGP_VERSION> [-]
            ProguardFiles                 : <ROOT>/app/proguard-rules.pro
            ManifestPlaceholders
                b                             : release
            IsDebuggable                  : false
            IsJniDebuggable               : false
            IsRenderscriptDebuggable      : false
            RenderscriptOptimLevel        : 3
            IsMinifyEnabled               : false
            IsZipAlignEnabled             : true
        SourceProvider
            Name                          : release
            Manifest                      : <ROOT>/app/src/release/AndroidManifest.xml [-]
            JavaDirectories               : <ROOT>/app/src/release/java [-]
            KotlinDirectories             : <ROOT>/app/src/release/java [-]
            KotlinDirectories             : <ROOT>/app/src/release/kotlin [-]
            ResourcesDirectories          : <ROOT>/app/src/release/resources [-]
            ResDirectories                : <ROOT>/app/src/release/res [-]
            AssetsDirectories             : <ROOT>/app/src/release/assets [-]
            JniLibsDirectories            : <ROOT>/app/src/release/jniLibs [-]
            ShadersDirectories            : <ROOT>/app/src/release/shaders [-]
            BaselineProfileDirectories    : <ROOT>/app/src/release/baselineProfiles [-]
        ExtraSourceProviders
            ExtraSourceProvider
                ArtifactName                  : _unit_test_
                SourceProvider
                    Name                          : testRelease
                    Manifest                      : <ROOT>/app/src/testRelease/AndroidManifest.xml [-]
                    JavaDirectories               : <ROOT>/app/src/testRelease/java [-]
                    KotlinDirectories             : <ROOT>/app/src/testRelease/java [-]
                    KotlinDirectories             : <ROOT>/app/src/testRelease/kotlin [-]
                    ResourcesDirectories          : <ROOT>/app/src/testRelease/resources [-]
                    ResDirectories                : <ROOT>/app/src/testRelease/res [-]
                    AssetsDirectories             : <ROOT>/app/src/testRelease/assets [-]
                    JniLibsDirectories            : <ROOT>/app/src/testRelease/jniLibs [-]
                    ShadersDirectories            : <ROOT>/app/src/testRelease/shaders [-]
                    BaselineProfileDirectories    : <ROOT>/app/src/testRelease/baselineProfiles [-]
    ProductFlavors
        ProductFlavor
            Name                          : firstAbc
            ApplicationIdSuffix           : .firstAbc
            VersionNameSuffix             : -firstAbc
            ResValues
                string/v_a                    : (string, v_a, firstAbc)
            ProguardFiles                 : <ROOT>/app/firstAbc.txt [-]
            ManifestPlaceholders
                a                             : firstAbc
            Dimension                     : Dim1
            VersionCode                   : 20
            VectorDrawables
        SourceProvider
            Name                          : firstAbc
            Manifest                      : <ROOT>/app/src/firstAbc/AndroidManifest.xml [-]
            JavaDirectories               : <ROOT>/app/src/firstAbc/java [-]
            KotlinDirectories             : <ROOT>/app/src/firstAbc/java [-]
            KotlinDirectories             : <ROOT>/app/src/firstAbc/kotlin [-]
            ResourcesDirectories          : <ROOT>/app/src/firstAbc/resources [-]
            ResDirectories                : <ROOT>/app/src/firstAbc/res [-]
            AssetsDirectories             : <ROOT>/app/src/firstAbc/assets [-]
            JniLibsDirectories            : <ROOT>/app/src/firstAbc/jniLibs [-]
            ShadersDirectories            : <ROOT>/app/src/firstAbc/shaders [-]
            BaselineProfileDirectories    : <ROOT>/app/src/firstAbc/baselineProfiles [-]
        ExtraSourceProviders
            ExtraSourceProvider
                ArtifactName                  : _android_test_
                SourceProvider
                    Name                          : androidTestFirstAbc
                    Manifest                      : <ROOT>/app/src/androidTestFirstAbc/AndroidManifest.xml [-]
                    JavaDirectories               : <ROOT>/app/src/androidTestFirstAbc/java [-]
                    KotlinDirectories             : <ROOT>/app/src/androidTestFirstAbc/java [-]
                    KotlinDirectories             : <ROOT>/app/src/androidTestFirstAbc/kotlin [-]
                    ResourcesDirectories          : <ROOT>/app/src/androidTestFirstAbc/resources [-]
                    ResDirectories                : <ROOT>/app/src/androidTestFirstAbc/res [-]
                    AssetsDirectories             : <ROOT>/app/src/androidTestFirstAbc/assets [-]
                    JniLibsDirectories            : <ROOT>/app/src/androidTestFirstAbc/jniLibs [-]
                    ShadersDirectories            : <ROOT>/app/src/androidTestFirstAbc/shaders [-]
                    BaselineProfileDirectories    : <ROOT>/app/src/androidTestFirstAbc/baselineProfiles [-]
            ExtraSourceProvider
                ArtifactName                  : _unit_test_
                SourceProvider
                    Name                          : testFirstAbc
                    Manifest                      : <ROOT>/app/src/testFirstAbc/AndroidManifest.xml [-]
                    JavaDirectories               : <ROOT>/app/src/testFirstAbc/java [-]
                    KotlinDirectories             : <ROOT>/app/src/testFirstAbc/java [-]
                    KotlinDirectories             : <ROOT>/app/src/testFirstAbc/kotlin [-]
                    ResourcesDirectories          : <ROOT>/app/src/testFirstAbc/resources [-]
                    ResDirectories                : <ROOT>/app/src/testFirstAbc/res [-]
                    AssetsDirectories             : <ROOT>/app/src/testFirstAbc/assets [-]
                    JniLibsDirectories            : <ROOT>/app/src/testFirstAbc/jniLibs [-]
                    ShadersDirectories            : <ROOT>/app/src/testFirstAbc/shaders [-]
                    BaselineProfileDirectories    : <ROOT>/app/src/testFirstAbc/baselineProfiles [-]
        ProductFlavor
            Name                          : firstXyz
            Dimension                     : Dim1
            VectorDrawables
        SourceProvider
        ExtraSourceProviders
        ProductFlavor
            Name                          : secondAbc
            ApplicationIdSuffix           : .secondAbc
            VersionNameSuffix             : -secondAbc
            ResValues
                string/v_a                    : (string, v_a, secondAbc)
                string/v_b                    : (string, v_b, secondAbc)
                string/v_c                    : (string, v_c, secondAbc)
            ManifestPlaceholders
                a                             : secondAbc
                b                             : secondAbc
                c                             : secondAbc
            Dimension                     : Dim2
            VersionCode                   : 30
            VersionName                   : 1.secondAbc
            VectorDrawables
        SourceProvider
            Name                          : secondAbc
            Manifest                      : <ROOT>/app/src/secondAbc/AndroidManifest.xml [-]
            JavaDirectories               : <ROOT>/app/src/secondAbc/java
            JavaDirectories               : <ROOT>/app/src/secondAbc/java2 [-]
            KotlinDirectories             : <ROOT>/app/src/secondAbc/java
            KotlinDirectories             : <ROOT>/app/src/secondAbc/kotlin [-]
            ResourcesDirectories          : <ROOT>/app/src/secondAbc/resources [-]
            ResDirectories                : <ROOT>/app/src/secondAbc/res [-]
            AssetsDirectories             : <ROOT>/app/src/secondAbc/assets [-]
            JniLibsDirectories            : <ROOT>/app/src/secondAbc/jniLibs [-]
            ShadersDirectories            : <ROOT>/app/src/secondAbc/shaders [-]
            BaselineProfileDirectories    : <ROOT>/app/src/secondAbc/baselineProfiles [-]
        ExtraSourceProviders
            ExtraSourceProvider
                ArtifactName                  : _android_test_
                SourceProvider
                    Name                          : androidTestSecondAbc
                    Manifest                      : <ROOT>/app/src/androidTestSecondAbc/AndroidManifest.xml [-]
                    JavaDirectories               : <ROOT>/app/src/androidTestSecondAbc/java [-]
                    KotlinDirectories             : <ROOT>/app/src/androidTestSecondAbc/java [-]
                    KotlinDirectories             : <ROOT>/app/src/androidTestSecondAbc/kotlin [-]
                    ResourcesDirectories          : <ROOT>/app/src/androidTestSecondAbc/resources [-]
                    ResDirectories                : <ROOT>/app/src/androidTestSecondAbc/res [-]
                    AssetsDirectories             : <ROOT>/app/src/androidTestSecondAbc/assets [-]
                    JniLibsDirectories            : <ROOT>/app/src/androidTestSecondAbc/jniLibs [-]
                    ShadersDirectories            : <ROOT>/app/src/androidTestSecondAbc/shaders [-]
                    BaselineProfileDirectories    : <ROOT>/app/src/androidTestSecondAbc/baselineProfiles [-]
            ExtraSourceProvider
                ArtifactName                  : _unit_test_
                SourceProvider
                    Name                          : testSecondAbc
                    Manifest                      : <ROOT>/app/src/testSecondAbc/AndroidManifest.xml [-]
                    JavaDirectories               : <ROOT>/app/src/testSecondAbc/java
                    KotlinDirectories             : <ROOT>/app/src/testSecondAbc/java
                    KotlinDirectories             : <ROOT>/app/src/testSecondAbc/kotlin [-]
                    ResourcesDirectories          : <ROOT>/app/src/testSecondAbc/resources [-]
                    ResDirectories                : <ROOT>/app/src/testSecondAbc/res [-]
                    AssetsDirectories             : <ROOT>/app/src/testSecondAbc/assets [-]
                    JniLibsDirectories            : <ROOT>/app/src/testSecondAbc/jniLibs [-]
                    ShadersDirectories            : <ROOT>/app/src/testSecondAbc/shaders [-]
                    BaselineProfileDirectories    : <ROOT>/app/src/testSecondAbc/baselineProfiles [-]
        ProductFlavor
            Name                          : secondXyz
            ApplicationIdSuffix           : .secondXyz
            VersionNameSuffix             : -secondXyz
            ResValues
                string/v_b                    : (string, v_b, secondXyz)
            ProguardFiles                 : <ROOT>/app/secondXyz.txt [-]
            ManifestPlaceholders
                b                             : secondXyz
            Dimension                     : Dim2
            VersionCode                   : 31
            VectorDrawables
        SourceProvider
        ExtraSourceProviders
    SigningConfigs
        SigningConfig
            Name                          : debug
            StoreFile                     : debug.keystore
            StorePassword                 : android
            KeyAlias                      : AndroidDebugKey
    VariantBuildInformation
        VariantBuildInformation
            VariantName                   : firstAbcSecondAbcDebug
            BuildTasksAndOutputInformation
                AssembleTaskName              : assembleFirstAbcSecondAbcDebug
                AssembleTaskOutputListingFile : <ROOT>/app/build/intermediates/apk_ide_redirect_file/firstAbcSecondAbcDebug/redirect.txt [-]
                BundleTaskName                : bundleFirstAbcSecondAbcDebug
                BundleTaskOutputListingFile   : <ROOT>/app/build/intermediates/bundle_ide_redirect_file/firstAbcSecondAbcDebug/redirect.txt [-]
                ApkFromBundleTaskName         : extractApksForFirstAbcSecondAbcDebug
                ApkFromBundleTaskOutputListingFile      : <ROOT>/app/build/intermediates/apk_from_bundle_ide_redirect_file/firstAbcSecondAbcDebug/redirect.txt [-]
        VariantBuildInformation
            VariantName                   : firstAbcSecondAbcRelease
            BuildTasksAndOutputInformation
                AssembleTaskName              : assembleFirstAbcSecondAbcRelease
                AssembleTaskOutputListingFile : <ROOT>/app/build/intermediates/apk_ide_redirect_file/firstAbcSecondAbcRelease/redirect.txt [-]
                BundleTaskName                : bundleFirstAbcSecondAbcRelease
                BundleTaskOutputListingFile   : <ROOT>/app/build/intermediates/bundle_ide_redirect_file/firstAbcSecondAbcRelease/redirect.txt [-]
                ApkFromBundleTaskName         : extractApksForFirstAbcSecondAbcRelease
                ApkFromBundleTaskOutputListingFile      : <ROOT>/app/build/intermediates/apk_from_bundle_ide_redirect_file/firstAbcSecondAbcRelease/redirect.txt [-]
    IdeVariants
        IdeVariant
            Name                          : firstAbcSecondAbcDebug
            BuildType                     : debug
            DisplayName                   : firstAbc-secondAbc-debug
            InstantAppCompatible          : false
            MinSdkVersion
                ApiLevel                      : 16
                ApiString                     : 16
            TargetSdkVersion
                ApiLevel                      : <SDK_VERSION>
                ApiString                     : <SDK_VERSION>
            VersionCode                   : 20
            VersionNameSuffix             : -firstAbc-secondAbc-debug
            VersionNameWithSuffix         : 1.secondAbc-firstAbc-secondAbc-debug
            ProguardFiles                 : <ROOT>/app/default.pro [-]
            ProguardFiles                 : <ROOT>/app/debug.pro [-]
            ProductFlavors                : firstAbc
            ProductFlavors                : secondAbc
            TestInstrumentationRunner     : androidx.test.runner.AndroidJUnitRunner
            ManifestPlaceholders
                a                             : firstAbc
                b                             : debug
                c                             : secondAbc
            ResValues
                string/v_a                    : (string, v_a, firstAbc)
                string/v_b                    : (string, v_b, debug)
                string/v_c                    : (string, v_c, secondAbc)
            MainArtifact
                Name                          : MAIN
                CompileTaskName               : compileFirstAbcSecondAbcDebugSources
                AssembleTaskName              : assembleFirstAbcSecondAbcDebug
                IsTestArtifact                : false
                IdeSetupTaskNames             : generateFirstAbcSecondAbcDebugSources
                GeneratedSourceFolders        : <ROOT>/app/build/generated/ap_generated_sources/firstAbcSecondAbcDebug/out [-]
                ClassesFolder                 : <ROOT>/app/build/intermediates/compile_and_runtime_not_namespaced_r_class_jar/firstAbcSecondAbcDebug/R.jar [-]
                ClassesFolder                 : <ROOT>/app/build/intermediates/javac/firstAbcSecondAbcDebug/classes [-]
                VariantSourceProvider
                    Name                          : firstAbcSecondAbcDebug
                    Manifest                      : <ROOT>/app/src/firstAbcSecondAbcDebug/AndroidManifest.xml [-]
                    JavaDirectories               : <ROOT>/app/src/firstAbcSecondAbcDebug/java [-]
                    KotlinDirectories             : <ROOT>/app/src/firstAbcSecondAbcDebug/java [-]
                    KotlinDirectories             : <ROOT>/app/src/firstAbcSecondAbcDebug/kotlin [-]
                    ResourcesDirectories          : <ROOT>/app/src/firstAbcSecondAbcDebug/resources [-]
                    ResDirectories                : <ROOT>/app/src/firstAbcSecondAbcDebug/res [-]
                    AssetsDirectories             : <ROOT>/app/src/firstAbcSecondAbcDebug/assets [-]
                    JniLibsDirectories            : <ROOT>/app/src/firstAbcSecondAbcDebug/jniLibs [-]
                    ShadersDirectories            : <ROOT>/app/src/firstAbcSecondAbcDebug/shaders [-]
                    BaselineProfileDirectories    : <ROOT>/app/src/firstAbcSecondAbcDebug/resources [-]
                MultiFlavorSourceProvider
                    Name                          : firstAbcSecondAbc
                    Manifest                      : <ROOT>/app/src/firstAbcSecondAbc/AndroidManifest.xml [-]
                    JavaDirectories               : <ROOT>/app/src/firstAbcSecondAbc/java
                    JavaDirectories               : <ROOT>/app/src/firstAbcSecondAbc/java2
                    KotlinDirectories             : <ROOT>/app/src/firstAbcSecondAbc/java
                    KotlinDirectories             : <ROOT>/app/src/firstAbcSecondAbc/kotlin [-]
                    ResourcesDirectories          : <ROOT>/app/src/firstAbcSecondAbc/resources [-]
                    ResDirectories                : <ROOT>/app/src/firstAbcSecondAbc/res [-]
                    AssetsDirectories             : <ROOT>/app/src/firstAbcSecondAbc/assets [-]
                    JniLibsDirectories            : <ROOT>/app/src/firstAbcSecondAbc/jniLibs [-]
                    ShadersDirectories            : <ROOT>/app/src/firstAbcSecondAbc/shaders [-]
                    BaselineProfileDirectories    : <ROOT>/app/src/firstAbcSecondAbc/baselineProfiles [-]
                Dependencies
                ApplicationId                 : com.example.multiflavor.firstAbc.secondAbc.debug
                SigningConfigName             : debug
                IsSigned                      : true
                CodeShrinker                  : null
                BuildTasksAndOutputInformation
                    AssembleTaskName              : assembleFirstAbcSecondAbcDebug
                    AssembleTaskOutputListingFile : <ROOT>/app/build/intermediates/apk_ide_redirect_file/firstAbcSecondAbcDebug/redirect.txt [-]
                    BundleTaskName                : bundleFirstAbcSecondAbcDebug
                    BundleTaskOutputListingFile   : <ROOT>/app/build/intermediates/bundle_ide_redirect_file/firstAbcSecondAbcDebug/redirect.txt [-]
                    ApkFromBundleTaskName         : extractApksForFirstAbcSecondAbcDebug
                    ApkFromBundleTaskOutputListingFile      : <ROOT>/app/build/intermediates/apk_from_bundle_ide_redirect_file/firstAbcSecondAbcDebug/redirect.txt [-]
                GeneratedResourceFolders      : <ROOT>/app/build/generated/res/resValues/firstAbcSecondAbc/debug [-]
                DesugaredMethodFiles          : <GRADLE>/caches/transforms-3/xxxxxxxxxxxxxxxxxxxxxxxxxxxxxxxx/transformed/D8BackportedDesugaredMethods.txt
                ModelSyncFile
                    Type                          : BASIC
                    TaskName                      : createFirstAbcSecondAbcDebugVariantModel
                    File                          : <ROOT>/app/build/intermediates/variant_model/firstAbcSecondAbcDebug/variant_model.json [-]
            AndroidTestArtifact
                Name                          : ANDROID_TEST
                CompileTaskName               : compileFirstAbcSecondAbcDebugAndroidTestSources
                AssembleTaskName              : assembleFirstAbcSecondAbcDebugAndroidTest
                IsTestArtifact                : true
                IdeSetupTaskNames             : generateFirstAbcSecondAbcDebugAndroidTestSources
                GeneratedSourceFolders        : <ROOT>/app/build/generated/ap_generated_sources/firstAbcSecondAbcDebugAndroidTest/out [-]
                ClassesFolder                 : <ROOT>/app/build/intermediates/compile_and_runtime_not_namespaced_r_class_jar/firstAbcSecondAbcDebugAndroidTest/R.jar [-]
                ClassesFolder                 : <ROOT>/app/build/intermediates/javac/firstAbcSecondAbcDebugAndroidTest/classes [-]
                VariantSourceProvider
                    Name                          : androidTestFirstAbcSecondAbcDebug
                    Manifest                      : <ROOT>/app/src/androidTestFirstAbcSecondAbcDebug/AndroidManifest.xml [-]
                    JavaDirectories               : <ROOT>/app/src/androidTestFirstAbcSecondAbcDebug/java [-]
                    KotlinDirectories             : <ROOT>/app/src/androidTestFirstAbcSecondAbcDebug/java [-]
                    KotlinDirectories             : <ROOT>/app/src/androidTestFirstAbcSecondAbcDebug/kotlin [-]
                    ResourcesDirectories          : <ROOT>/app/src/androidTestFirstAbcSecondAbcDebug/resources [-]
                    ResDirectories                : <ROOT>/app/src/androidTestFirstAbcSecondAbcDebug/res [-]
                    AssetsDirectories             : <ROOT>/app/src/androidTestFirstAbcSecondAbcDebug/assets [-]
                    JniLibsDirectories            : <ROOT>/app/src/androidTestFirstAbcSecondAbcDebug/jniLibs [-]
                    ShadersDirectories            : <ROOT>/app/src/androidTestFirstAbcSecondAbcDebug/shaders [-]
                    BaselineProfileDirectories    : <ROOT>/app/src/androidTestFirstAbcSecondAbcDebug/resources [-]
                MultiFlavorSourceProvider
                    Name                          : androidTestFirstAbcSecondAbc
                    Manifest                      : <ROOT>/app/src/androidTestFirstAbcSecondAbc/AndroidManifest.xml [-]
                    JavaDirectories               : <ROOT>/app/src/androidTestFirstAbcSecondAbc/java [-]
                    KotlinDirectories             : <ROOT>/app/src/androidTestFirstAbcSecondAbc/java [-]
                    KotlinDirectories             : <ROOT>/app/src/androidTestFirstAbcSecondAbc/kotlin [-]
                    ResourcesDirectories          : <ROOT>/app/src/androidTestFirstAbcSecondAbc/resources [-]
                    ResDirectories                : <ROOT>/app/src/androidTestFirstAbcSecondAbc/res [-]
                    AssetsDirectories             : <ROOT>/app/src/androidTestFirstAbcSecondAbc/assets [-]
                    JniLibsDirectories            : <ROOT>/app/src/androidTestFirstAbcSecondAbc/jniLibs [-]
                    ShadersDirectories            : <ROOT>/app/src/androidTestFirstAbcSecondAbc/shaders [-]
                    BaselineProfileDirectories    : <ROOT>/app/src/androidTestFirstAbcSecondAbc/baselineProfiles [-]
                Dependencies
                    - compileClasspath            : <ROOT>::app@firstAbcSecondAbcDebug (IdeModuleLibraryImpl)
                        buildId                       : <ROOT>
                        projectPath                   : :app
                        sourceSet                     : MAIN
                        variant                       : firstAbcSecondAbcDebug
                ApplicationId                 : com.example.multiflavor.firstAbc.secondAbc.debug.test
                SigningConfigName             : debug
                IsSigned                      : true
                CodeShrinker                  : null
                BuildTasksAndOutputInformation
                    AssembleTaskName              : assembleFirstAbcSecondAbcDebugAndroidTest
                    AssembleTaskOutputListingFile : <ROOT>/app/build/intermediates/apk_ide_redirect_file/firstAbcSecondAbcDebugAndroidTest/redirect.txt [-]
                GeneratedResourceFolders      : <ROOT>/app/build/generated/res/resValues/androidTest/firstAbcSecondAbc/debug [-]
                DesugaredMethodFiles          : <GRADLE>/caches/transforms-3/xxxxxxxxxxxxxxxxxxxxxxxxxxxxxxxx/transformed/D8BackportedDesugaredMethods.txt
                TestOptions
                    AnimationsDisabled            : false
                    Execution                     : HOST
            UnitTestArtifact
                Name                          : UNIT_TEST
                CompileTaskName               : compileFirstAbcSecondAbcDebugUnitTestSources
                AssembleTaskName              : assembleFirstAbcSecondAbcDebugUnitTest
                IsTestArtifact                : true
                IdeSetupTaskNames             : createMockableJar
                GeneratedSourceFolders        : <ROOT>/app/build/generated/ap_generated_sources/firstAbcSecondAbcDebugUnitTest/out [-]
                ClassesFolder                 : <ROOT>/app/build/intermediates/compile_and_runtime_not_namespaced_r_class_jar/firstAbcSecondAbcDebug/R.jar [-]
                ClassesFolder                 : <ROOT>/app/build/intermediates/javac/firstAbcSecondAbcDebugUnitTest/classes [-]
                VariantSourceProvider
                    Name                          : testFirstAbcSecondAbcDebug
                    Manifest                      : <ROOT>/app/src/testFirstAbcSecondAbcDebug/AndroidManifest.xml [-]
                    JavaDirectories               : <ROOT>/app/src/testFirstAbcSecondAbcDebug/java
                    KotlinDirectories             : <ROOT>/app/src/testFirstAbcSecondAbcDebug/java
                    KotlinDirectories             : <ROOT>/app/src/testFirstAbcSecondAbcDebug/kotlin [-]
                    ResourcesDirectories          : <ROOT>/app/src/testFirstAbcSecondAbcDebug/resources [-]
                    AssetsDirectories             : <ROOT>/app/src/testFirstAbcSecondAbcDebug/assets [-]
                    JniLibsDirectories            : <ROOT>/app/src/testFirstAbcSecondAbcDebug/jniLibs [-]
                    ShadersDirectories            : <ROOT>/app/src/testFirstAbcSecondAbcDebug/shaders [-]
                    BaselineProfileDirectories    : <ROOT>/app/src/testFirstAbcSecondAbcDebug/resources [-]
                MultiFlavorSourceProvider
                    Name                          : testFirstAbcSecondAbc
                    Manifest                      : <ROOT>/app/src/testFirstAbcSecondAbc/AndroidManifest.xml [-]
                    JavaDirectories               : <ROOT>/app/src/testFirstAbcSecondAbc/java
                    KotlinDirectories             : <ROOT>/app/src/testFirstAbcSecondAbc/java
                    KotlinDirectories             : <ROOT>/app/src/testFirstAbcSecondAbc/kotlin [-]
                    ResourcesDirectories          : <ROOT>/app/src/testFirstAbcSecondAbc/resources [-]
                    ResDirectories                : <ROOT>/app/src/testFirstAbcSecondAbc/res [-]
                    AssetsDirectories             : <ROOT>/app/src/testFirstAbcSecondAbc/assets [-]
                    JniLibsDirectories            : <ROOT>/app/src/testFirstAbcSecondAbc/jniLibs [-]
                    ShadersDirectories            : <ROOT>/app/src/testFirstAbcSecondAbc/shaders [-]
                    BaselineProfileDirectories    : <ROOT>/app/src/testFirstAbcSecondAbc/baselineProfiles [-]
                Dependencies
                    - compileClasspath            : <ROOT>::app@firstAbcSecondAbcDebug (IdeModuleLibraryImpl) (*seen*)
                    - compileClasspath            : junit:junit:4.12 (IdeJavaLibraryImpl)
                        artifact                      : <M2>/junit/junit/4.12/junit-4.12.jar
                        artifactAddress               : junit:junit:4.12@jar
                    - compileClasspath            : org.hamcrest:hamcrest-core:1.3 (IdeJavaLibraryImpl)
                        artifact                      : <M2>/org/hamcrest/hamcrest-core/1.3/hamcrest-core-1.3.jar
                        artifactAddress               : org.hamcrest:hamcrest-core:1.3@jar
                    - runtimeClasspath            : junit:junit:4.12 (IdeJavaLibraryImpl) (*seen*)
                    - runtimeClasspath            : org.hamcrest:hamcrest-core:1.3 (IdeJavaLibraryImpl) (*seen*)
                    - runtimeClasspath            : <ROOT>::app@firstAbcSecondAbcDebug (IdeModuleLibraryImpl) (*seen*)
                MockablePlatformJar           : <GRADLE>/caches/transforms-3/xxxxxxxxxxxxxxxxxxxxxxxxxxxxxxxx/transformed/android.jar
    externalProject               : :app (DefaultExternalProject) (*seen*)
MODULE                        : MultiFlavor.app.androidTest
MODULE                        : MultiFlavor.app.main
MODULE                        : MultiFlavor.app.unitTest