CompositeBuildMap             : IdeCompositeBuildMapImpl
    - builds                      : <ROOT> (IdeBuildImpl)
        buildName                     : :
    gradleSupportsDirectTaskInvocation      : true
MODULE                        : project
    externalProject               : project (DefaultExternalProject)
        name                          : project
        qName                         : project
        version                       : unspecified
        childProjects
            app                           : :app (DefaultExternalProject)
                name                          : app
                qName                         : :app
                group                         : project
                version                       : unspecified
                sourceCompatibility           : <PROJECT_JDK_FEATURE_LEVEL>
                targetCompatibility           : <PROJECT_JDK_FEATURE_LEVEL>
                projectDir                    : <ROOT>/app
                buildDir                      : <ROOT>/app/build [-]
                buildFile                     : <ROOT>/app/build.gradle
                tasks
                    testDebugUnitTest             : testDebugUnitTest (DefaultExternalTask)
                        qName                         : :app:testDebugUnitTest
                    testReleaseUnitTest           : testReleaseUnitTest (DefaultExternalTask)
                        qName                         : :app:testReleaseUnitTest
                externalSystemId              : GRADLE
                artifactsByConfiguration
                    androidApis                   : <empty>
                    androidJacocoAnt              : <empty>
                    androidJdkImage               : <empty>
                    androidTestAnnotationProcessor          : <empty>
                    androidTestCompileOnly        : <empty>
                    androidTestDebugAnnotationProcessor     : <empty>
                    androidTestDebugCompileOnly   : <empty>
                    androidTestDebugImplementation          : <empty>
                    androidTestDebugRuntimeOnly   : <empty>
                    androidTestDebugWearApp       : <empty>
                    androidTestImplementation     : <empty>
                    androidTestReleaseAnnotationProcessor   : <empty>
                    androidTestReleaseCompileOnly : <empty>
                    androidTestReleaseImplementation        : <empty>
                    androidTestReleaseRuntimeOnly : <empty>
                    androidTestReleaseWearApp     : <empty>
                    androidTestRuntimeOnly        : <empty>
                    androidTestUtil               : <empty>
                    androidTestWearApp            : <empty>
                    annotationProcessor           : <empty>
                    api                           : <empty>
                    archives                      : <empty>
                    compileOnly                   : <empty>
                    coreLibraryDesugaring         : <empty>
                    - debugAabPublication         : <ROOT>/app/build/outputs/bundle/debug/app-debug.aab [-]
                    debugAndroidTestAnnotationProcessorClasspath      : <empty>
                    debugAndroidTestCompileClasspath        : <empty>
                    debugAndroidTestRuntimeClasspath        : <empty>
                    debugAnnotationProcessor      : <empty>
                    debugAnnotationProcessorClasspath       : <empty>
                    debugApi                      : <empty>
                    debugApiElements              : <empty>
                    - debugApkPublication         : <ROOT>/app/build/outputs/apk-zips/debug/apks.zip [-]
                    debugCompileClasspath         : <empty>
                    debugCompileOnly              : <empty>
                    debugImplementation           : <empty>
                    debugReverseMetadataValues    : <empty>
                    debugRuntimeClasspath         : <empty>
                    debugRuntimeElements          : <empty>
                    debugRuntimeOnly              : <empty>
                    debugUnitTestAnnotationProcessorClasspath         : <empty>
                    debugUnitTestCompileClasspath : <empty>
                    debugUnitTestRuntimeClasspath : <empty>
                    debugWearApp                  : <empty>
                    debugWearBundling             : <empty>
                    default                       : <empty>
                    implementation                : <empty>
                    lintChecks                    : <empty>
                    lintPublish                   : <empty>
                    - releaseAabPublication       : <ROOT>/app/build/outputs/bundle/release/app-release.aab [-]
                    releaseAnnotationProcessor    : <empty>
                    releaseAnnotationProcessorClasspath     : <empty>
                    releaseApi                    : <empty>
                    releaseApiElements            : <empty>
                    - releaseApkPublication       : <ROOT>/app/build/outputs/apk-zips/release/apks.zip [-]
                    releaseCompileClasspath       : <empty>
                    releaseCompileOnly            : <empty>
                    releaseImplementation         : <empty>
                    releaseReverseMetadataValues  : <empty>
                    releaseRuntimeClasspath       : <empty>
                    releaseRuntimeElements        : <empty>
                    releaseRuntimeOnly            : <empty>
                    releaseUnitTestAnnotationProcessorClasspath       : <empty>
                    releaseUnitTestCompileClasspath         : <empty>
                    releaseUnitTestRuntimeClasspath         : <empty>
                    releaseWearApp                : <empty>
                    releaseWearBundling           : <empty>
                    runtimeOnly                   : <empty>
                    testAnnotationProcessor       : <empty>
                    testCompileOnly               : <empty>
                    testDebugAnnotationProcessor  : <empty>
                    testDebugCompileOnly          : <empty>
                    testDebugImplementation       : <empty>
                    testDebugRuntimeOnly          : <empty>
                    testDebugWearApp              : <empty>
                    testFixturesAnnotationProcessor         : <empty>
                    testFixturesApi               : <empty>
                    testFixturesCompileOnly       : <empty>
                    testFixturesDebugAnnotationProcessor    : <empty>
                    testFixturesDebugApi          : <empty>
                    testFixturesDebugCompileOnly  : <empty>
                    testFixturesDebugImplementation         : <empty>
                    testFixturesDebugRuntimeOnly  : <empty>
                    testFixturesDebugWearApp      : <empty>
                    testFixturesImplementation    : <empty>
                    testFixturesReleaseAnnotationProcessor  : <empty>
                    testFixturesReleaseApi        : <empty>
                    testFixturesReleaseCompileOnly          : <empty>
                    testFixturesReleaseImplementation       : <empty>
                    testFixturesReleaseRuntimeOnly          : <empty>
                    testFixturesReleaseWearApp    : <empty>
                    testFixturesRuntimeOnly       : <empty>
                    testFixturesWearApp           : <empty>
                    testImplementation            : <empty>
                    testReleaseAnnotationProcessor          : <empty>
                    testReleaseCompileOnly        : <empty>
                    testReleaseImplementation     : <empty>
                    testReleaseRuntimeOnly        : <empty>
                    testReleaseWearApp            : <empty>
                    testRuntimeOnly               : <empty>
                    testWearApp                   : <empty>
                    wearApp                       : <empty>
            library                       : :library (DefaultExternalProject)
                name                          : library
                qName                         : :library
                group                         : project
                version                       : unspecified
                sourceCompatibility           : <PROJECT_JDK_FEATURE_LEVEL>
                targetCompatibility           : <PROJECT_JDK_FEATURE_LEVEL>
                projectDir                    : <ROOT>/library
                buildDir                      : <ROOT>/library/build [-]
                buildFile                     : <ROOT>/library/build.gradle
                tasks
                    testDebugUnitTest             : testDebugUnitTest (DefaultExternalTask)
                        qName                         : :library:testDebugUnitTest
                    testReleaseUnitTest           : testReleaseUnitTest (DefaultExternalTask)
                        qName                         : :library:testReleaseUnitTest
                externalSystemId              : GRADLE
                artifactsByConfiguration
                    androidApis                   : <empty>
                    androidJacocoAnt              : <empty>
                    androidJdkImage               : <empty>
                    androidTestAnnotationProcessor          : <empty>
                    androidTestCompileOnly        : <empty>
                    androidTestDebugAnnotationProcessor     : <empty>
                    androidTestDebugCompileOnly   : <empty>
                    androidTestDebugImplementation          : <empty>
                    androidTestDebugRuntimeOnly   : <empty>
                    androidTestDebugWearApp       : <empty>
                    androidTestImplementation     : <empty>
                    androidTestReleaseAnnotationProcessor   : <empty>
                    androidTestReleaseCompileOnly : <empty>
                    androidTestReleaseImplementation        : <empty>
                    androidTestReleaseRuntimeOnly : <empty>
                    androidTestReleaseWearApp     : <empty>
                    androidTestRuntimeOnly        : <empty>
                    androidTestUtil               : <empty>
                    androidTestWearApp            : <empty>
                    annotationProcessor           : <empty>
                    api                           : <empty>
                    archives                      : <empty>
                    compileOnly                   : <empty>
                    coreLibraryDesugaring         : <empty>
                    debugAndroidTestAnnotationProcessorClasspath      : <empty>
                    debugAndroidTestCompileClasspath        : <empty>
                    debugAndroidTestRuntimeClasspath        : <empty>
                    debugAnnotationProcessor      : <empty>
                    debugAnnotationProcessorClasspath       : <empty>
                    debugApi                      : <empty>
                    debugApiElements              : <empty>
                    debugCompileClasspath         : <empty>
                    debugCompileOnly              : <empty>
                    debugImplementation           : <empty>
                    debugRuntimeClasspath         : <empty>
                    debugRuntimeElements          : <empty>
                    debugRuntimeOnly              : <empty>
                    debugUnitTestAnnotationProcessorClasspath         : <empty>
                    debugUnitTestCompileClasspath : <empty>
                    debugUnitTestRuntimeClasspath : <empty>
                    - debugVariantAllApiPublication         : <ROOT>/library/build/outputs/aar/library-debug.aar [-]
                    - debugVariantAllRuntimePublication     : <ROOT>/library/build/outputs/aar/library-debug.aar [-]
                    - debugVariantDebugApiPublication       : <ROOT>/library/build/outputs/aar/library-debug.aar [-]
                    - debugVariantDebugRuntimePublication   : <ROOT>/library/build/outputs/aar/library-debug.aar [-]
                    debugWearApp                  : <empty>
                    default                       : <empty>
                    implementation                : <empty>
                    lintChecks                    : <empty>
                    lintPublish                   : <empty>
                    releaseAnnotationProcessor    : <empty>
                    releaseAnnotationProcessorClasspath     : <empty>
                    releaseApi                    : <empty>
                    releaseApiElements            : <empty>
                    releaseCompileClasspath       : <empty>
                    releaseCompileOnly            : <empty>
                    releaseImplementation         : <empty>
                    releaseRuntimeClasspath       : <empty>
                    releaseRuntimeElements        : <empty>
                    releaseRuntimeOnly            : <empty>
                    releaseUnitTestAnnotationProcessorClasspath       : <empty>
                    releaseUnitTestCompileClasspath         : <empty>
                    releaseUnitTestRuntimeClasspath         : <empty>
                    - releaseVariantAllApiPublication       : <ROOT>/library/build/outputs/aar/library-release.aar [-]
                    - releaseVariantAllRuntimePublication   : <ROOT>/library/build/outputs/aar/library-release.aar [-]
                    - releaseVariantReleaseApiPublication   : <ROOT>/library/build/outputs/aar/library-release.aar [-]
                    - releaseVariantReleaseRuntimePublication         : <ROOT>/library/build/outputs/aar/library-release.aar [-]
                    releaseWearApp                : <empty>
                    runtimeOnly                   : <empty>
                    testAnnotationProcessor       : <empty>
                    testCompileOnly               : <empty>
                    testDebugAnnotationProcessor  : <empty>
                    testDebugCompileOnly          : <empty>
                    testDebugImplementation       : <empty>
                    testDebugRuntimeOnly          : <empty>
                    testDebugWearApp              : <empty>
                    testFixturesAnnotationProcessor         : <empty>
                    testFixturesApi               : <empty>
                    testFixturesCompileOnly       : <empty>
                    testFixturesDebugAnnotationProcessor    : <empty>
                    testFixturesDebugApi          : <empty>
                    testFixturesDebugCompileOnly  : <empty>
                    testFixturesDebugImplementation         : <empty>
                    testFixturesDebugRuntimeOnly  : <empty>
                    testFixturesDebugWearApp      : <empty>
                    testFixturesImplementation    : <empty>
                    testFixturesReleaseAnnotationProcessor  : <empty>
                    testFixturesReleaseApi        : <empty>
                    testFixturesReleaseCompileOnly          : <empty>
                    testFixturesReleaseImplementation       : <empty>
                    testFixturesReleaseRuntimeOnly          : <empty>
                    testFixturesReleaseWearApp    : <empty>
                    testFixturesRuntimeOnly       : <empty>
                    testFixturesWearApp           : <empty>
                    testImplementation            : <empty>
                    testReleaseAnnotationProcessor          : <empty>
                    testReleaseCompileOnly        : <empty>
                    testReleaseImplementation     : <empty>
                    testReleaseRuntimeOnly        : <empty>
                    testReleaseWearApp            : <empty>
                    testRuntimeOnly               : <empty>
                    testWearApp                   : <empty>
                    wearApp                       : <empty>
            library-debug                 : :library-debug (DefaultExternalProject)
                name                          : library-debug
                qName                         : :library-debug
                group                         : project
                version                       : unspecified
                projectDir                    : <ROOT>/library-debug
                buildDir                      : <ROOT>/library-debug/build
                buildFile                     : <ROOT>/library-debug/build.gradle
                externalSystemId              : GRADLE
                artifactsByConfiguration
                    - default                     : <ROOT>/library-debug/library-debug.aar
        projectDir                    : <ROOT>
        buildDir                      : <ROOT>/build [-]
        buildFile                     : <ROOT>/build.gradle
        externalSystemId              : GRADLE
MODULE                        : project.app
    GradleModuleModel
        agpVersion                    : 7.4.0-alpha09
        gradlePath                    : :app
        gradleVersion                 : 7.5
        buildFile                     : <ROOT>/app/build.gradle
        buildFilePath                 : <ROOT>/app/build.gradle
        rootFolderPath                : <ROOT>
        hasSafeArgsJava               : false
        hasSafeArgsKotlin             : false
    CurrentVariantReportedVersions
        minSdk
            ApiLevel                      : 22
            ApiString                     : 22
        runtimeMinSdk
            ApiLevel                      : 22
            ApiString                     : 22
        targetSdk
            ApiLevel                      : <SDK_VERSION>
            ApiString                     : <SDK_VERSION>
    RootBuildId                   : <ROOT>
    BuildId                       : <ROOT>
    BuildName                     : :
    ProjectPath                   : :app
    ModelVersion                  : 7.4.0-alpha09
    ProjectType                   : PROJECT_TYPE_APP
    CompileTarget                 : android-<SDK_VERSION>
    BuildFolder                   : <ROOT>/app/build [-]
    buildToolsVersion             : 30.0.3
    IsBaseSplit                   : true
    GroupId                       : project
    Namespace                     : com.android.test.localaarsasmodules
    TestNamespace                 : com.android.test.localaarsasmodules.test
    AaptOptions
        NameSpacing                   : DISABLED
    LintOptions
        IsCheckTestSources            : false
        IsCheckDependencies           : false
        IsAbortOnError                : true
        IsAbsolutePaths               : true
        IsNoLines                     : false
        IsQuiet                       : false
        IsCheckAllWarnings            : false
        IsIgnoreWarnings              : false
        IsWarningsAsErrors            : false
        IsIgnoreTestSources           : false
        IsIgnoreTestFixturesSources   : false
        IsCheckGeneratedSources       : false
        IsCheckReleaseBuilds          : true
        IsExplainIssues               : true
        IsShowAll                     : false
        TextReport                    : false
        HtmlReport                    : true
        XmlReport                     : true
        SarifReport                   : false
    JavaCompileOptions
        Encoding                      : UTF-8
        SourceCompatibility           : 1.8
        TargetCompatibility           : 1.8
        IsCoreLibraryDesugaringEnabled          : false
    AgpFlags
        ApplicationRClassConstantIds  : true
        AestRClassConstantIds         : true
        TransitiveRClasses            : true
        UsesCompose                   : false
        MlModelBindingEnabled         : false
    - basicVariant:               : debug
        applicationId                 : com.android.test.localaarsasmodules
        testApplicationId             : com.android.test.localaarsasmodules.test
    - basicVariant:               : release
        applicationId                 : com.android.test.localaarsasmodules
    BootClassPath                 : <ANDROID_SDK>/platforms/android-<SDK_VERSION>/android.jar
    ViewBindingOptions
        Enabled                       : false
    DependenciesInfo
        IncludeInApk                  : true
        IncludeInBundle               : true
    DefaultConfig
        ProductFlavor
            Name                          : main
            ApplicationId                 : com.android.test.localaarsasmodules
            VersionCode                   : 1
            VersionName                   : 1.0
            MinSdkVersion
                ApiLevel                      : 22
                ApiString                     : 22
            TargetSdkVersion
                ApiLevel                      : <SDK_VERSION>
                ApiString                     : <SDK_VERSION>
            VectorDrawables
                UseSupportLibrary             : false
        SourceProvider
            Name                          : main
            Manifest                      : <ROOT>/app/src/main/AndroidManifest.xml
            JavaDirectories               : <ROOT>/app/src/main/java
            KotlinDirectories             : <ROOT>/app/src/main/java
            KotlinDirectories             : <ROOT>/app/src/main/kotlin [-]
            ResourcesDirectories          : <ROOT>/app/src/main/resources [-]
            AidlDirectories               : <ROOT>/app/src/main/aidl [-]
            RenderscriptDirectories       : <ROOT>/app/src/main/rs [-]
            ResDirectories                : <ROOT>/app/src/main/res
            AssetsDirectories             : <ROOT>/app/src/main/assets [-]
            JniLibsDirectories            : <ROOT>/app/src/main/jniLibs [-]
            ShadersDirectories            : <ROOT>/app/src/main/shaders [-]
        ExtraSourceProviders
            ExtraSourceProvider
                ArtifactName                  : _android_test_
                SourceProvider
                    Name                          : androidTest
                    Manifest                      : <ROOT>/app/src/androidTest/AndroidManifest.xml [-]
                    JavaDirectories               : <ROOT>/app/src/androidTest/java
                    KotlinDirectories             : <ROOT>/app/src/androidTest/java
                    KotlinDirectories             : <ROOT>/app/src/androidTest/kotlin [-]
                    ResourcesDirectories          : <ROOT>/app/src/androidTest/resources [-]
                    AidlDirectories               : <ROOT>/app/src/androidTest/aidl [-]
                    RenderscriptDirectories       : <ROOT>/app/src/androidTest/rs [-]
                    ResDirectories                : <ROOT>/app/src/androidTest/res [-]
                    AssetsDirectories             : <ROOT>/app/src/androidTest/assets [-]
                    JniLibsDirectories            : <ROOT>/app/src/androidTest/jniLibs [-]
                    ShadersDirectories            : <ROOT>/app/src/androidTest/shaders [-]
            ExtraSourceProvider
                ArtifactName                  : _unit_test_
                SourceProvider
                    Name                          : test
                    Manifest                      : <ROOT>/app/src/test/AndroidManifest.xml [-]
                    JavaDirectories               : <ROOT>/app/src/test/java [-]
                    KotlinDirectories             : <ROOT>/app/src/test/java [-]
                    KotlinDirectories             : <ROOT>/app/src/test/kotlin [-]
                    ResourcesDirectories          : <ROOT>/app/src/test/resources [-]
                    AidlDirectories               : <ROOT>/app/src/test/aidl [-]
                    RenderscriptDirectories       : <ROOT>/app/src/test/rs [-]
                    ResDirectories                : <ROOT>/app/src/test/res [-]
                    AssetsDirectories             : <ROOT>/app/src/test/assets [-]
                    JniLibsDirectories            : <ROOT>/app/src/test/jniLibs [-]
                    ShadersDirectories            : <ROOT>/app/src/test/shaders [-]
    BuildTypes
        BuildType
            Name                          : debug
            IsDebuggable                  : true
            IsJniDebuggable               : false
            IsRenderscriptDebuggable      : false
            RenderscriptOptimLevel        : 3
            IsMinifyEnabled               : false
            IsZipAlignEnabled             : true
        SourceProvider
            Name                          : debug
            Manifest                      : <ROOT>/app/src/debug/AndroidManifest.xml [-]
            JavaDirectories               : <ROOT>/app/src/debug/java [-]
            KotlinDirectories             : <ROOT>/app/src/debug/java [-]
            KotlinDirectories             : <ROOT>/app/src/debug/kotlin [-]
            ResourcesDirectories          : <ROOT>/app/src/debug/resources [-]
            AidlDirectories               : <ROOT>/app/src/debug/aidl [-]
            RenderscriptDirectories       : <ROOT>/app/src/debug/rs [-]
            ResDirectories                : <ROOT>/app/src/debug/res [-]
            AssetsDirectories             : <ROOT>/app/src/debug/assets [-]
            JniLibsDirectories            : <ROOT>/app/src/debug/jniLibs [-]
            ShadersDirectories            : <ROOT>/app/src/debug/shaders [-]
        ExtraSourceProviders
            ExtraSourceProvider
                ArtifactName                  : _android_test_
                SourceProvider
                    Name                          : androidTestDebug
                    Manifest                      : <ROOT>/app/src/androidTestDebug/AndroidManifest.xml [-]
                    JavaDirectories               : <ROOT>/app/src/androidTestDebug/java [-]
                    KotlinDirectories             : <ROOT>/app/src/androidTestDebug/java [-]
                    KotlinDirectories             : <ROOT>/app/src/androidTestDebug/kotlin [-]
                    ResourcesDirectories          : <ROOT>/app/src/androidTestDebug/resources [-]
                    AidlDirectories               : <ROOT>/app/src/androidTestDebug/aidl [-]
                    RenderscriptDirectories       : <ROOT>/app/src/androidTestDebug/rs [-]
                    ResDirectories                : <ROOT>/app/src/androidTestDebug/res [-]
                    AssetsDirectories             : <ROOT>/app/src/androidTestDebug/assets [-]
                    JniLibsDirectories            : <ROOT>/app/src/androidTestDebug/jniLibs [-]
                    ShadersDirectories            : <ROOT>/app/src/androidTestDebug/shaders [-]
        ExtraSourceProviders
            ExtraSourceProvider
                ArtifactName                  : _unit_test_
                SourceProvider
                    Name                          : testDebug
                    Manifest                      : <ROOT>/app/src/testDebug/AndroidManifest.xml [-]
                    JavaDirectories               : <ROOT>/app/src/testDebug/java [-]
                    KotlinDirectories             : <ROOT>/app/src/testDebug/java [-]
                    KotlinDirectories             : <ROOT>/app/src/testDebug/kotlin [-]
                    ResourcesDirectories          : <ROOT>/app/src/testDebug/resources [-]
                    AidlDirectories               : <ROOT>/app/src/testDebug/aidl [-]
                    RenderscriptDirectories       : <ROOT>/app/src/testDebug/rs [-]
                    ResDirectories                : <ROOT>/app/src/testDebug/res [-]
                    AssetsDirectories             : <ROOT>/app/src/testDebug/assets [-]
                    JniLibsDirectories            : <ROOT>/app/src/testDebug/jniLibs [-]
                    ShadersDirectories            : <ROOT>/app/src/testDebug/shaders [-]
        BuildType
            Name                          : release
            ProguardFiles                 : <ROOT>/app/build/intermediates/default_proguard_files/global/proguard-android.txt-7.4.0-alpha09 [-]
            ProguardFiles                 : <ROOT>/app/proguard-rules.pro
            IsDebuggable                  : false
            IsJniDebuggable               : false
            IsRenderscriptDebuggable      : false
            RenderscriptOptimLevel        : 3
            IsMinifyEnabled               : false
            IsZipAlignEnabled             : true
        SourceProvider
            Name                          : release
            Manifest                      : <ROOT>/app/src/release/AndroidManifest.xml [-]
            JavaDirectories               : <ROOT>/app/src/release/java [-]
            KotlinDirectories             : <ROOT>/app/src/release/java [-]
            KotlinDirectories             : <ROOT>/app/src/release/kotlin [-]
            ResourcesDirectories          : <ROOT>/app/src/release/resources [-]
            AidlDirectories               : <ROOT>/app/src/release/aidl [-]
            RenderscriptDirectories       : <ROOT>/app/src/release/rs [-]
            ResDirectories                : <ROOT>/app/src/release/res [-]
            AssetsDirectories             : <ROOT>/app/src/release/assets [-]
            JniLibsDirectories            : <ROOT>/app/src/release/jniLibs [-]
            ShadersDirectories            : <ROOT>/app/src/release/shaders [-]
        ExtraSourceProviders
            ExtraSourceProvider
                ArtifactName                  : _unit_test_
                SourceProvider
                    Name                          : testRelease
                    Manifest                      : <ROOT>/app/src/testRelease/AndroidManifest.xml [-]
                    JavaDirectories               : <ROOT>/app/src/testRelease/java [-]
                    KotlinDirectories             : <ROOT>/app/src/testRelease/java [-]
                    KotlinDirectories             : <ROOT>/app/src/testRelease/kotlin [-]
                    ResourcesDirectories          : <ROOT>/app/src/testRelease/resources [-]
                    AidlDirectories               : <ROOT>/app/src/testRelease/aidl [-]
                    RenderscriptDirectories       : <ROOT>/app/src/testRelease/rs [-]
                    ResDirectories                : <ROOT>/app/src/testRelease/res [-]
                    AssetsDirectories             : <ROOT>/app/src/testRelease/assets [-]
                    JniLibsDirectories            : <ROOT>/app/src/testRelease/jniLibs [-]
                    ShadersDirectories            : <ROOT>/app/src/testRelease/shaders [-]
    SigningConfigs
        SigningConfig
            Name                          : debug
            StoreFile                     : debug.keystore
            StorePassword                 : android
            KeyAlias                      : AndroidDebugKey
    VariantBuildInformation
        VariantBuildInformation
            VariantName                   : debug
            BuildTasksAndOutputInformation
                AssembleTaskName              : assembleDebug
                AssembleTaskOutputListingFile : <ROOT>/app/build/intermediates/apk_ide_redirect_file/debug/redirect.txt [-]
                BundleTaskName                : bundleDebug
                BundleTaskOutputListingFile   : <ROOT>/app/build/intermediates/bundle_ide_redirect_file/debug/redirect.txt [-]
                ApkFromBundleTaskName         : extractApksForDebug
                ApkFromBundleTaskOutputListingFile      : <ROOT>/app/build/intermediates/apk_from_bundle_ide_redirect_file/debug/redirect.txt [-]
        VariantBuildInformation
            VariantName                   : release
            BuildTasksAndOutputInformation
                AssembleTaskName              : assembleRelease
                AssembleTaskOutputListingFile : <ROOT>/app/build/intermediates/apk_ide_redirect_file/release/redirect.txt [-]
                BundleTaskName                : bundleRelease
                BundleTaskOutputListingFile   : <ROOT>/app/build/intermediates/bundle_ide_redirect_file/release/redirect.txt [-]
                ApkFromBundleTaskName         : extractApksForRelease
                ApkFromBundleTaskOutputListingFile      : <ROOT>/app/build/intermediates/apk_from_bundle_ide_redirect_file/release/redirect.txt [-]
    IdeVariants
        IdeVariant
            Name                          : debug
            BuildType                     : debug
            DisplayName                   : debug
            InstantAppCompatible          : false
            MinSdkVersion
                ApiLevel                      : 22
                ApiString                     : 22
            TargetSdkVersion
                ApiLevel                      : <SDK_VERSION>
                ApiString                     : <SDK_VERSION>
            VersionCode                   : 1
            VersionNameWithSuffix         : 1.0
            MainArtifact
                Name                          : MAIN
                CompileTaskName               : compileDebugSources
                AssembleTaskName              : assembleDebug
                IsTestArtifact                : false
                IdeSetupTaskNames             : generateDebugSources
                GeneratedSourceFolders        : <ROOT>/app/build/generated/aidl_source_output_dir/debug/out [-]
                GeneratedSourceFolders        : <ROOT>/app/build/generated/ap_generated_sources/debug/out [-]
                GeneratedSourceFolders        : <ROOT>/app/build/generated/renderscript_source_output_dir/debug/out [-]
                GeneratedSourceFolders        : <ROOT>/app/build/generated/source/buildConfig/debug [-]
                ClassesFolder                 : <ROOT>/app/build/intermediates/compile_and_runtime_not_namespaced_r_class_jar/debug/R.jar [-]
                ClassesFolder                 : <ROOT>/app/build/intermediates/javac/debug/classes [-]
                Dependencies
                    - compileClasspath            : __wrapped_aars__::library-debug:unspecified@aar (IdeAndroidLibraryImpl)
                        aidlFolder                    : <ROOT>/library-debug/build/.transforms/xxxxxxxxxxxxxxxxxxxxxxxxxxxxxxxx/transformed/library-debug/aidl [-]
                        artifact                      : <ROOT>/library-debug/library-debug.aar
                        artifactAddress               : __wrapped_aars__::library-debug:unspecified@aar
                        assetsFolder                  : <ROOT>/library-debug/build/.transforms/xxxxxxxxxxxxxxxxxxxxxxxxxxxxxxxx/transformed/library-debug/assets
                        - compileJarFiles             : <ROOT>/library-debug/build/.transforms/xxxxxxxxxxxxxxxxxxxxxxxxxxxxxxxx/transformed/library-debug/jars/classes.jar
                        externalAnnotations           : <ROOT>/library-debug/build/.transforms/xxxxxxxxxxxxxxxxxxxxxxxxxxxxxxxx/transformed/library-debug/annotations.zip [-]
                        folder                        : <ROOT>/library-debug/build/.transforms/xxxxxxxxxxxxxxxxxxxxxxxxxxxxxxxx/transformed/library-debug
                        jniFolder                     : <ROOT>/library-debug/build/.transforms/xxxxxxxxxxxxxxxxxxxxxxxxxxxxxxxx/transformed/library-debug/jni [-]
                        manifest                      : <ROOT>/library-debug/build/.transforms/xxxxxxxxxxxxxxxxxxxxxxxxxxxxxxxx/transformed/library-debug/AndroidManifest.xml
                        proguardRules                 : <ROOT>/library-debug/build/.transforms/xxxxxxxxxxxxxxxxxxxxxxxxxxxxxxxx/transformed/library-debug/proguard.txt [-]
                        publicResources               : <ROOT>/library-debug/build/.transforms/xxxxxxxxxxxxxxxxxxxxxxxxxxxxxxxx/transformed/library-debug/public.txt [-]
                        renderscriptFolder            : <ROOT>/library-debug/build/.transforms/xxxxxxxxxxxxxxxxxxxxxxxxxxxxxxxx/transformed/library-debug/rs [-]
                        resFolder                     : <ROOT>/library-debug/build/.transforms/xxxxxxxxxxxxxxxxxxxxxxxxxxxxxxxx/transformed/library-debug/res
                        resStaticLibrary              : <ROOT>/library-debug/build/.transforms/xxxxxxxxxxxxxxxxxxxxxxxxxxxxxxxx/transformed/library-debug/res.apk [-]
                        - runtimeJarFiles             : <ROOT>/library-debug/build/.transforms/xxxxxxxxxxxxxxxxxxxxxxxxxxxxxxxx/transformed/library-debug/jars/classes.jar
                        symbolFile                    : <ROOT>/library-debug/build/.transforms/xxxxxxxxxxxxxxxxxxxxxxxxxxxxxxxx/transformed/library-debug/R.txt
                    - runtimeClasspath            : __wrapped_aars__::library-debug:unspecified@aar (IdeAndroidLibraryImpl) (*seen*)
                ApplicationId                 : com.android.test.localaarsasmodules
                SigningConfigName             : debug
                IsSigned                      : true
                CodeShrinker                  : null
                BuildTasksAndOutputInformation
                    AssembleTaskName              : assembleDebug
                    AssembleTaskOutputListingFile : <ROOT>/app/build/intermediates/apk_ide_redirect_file/debug/redirect.txt [-]
                    BundleTaskName                : bundleDebug
                    BundleTaskOutputListingFile   : <ROOT>/app/build/intermediates/bundle_ide_redirect_file/debug/redirect.txt [-]
                    ApkFromBundleTaskName         : extractApksForDebug
                    ApkFromBundleTaskOutputListingFile      : <ROOT>/app/build/intermediates/apk_from_bundle_ide_redirect_file/debug/redirect.txt [-]
                GeneratedResourceFolders      : <ROOT>/app/build/generated/res/rs/debug [-]
                GeneratedResourceFolders      : <ROOT>/app/build/generated/res/resValues/debug [-]
                DesugaredMethodFiles          : <GRADLE>/caches/transforms-3/xxxxxxxxxxxxxxxxxxxxxxxxxxxxxxxx/transformed/D8BackportedDesugaredMethods.txt
                ModelSyncFile
                    Type                          : BASIC
                    TaskName                      : createDebugVariantModel
                    File                          : <ROOT>/app/build/intermediates/variant_model/debug/variant_model.json [-]
            AndroidTestArtifact
                Name                          : ANDROID_TEST
                CompileTaskName               : compileDebugAndroidTestSources
                AssembleTaskName              : assembleDebugAndroidTest
                IsTestArtifact                : true
                IdeSetupTaskNames             : generateDebugAndroidTestSources
                GeneratedSourceFolders        : <ROOT>/app/build/generated/aidl_source_output_dir/debugAndroidTest/out [-]
                GeneratedSourceFolders        : <ROOT>/app/build/generated/ap_generated_sources/debugAndroidTest/out [-]
                GeneratedSourceFolders        : <ROOT>/app/build/generated/renderscript_source_output_dir/debugAndroidTest/out [-]
                GeneratedSourceFolders        : <ROOT>/app/build/generated/source/buildConfig/androidTest/debug [-]
                ClassesFolder                 : <ROOT>/app/build/intermediates/compile_and_runtime_not_namespaced_r_class_jar/debugAndroidTest/R.jar [-]
                ClassesFolder                 : <ROOT>/app/build/intermediates/javac/debugAndroidTest/classes [-]
                Dependencies
                    - compileClasspath            : <ROOT>::app@debug (IdeModuleLibraryImpl)
                        buildId                       : <ROOT>
                        projectPath                   : :app
                        sourceSet                     : MAIN
                        variant                       : debug
                    - compileClasspath            : __wrapped_aars__::library-debug:unspecified@aar (IdeAndroidLibraryImpl) (*seen*)
                ProvidedDependencies
                    - provided                    : __wrapped_aars__::library-debug:unspecified@aar
                ApplicationId                 : com.android.test.localaarsasmodules.test
                SigningConfigName             : debug
                IsSigned                      : true
                CodeShrinker                  : null
                BuildTasksAndOutputInformation
                    AssembleTaskName              : assembleDebugAndroidTest
                    AssembleTaskOutputListingFile : <ROOT>/app/build/intermediates/apk_ide_redirect_file/debugAndroidTest/redirect.txt [-]
                GeneratedResourceFolders      : <ROOT>/app/build/generated/res/rs/androidTest/debug [-]
                GeneratedResourceFolders      : <ROOT>/app/build/generated/res/resValues/androidTest/debug [-]
                DesugaredMethodFiles          : <GRADLE>/caches/transforms-3/xxxxxxxxxxxxxxxxxxxxxxxxxxxxxxxx/transformed/D8BackportedDesugaredMethods.txt
                TestOptions
                    AnimationsDisabled            : false
                    Execution                     : HOST
            UnitTestArtifact
                Name                          : UNIT_TEST
                CompileTaskName               : compileDebugUnitTestSources
                AssembleTaskName              : assembleDebugUnitTest
                IsTestArtifact                : true
                IdeSetupTaskNames             : createMockableJar
                GeneratedSourceFolders        : <ROOT>/app/build/generated/ap_generated_sources/debugUnitTest/out [-]
                ClassesFolder                 : <ROOT>/app/build/intermediates/compile_and_runtime_not_namespaced_r_class_jar/debug/R.jar [-]
                ClassesFolder                 : <ROOT>/app/build/intermediates/javac/debugUnitTest/classes [-]
                Dependencies
                    - compileClasspath            : <ROOT>::app@debug (IdeModuleLibraryImpl) (*seen*)
                    - compileClasspath            : __wrapped_aars__::library-debug:unspecified@aar (IdeAndroidLibraryImpl) (*seen*)
                    - runtimeClasspath            : __wrapped_aars__::library-debug:unspecified@aar (IdeAndroidLibraryImpl) (*seen*)
                    - runtimeClasspath            : <ROOT>::app@debug (IdeModuleLibraryImpl) (*seen*)
                MockablePlatformJar           : <GRADLE>/caches/transforms-3/xxxxxxxxxxxxxxxxxxxxxxxxxxxxxxxx/transformed/android.jar
    externalProject               : :app (DefaultExternalProject) (*seen*)
MODULE                        : project.app.androidTest
MODULE                        : project.app.main
MODULE                        : project.app.unitTest
MODULE                        : project.library
    GradleModuleModel
        agpVersion                    : 7.4.0-alpha09
        gradlePath                    : :library
        gradleVersion                 : 7.5
        buildFile                     : <ROOT>/library/build.gradle
        buildFilePath                 : <ROOT>/library/build.gradle
        rootFolderPath                : <ROOT>
        hasSafeArgsJava               : false
        hasSafeArgsKotlin             : false
    CurrentVariantReportedVersions
        minSdk
            ApiLevel                      : 22
            ApiString                     : 22
        runtimeMinSdk
            ApiLevel                      : 22
            ApiString                     : 22
        targetSdk
            ApiLevel                      : <SDK_VERSION>
            ApiString                     : <SDK_VERSION>
    RootBuildId                   : <ROOT>
    BuildId                       : <ROOT>
    BuildName                     : :
    ProjectPath                   : :library
    ModelVersion                  : 7.4.0-alpha09
    ProjectType                   : PROJECT_TYPE_LIBRARY
    CompileTarget                 : android-<SDK_VERSION>
    BuildFolder                   : <ROOT>/library/build [-]
    buildToolsVersion             : 30.0.3
    IsBaseSplit                   : false
    GroupId                       : project
    Namespace                     : com.android.test.library
    TestNamespace                 : com.android.test.library.test
    AaptOptions
        NameSpacing                   : DISABLED
    LintOptions
        IsCheckTestSources            : false
        IsCheckDependencies           : false
        IsAbortOnError                : true
        IsAbsolutePaths               : true
        IsNoLines                     : false
        IsQuiet                       : false
        IsCheckAllWarnings            : false
        IsIgnoreWarnings              : false
        IsWarningsAsErrors            : false
        IsIgnoreTestSources           : false
        IsIgnoreTestFixturesSources   : false
        IsCheckGeneratedSources       : false
        IsCheckReleaseBuilds          : true
        IsExplainIssues               : true
        IsShowAll                     : false
        TextReport                    : false
        HtmlReport                    : true
        XmlReport                     : true
        SarifReport                   : false
    JavaCompileOptions
        Encoding                      : UTF-8
        SourceCompatibility           : 1.8
        TargetCompatibility           : 1.8
        IsCoreLibraryDesugaringEnabled          : false
    AgpFlags
        ApplicationRClassConstantIds  : true
        AestRClassConstantIds         : true
        TransitiveRClasses            : true
        UsesCompose                   : false
        MlModelBindingEnabled         : false
    - basicVariant:               : debug
        testApplicationId             : com.android.test.library.test
    - basicVariant:               : release
    BootClassPath                 : <ANDROID_SDK>/platforms/android-<SDK_VERSION>/android.jar
    ViewBindingOptions
        Enabled                       : false
    DefaultConfig
        ProductFlavor
            Name                          : main
            VersionCode                   : 1
            VersionName                   : 1.0
            MinSdkVersion
                ApiLevel                      : 22
                ApiString                     : 22
            TargetSdkVersion
                ApiLevel                      : <SDK_VERSION>
                ApiString                     : <SDK_VERSION>
            VectorDrawables
                UseSupportLibrary             : false
        SourceProvider
            Name                          : main
            Manifest                      : <ROOT>/library/src/main/AndroidManifest.xml
            JavaDirectories               : <ROOT>/library/src/main/java
            KotlinDirectories             : <ROOT>/library/src/main/java
            KotlinDirectories             : <ROOT>/library/src/main/kotlin [-]
            ResourcesDirectories          : <ROOT>/library/src/main/resources [-]
            AidlDirectories               : <ROOT>/library/src/main/aidl [-]
            RenderscriptDirectories       : <ROOT>/library/src/main/rs [-]
            ResDirectories                : <ROOT>/library/src/main/res
            AssetsDirectories             : <ROOT>/library/src/main/assets
            JniLibsDirectories            : <ROOT>/library/src/main/jniLibs [-]
            ShadersDirectories            : <ROOT>/library/src/main/shaders [-]
        ExtraSourceProviders
            ExtraSourceProvider
                ArtifactName                  : _android_test_
                SourceProvider
                    Name                          : androidTest
                    Manifest                      : <ROOT>/library/src/androidTest/AndroidManifest.xml [-]
                    JavaDirectories               : <ROOT>/library/src/androidTest/java
                    KotlinDirectories             : <ROOT>/library/src/androidTest/java
                    KotlinDirectories             : <ROOT>/library/src/androidTest/kotlin [-]
                    ResourcesDirectories          : <ROOT>/library/src/androidTest/resources [-]
                    AidlDirectories               : <ROOT>/library/src/androidTest/aidl [-]
                    RenderscriptDirectories       : <ROOT>/library/src/androidTest/rs [-]
                    ResDirectories                : <ROOT>/library/src/androidTest/res [-]
                    AssetsDirectories             : <ROOT>/library/src/androidTest/assets [-]
                    JniLibsDirectories            : <ROOT>/library/src/androidTest/jniLibs [-]
                    ShadersDirectories            : <ROOT>/library/src/androidTest/shaders [-]
            ExtraSourceProvider
                ArtifactName                  : _unit_test_
                SourceProvider
                    Name                          : test
                    Manifest                      : <ROOT>/library/src/test/AndroidManifest.xml [-]
                    JavaDirectories               : <ROOT>/library/src/test/java [-]
                    KotlinDirectories             : <ROOT>/library/src/test/java [-]
                    KotlinDirectories             : <ROOT>/library/src/test/kotlin [-]
                    ResourcesDirectories          : <ROOT>/library/src/test/resources [-]
                    AidlDirectories               : <ROOT>/library/src/test/aidl [-]
                    RenderscriptDirectories       : <ROOT>/library/src/test/rs [-]
                    ResDirectories                : <ROOT>/library/src/test/res [-]
                    AssetsDirectories             : <ROOT>/library/src/test/assets [-]
                    JniLibsDirectories            : <ROOT>/library/src/test/jniLibs [-]
                    ShadersDirectories            : <ROOT>/library/src/test/shaders [-]
    BuildTypes
        BuildType
            Name                          : debug
            IsDebuggable                  : true
            IsJniDebuggable               : false
            IsRenderscriptDebuggable      : false
            RenderscriptOptimLevel        : 3
            IsMinifyEnabled               : false
            IsZipAlignEnabled             : true
        SourceProvider
            Name                          : debug
            Manifest                      : <ROOT>/library/src/debug/AndroidManifest.xml [-]
            JavaDirectories               : <ROOT>/library/src/debug/java [-]
            KotlinDirectories             : <ROOT>/library/src/debug/java [-]
            KotlinDirectories             : <ROOT>/library/src/debug/kotlin [-]
            ResourcesDirectories          : <ROOT>/library/src/debug/resources [-]
            AidlDirectories               : <ROOT>/library/src/debug/aidl [-]
            RenderscriptDirectories       : <ROOT>/library/src/debug/rs [-]
            ResDirectories                : <ROOT>/library/src/debug/res [-]
            AssetsDirectories             : <ROOT>/library/src/debug/assets [-]
            JniLibsDirectories            : <ROOT>/library/src/debug/jniLibs [-]
            ShadersDirectories            : <ROOT>/library/src/debug/shaders [-]
        ExtraSourceProviders
            ExtraSourceProvider
                ArtifactName                  : _android_test_
                SourceProvider
                    Name                          : androidTestDebug
                    Manifest                      : <ROOT>/library/src/androidTestDebug/AndroidManifest.xml [-]
                    JavaDirectories               : <ROOT>/library/src/androidTestDebug/java [-]
                    KotlinDirectories             : <ROOT>/library/src/androidTestDebug/java [-]
                    KotlinDirectories             : <ROOT>/library/src/androidTestDebug/kotlin [-]
                    ResourcesDirectories          : <ROOT>/library/src/androidTestDebug/resources [-]
                    AidlDirectories               : <ROOT>/library/src/androidTestDebug/aidl [-]
                    RenderscriptDirectories       : <ROOT>/library/src/androidTestDebug/rs [-]
                    ResDirectories                : <ROOT>/library/src/androidTestDebug/res [-]
                    AssetsDirectories             : <ROOT>/library/src/androidTestDebug/assets [-]
                    JniLibsDirectories            : <ROOT>/library/src/androidTestDebug/jniLibs [-]
                    ShadersDirectories            : <ROOT>/library/src/androidTestDebug/shaders [-]
        ExtraSourceProviders
            ExtraSourceProvider
                ArtifactName                  : _unit_test_
                SourceProvider
                    Name                          : testDebug
                    Manifest                      : <ROOT>/library/src/testDebug/AndroidManifest.xml [-]
                    JavaDirectories               : <ROOT>/library/src/testDebug/java [-]
                    KotlinDirectories             : <ROOT>/library/src/testDebug/java [-]
                    KotlinDirectories             : <ROOT>/library/src/testDebug/kotlin [-]
                    ResourcesDirectories          : <ROOT>/library/src/testDebug/resources [-]
                    AidlDirectories               : <ROOT>/library/src/testDebug/aidl [-]
                    RenderscriptDirectories       : <ROOT>/library/src/testDebug/rs [-]
                    ResDirectories                : <ROOT>/library/src/testDebug/res [-]
                    AssetsDirectories             : <ROOT>/library/src/testDebug/assets [-]
                    JniLibsDirectories            : <ROOT>/library/src/testDebug/jniLibs [-]
                    ShadersDirectories            : <ROOT>/library/src/testDebug/shaders [-]
        BuildType
            Name                          : release
            ProguardFiles                 : <ROOT>/library/build/intermediates/default_proguard_files/global/proguard-android.txt-7.4.0-alpha09 [-]
            ProguardFiles                 : <ROOT>/library/proguard-rules.pro
            IsDebuggable                  : false
            IsJniDebuggable               : false
            IsRenderscriptDebuggable      : false
            RenderscriptOptimLevel        : 3
            IsMinifyEnabled               : false
            IsZipAlignEnabled             : true
        SourceProvider
            Name                          : release
            Manifest                      : <ROOT>/library/src/release/AndroidManifest.xml [-]
            JavaDirectories               : <ROOT>/library/src/release/java [-]
            KotlinDirectories             : <ROOT>/library/src/release/java [-]
            KotlinDirectories             : <ROOT>/library/src/release/kotlin [-]
            ResourcesDirectories          : <ROOT>/library/src/release/resources [-]
            AidlDirectories               : <ROOT>/library/src/release/aidl [-]
            RenderscriptDirectories       : <ROOT>/library/src/release/rs [-]
            ResDirectories                : <ROOT>/library/src/release/res [-]
            AssetsDirectories             : <ROOT>/library/src/release/assets [-]
            JniLibsDirectories            : <ROOT>/library/src/release/jniLibs [-]
            ShadersDirectories            : <ROOT>/library/src/release/shaders [-]
        ExtraSourceProviders
            ExtraSourceProvider
                ArtifactName                  : _unit_test_
                SourceProvider
                    Name                          : testRelease
                    Manifest                      : <ROOT>/library/src/testRelease/AndroidManifest.xml [-]
                    JavaDirectories               : <ROOT>/library/src/testRelease/java [-]
                    KotlinDirectories             : <ROOT>/library/src/testRelease/java [-]
                    KotlinDirectories             : <ROOT>/library/src/testRelease/kotlin [-]
                    ResourcesDirectories          : <ROOT>/library/src/testRelease/resources [-]
                    AidlDirectories               : <ROOT>/library/src/testRelease/aidl [-]
                    RenderscriptDirectories       : <ROOT>/library/src/testRelease/rs [-]
                    ResDirectories                : <ROOT>/library/src/testRelease/res [-]
                    AssetsDirectories             : <ROOT>/library/src/testRelease/assets [-]
                    JniLibsDirectories            : <ROOT>/library/src/testRelease/jniLibs [-]
                    ShadersDirectories            : <ROOT>/library/src/testRelease/shaders [-]
    SigningConfigs
        SigningConfig
            Name                          : debug
            StoreFile                     : debug.keystore
            StorePassword                 : android
            KeyAlias                      : AndroidDebugKey
    VariantBuildInformation
        VariantBuildInformation
            VariantName                   : debug
            BuildTasksAndOutputInformation
                AssembleTaskName              : assembleDebug
        VariantBuildInformation
            VariantName                   : release
            BuildTasksAndOutputInformation
                AssembleTaskName              : assembleRelease
    IdeVariants
        IdeVariant
            Name                          : debug
            BuildType                     : debug
            DisplayName                   : debug
            InstantAppCompatible          : false
            MinSdkVersion
                ApiLevel                      : 22
                ApiString                     : 22
            TargetSdkVersion
                ApiLevel                      : <SDK_VERSION>
                ApiString                     : <SDK_VERSION>
            VersionCode                   : 1
            VersionNameWithSuffix         : 1.0
            MainArtifact
                Name                          : MAIN
                CompileTaskName               : compileDebugSources
                AssembleTaskName              : assembleDebug
                IsTestArtifact                : false
                IdeSetupTaskNames             : generateDebugSources
                GeneratedSourceFolders        : <ROOT>/library/build/generated/aidl_source_output_dir/debug/out [-]
                GeneratedSourceFolders        : <ROOT>/library/build/generated/ap_generated_sources/debug/out [-]
                GeneratedSourceFolders        : <ROOT>/library/build/generated/renderscript_source_output_dir/debug/out [-]
                GeneratedSourceFolders        : <ROOT>/library/build/generated/source/buildConfig/debug [-]
                ClassesFolder                 : <ROOT>/library/build/intermediates/compile_r_class_jar/debug/R.jar [-]
                ClassesFolder                 : <ROOT>/library/build/intermediates/javac/debug/classes [-]
                Dependencies
                IsSigned                      : false
                CodeShrinker                  : null
                BuildTasksAndOutputInformation
                    AssembleTaskName              : assembleDebug
                GeneratedResourceFolders      : <ROOT>/library/build/generated/res/rs/debug [-]
                GeneratedResourceFolders      : <ROOT>/library/build/generated/res/resValues/debug [-]
                DesugaredMethodFiles          : <GRADLE>/caches/transforms-3/xxxxxxxxxxxxxxxxxxxxxxxxxxxxxxxx/transformed/D8BackportedDesugaredMethods.txt
                ModelSyncFile
                    Type                          : BASIC
                    TaskName                      : createDebugVariantModel
                    File                          : <ROOT>/library/build/intermediates/variant_model/debug/variant_model.json [-]
            AndroidTestArtifact
                Name                          : ANDROID_TEST
                CompileTaskName               : compileDebugAndroidTestSources
                AssembleTaskName              : assembleDebugAndroidTest
                IsTestArtifact                : true
                IdeSetupTaskNames             : generateDebugAndroidTestSources
                GeneratedSourceFolders        : <ROOT>/library/build/generated/aidl_source_output_dir/debugAndroidTest/out [-]
                GeneratedSourceFolders        : <ROOT>/library/build/generated/ap_generated_sources/debugAndroidTest/out [-]
                GeneratedSourceFolders        : <ROOT>/library/build/generated/renderscript_source_output_dir/debugAndroidTest/out [-]
                GeneratedSourceFolders        : <ROOT>/library/build/generated/source/buildConfig/androidTest/debug [-]
                ClassesFolder                 : <ROOT>/library/build/intermediates/compile_and_runtime_not_namespaced_r_class_jar/debugAndroidTest/R.jar [-]
                ClassesFolder                 : <ROOT>/library/build/intermediates/javac/debugAndroidTest/classes [-]
                Dependencies
                    - compileClasspath            : <ROOT>::library@debug (IdeModuleLibraryImpl)
                        buildId                       : <ROOT>
                        lintJar                       : <ROOT>/library/build/intermediates/lint_publish_jar/global/lint.jar [-]
                        projectPath                   : :library
                        sourceSet                     : MAIN
                        variant                       : debug
                    - runtimeClasspath            : <ROOT>::library@debug (IdeModuleLibraryImpl) (*seen*)
                ApplicationId                 : com.android.test.library.test
                SigningConfigName             : debug
                IsSigned                      : true
                CodeShrinker                  : null
                BuildTasksAndOutputInformation
                    AssembleTaskName              : assembleDebugAndroidTest
                    AssembleTaskOutputListingFile : <ROOT>/library/build/intermediates/apk_ide_redirect_file/debugAndroidTest/redirect.txt [-]
                GeneratedResourceFolders      : <ROOT>/library/build/generated/res/rs/androidTest/debug [-]
                GeneratedResourceFolders      : <ROOT>/library/build/generated/res/resValues/androidTest/debug [-]
                DesugaredMethodFiles          : <GRADLE>/caches/transforms-3/xxxxxxxxxxxxxxxxxxxxxxxxxxxxxxxx/transformed/D8BackportedDesugaredMethods.txt
                TestOptions
                    AnimationsDisabled            : false
                    Execution                     : HOST
            UnitTestArtifact
                Name                          : UNIT_TEST
                CompileTaskName               : compileDebugUnitTestSources
                AssembleTaskName              : assembleDebugUnitTest
                IsTestArtifact                : true
                IdeSetupTaskNames             : createMockableJar
                GeneratedSourceFolders        : <ROOT>/library/build/generated/ap_generated_sources/debugUnitTest/out [-]
                ClassesFolder                 : <ROOT>/library/build/intermediates/compile_and_runtime_not_namespaced_r_class_jar/debugUnitTest/R.jar [-]
                ClassesFolder                 : <ROOT>/library/build/intermediates/javac/debugUnitTest/classes [-]
                Dependencies
                    - compileClasspath            : <ROOT>::library@debug (IdeModuleLibraryImpl) (*seen*)
                    - runtimeClasspath            : <ROOT>::library@debug (IdeModuleLibraryImpl) (*seen*)
                MockablePlatformJar           : <GRADLE>/caches/transforms-3/xxxxxxxxxxxxxxxxxxxxxxxxxxxxxxxx/transformed/android.jar
    externalProject               : :library (DefaultExternalProject) (*seen*)
MODULE                        : project.library-debug
    GradleModuleModel
        gradlePath                    : :library-debug
        gradleVersion                 : 7.5
        buildFile                     : <ROOT>/library-debug/build.gradle
        buildFilePath                 : <ROOT>/library-debug/build.gradle
        rootFolderPath                : <ROOT>
        hasSafeArgsJava               : false
        hasSafeArgsKotlin             : false
    externalProject               : :library-debug (DefaultExternalProject) (*seen*)
MODULE                        : project.library.androidTest
MODULE                        : project.library.main
MODULE                        : project.library.unitTest