PROJECT                       : withGradleMetadata
    PROJECT_JDK                   : <JDK_NAME>
        Version                       : <JDK_VERSION>
    MODULE                        : withGradleMetadata
        ExternalModuleGroup           :
        ExternalModuleVersion         : unspecified
        LinkedProjectId               : withGradleMetadata
        LinkedProjectPath             : <PROJECT>
        RootProjectPath               : <PROJECT>
        COMPILER_MODULE_EXTENSION
            compilerSourceOutputPath      : file://<PROJECT>/build/classes/production/withGradleMetadata [-]
            compilerTestOutputPath        : file://<PROJECT>/build/classes/test/withGradleMetadata [-]
            isCompilerPathInherited       : true
            isExcludeOutput               : true
        ModuleFile                    : <PROJECT>/.idea/modules/withGradleMetadata.iml [-]
        ModuleTypeName                : JAVA_MODULE
        CONENT_ENTRY                  : file://<PROJECT>
            EXCLUDE_FOLDER                : file://<PROJECT>/.gradle
            EXCLUDE_FOLDER                : file://<PROJECT>/build [-]
        JDK                           : <NAME_CUT> JavaSDK
        *isInherited                  : true
        ORDER_ENTRY                   : <Module source>
        BUILD_TASKS
            TEST_COMPILE_MODE             : All
            TEST_COMPILE_MODE             : Android tests
            TEST_COMPILE_MODE             : Unit tests
            TEST_COMPILE_MODE             : None
    MODULE                        : withGradleMetadata.app
        LINKED_ANDROID_MODULE_GROUP
            holder                        : withGradleMetadata.app
            main                          : withGradleMetadata.app.main
            unitTest                      : withGradleMetadata.app.unitTest
            androidTest                   : withGradleMetadata.app.androidTest
        ExternalModuleGroup           : withGradleMetadata
        ExternalModuleVersion         : unspecified
        LinkedProjectId               : :app
        LinkedProjectPath             : <PROJECT>/app
        RootProjectPath               : <PROJECT>
        COMPILER_MODULE_EXTENSION
            isCompilerPathInherited       : false
            isExcludeOutput               : true
        ModuleFile                    : <PROJECT>/.idea/modules/app/withGradleMetadata.app.iml [-]
        ModuleTypeName                : JAVA_MODULE
        FACET                         : Android
            TypeId                        : android
            ExternalSource                : GRADLE
            SelectedBuildVariant          : debug
            AllowUserConfiguration        : false
            GenFolderRelativePathApt      : /gen
            GenFolderRelativePathAidl     : /gen
            ManifestFileRelativePath      : /src/main/AndroidManifest.xml
            ResFolderRelativePath         : /src/main/res
            - ResFoldersRelativePath      :  [-]
            - TestResFoldersRelativePath  :  [-]
            AssetsFolderRelativePath      : /src/main/assets
            LibsFolderRelativePath        : /libs
            ProjectType                   : 0
            PackTestCode                  : false
            RunProguard                   : false
            ProguardLogsFolderRelativePath          : /proguard_logs
            UseCustomManifestPackage      : false
            - ProGuardCfgFiles            : file://%MODULE_SDK_HOME%/tools/proguard/proguard-android.txt
        FACET                         : Android-Gradle
            TypeId                        : android-gradle
            ExternalSource                : GRADLE
        CONENT_ENTRY                  : file://<PROJECT>/app
            EXCLUDE_FOLDER                : file://<PROJECT>/app/.gradle [-]
            EXCLUDE_FOLDER                : file://<PROJECT>/app/build [-]
        JDK                           : <NAME_CUT> Android SDK
        *isInherited                  : false
            SdkType                       : Android SDK
            HomePath                      : <ANDROID_SDK>
            VersionString                 : <JDK_VERSION>
        ORDER_ENTRY                   : <Module source>
        BUILD_TASKS
            TEST_COMPILE_MODE             : All
                CLEAN                         : :app:createMockableJar, :app:generateDebugAndroidTestSources, :app:generateDebugSources
                ASSEMBLE                      : :app:assembleDebug, :app:assembleDebugAndroidTest, :app:assembleDebugUnitTest
                REBUILD                       : :app:assembleDebug, :app:assembleDebugAndroidTest, :app:assembleDebugUnitTest, :app:clean
                COMPILE_JAVA                  : :app:compileDebugAndroidTestSources, :app:compileDebugSources, :app:compileDebugUnitTestSources
                SOURCE_GEN                    : :app:createMockableJar, :app:generateDebugAndroidTestSources, :app:generateDebugSources
                BUNDLE                        : :app:bundleDebug
                APK_FROM_BUNDLE               : :app:extractApksForDebug
            TEST_COMPILE_MODE             : Android tests
                CLEAN                         : :app:generateDebugAndroidTestSources, :app:generateDebugSources
                ASSEMBLE                      : :app:assembleDebug, :app:assembleDebugAndroidTest
                REBUILD                       : :app:assembleDebug, :app:assembleDebugAndroidTest, :app:clean
                COMPILE_JAVA                  : :app:compileDebugAndroidTestSources, :app:compileDebugSources
                SOURCE_GEN                    : :app:generateDebugAndroidTestSources, :app:generateDebugSources
                BUNDLE                        : :app:bundleDebug
                APK_FROM_BUNDLE               : :app:extractApksForDebug
            TEST_COMPILE_MODE             : Unit tests
                CLEAN                         : :app:createMockableJar, :app:generateDebugSources
                ASSEMBLE                      : :app:assembleDebug, :app:assembleDebugUnitTest
                REBUILD                       : :app:assembleDebug, :app:assembleDebugUnitTest, :app:clean
                COMPILE_JAVA                  : :app:compileDebugUnitTestSources
                SOURCE_GEN                    : :app:createMockableJar, :app:generateDebugSources
                BUNDLE                        : :app:bundleDebug
                APK_FROM_BUNDLE               : :app:extractApksForDebug
            TEST_COMPILE_MODE             : None
                CLEAN                         : :app:generateDebugSources
                ASSEMBLE                      : :app:assembleDebug
                REBUILD                       : :app:assembleDebug, :app:clean
                COMPILE_JAVA                  : :app:compileDebugSources
                SOURCE_GEN                    : :app:generateDebugSources
                BUNDLE                        : :app:bundleDebug
                APK_FROM_BUNDLE               : :app:extractApksForDebug
    MODULE                        : withGradleMetadata.app.androidTest
        LINKED_ANDROID_MODULE_GROUP
            holder                        : withGradleMetadata.app
            main                          : withGradleMetadata.app.main
            unitTest                      : withGradleMetadata.app.unitTest
            androidTest                   : withGradleMetadata.app.androidTest
        ExternalModuleType            : sourceSet
        LinkedProjectId               : :app:androidTest
        LinkedProjectPath             : <PROJECT>/app
        RootProjectPath               : <PROJECT>
        COMPILER_MODULE_EXTENSION
            compilerTestOutputPath        : file://<PROJECT>/app/build/intermediates/javac/debugAndroidTest/classes [-]
            isCompilerPathInherited       : false
            isExcludeOutput               : true
        TEST_MODULE_PROPERTIES
            productionModuleName          : withGradleMetadata.app.main
        ModuleFile                    : <PROJECT>/.idea/modules/app/withGradleMetadata.app.androidTest.iml [-]
        ModuleTypeName                : JAVA_MODULE
        FACET                         : Android
            TypeId                        : android
            ExternalSource                : GRADLE
            SelectedBuildVariant          : debug
            AllowUserConfiguration        : false
            GenFolderRelativePathApt      : /gen
            GenFolderRelativePathAidl     : /gen
            ManifestFileRelativePath      : /src/main/AndroidManifest.xml
            ResFolderRelativePath         : /src/main/res
            - ResFoldersRelativePath      :  [-]
            - TestResFoldersRelativePath  : file://<PROJECT>/app/src/androidTest/res [-]
            - TestResFoldersRelativePath  : file://<PROJECT>/app/src/androidTestDebug/res [-]
            - TestResFoldersRelativePath  : file://<PROJECT>/app/build/generated/res/resValues/androidTest/debug [-]
            AssetsFolderRelativePath      : /src/main/assets
            LibsFolderRelativePath        : /libs
            ProjectType                   : 0
            PackTestCode                  : false
            RunProguard                   : false
            ProguardLogsFolderRelativePath          : /proguard_logs
            UseCustomManifestPackage      : false
            - ProGuardCfgFiles            : file://%MODULE_SDK_HOME%/tools/proguard/proguard-android.txt
        CONENT_ENTRY                  : file://<PROJECT>/app/build/generated/ap_generated_sources/debugAndroidTest/out [-]
        CONENT_ENTRY                  : file://<PROJECT>/app/build/generated/res/resValues/androidTest/debug [-]
        CONENT_ENTRY                  : file://<PROJECT>/app/src/androidTest [-]
        CONENT_ENTRY                  : file://<PROJECT>/app/src/androidTestDebug [-]
        WATCHED_TEST_SOURCE_FOLDER    : file://<PROJECT>/app/build/generated/ap_generated_sources/debugAndroidTest/out [-]
            Generated                     : true
        WATCHED_TEST_RESOURCE_FOLDER  : file://<PROJECT>/app/build/generated/res/resValues/androidTest/debug [-]
            Generated                     : true
        WATCHED_TEST_RESOURCE_FOLDER  : file://<PROJECT>/app/src/androidTest/assets [-]
        WATCHED_TEST_RESOURCE_FOLDER  : file://<PROJECT>/app/src/androidTest/baselineProfiles [-]
        WATCHED_TEST_SOURCE_FOLDER    : file://<PROJECT>/app/src/androidTest/java [-]
        WATCHED_TEST_SOURCE_FOLDER    : file://<PROJECT>/app/src/androidTest/kotlin [-]
        WATCHED_TEST_RESOURCE_FOLDER  : file://<PROJECT>/app/src/androidTest/res [-]
        WATCHED_TEST_RESOURCE_FOLDER  : file://<PROJECT>/app/src/androidTest/resources [-]
        WATCHED_TEST_SOURCE_FOLDER    : file://<PROJECT>/app/src/androidTest/shaders [-]
        WATCHED_TEST_RESOURCE_FOLDER  : file://<PROJECT>/app/src/androidTestDebug/assets [-]
        WATCHED_TEST_RESOURCE_FOLDER  : file://<PROJECT>/app/src/androidTestDebug/baselineProfiles [-]
        WATCHED_TEST_SOURCE_FOLDER    : file://<PROJECT>/app/src/androidTestDebug/java [-]
        WATCHED_TEST_SOURCE_FOLDER    : file://<PROJECT>/app/src/androidTestDebug/kotlin [-]
        WATCHED_TEST_RESOURCE_FOLDER  : file://<PROJECT>/app/src/androidTestDebug/res [-]
        WATCHED_TEST_RESOURCE_FOLDER  : file://<PROJECT>/app/src/androidTestDebug/resources [-]
        WATCHED_TEST_SOURCE_FOLDER    : file://<PROJECT>/app/src/androidTestDebug/shaders [-]
        JDK                           : <NAME_CUT> Android SDK
        *isInherited                  : false
            SdkType                       : Android SDK
            HomePath                      : <ANDROID_SDK>
            VersionString                 : <JDK_VERSION>
        ORDER_ENTRY                   : <Module source>
        LIBRARY                       : Gradle: org.jetbrains.kotlin:kotlin-stdlib-common:<KOTLIN_VERSION> [=]
            Scope                         : Test
        LIBRARY                       : Gradle: org.jetbrains.kotlin:kotlin-stdlib-jdk7:<KOTLIN_VERSION> [=]
            Scope                         : Test
        LIBRARY                       : Gradle: org.jetbrains.kotlin:kotlin-stdlib-jdk8:<KOTLIN_VERSION> [=]
            Scope                         : Test
        LIBRARY                       : Gradle: org.jetbrains.kotlin:kotlin-stdlib:<KOTLIN_VERSION> [=]
            Scope                         : Test
        LIBRARY                       : Gradle: org.jetbrains.kotlinx:kotlinx-coroutines-android:1.5.2 [=]
            Scope                         : Test
        LIBRARY                       : Gradle: org.jetbrains.kotlinx:kotlinx-coroutines-core-jvm:1.5.2 [=]
            Scope                         : Test
        LIBRARY                       : Gradle: org.jetbrains:annotations:13.0 [=]
            Scope                         : Test
        ORDER_ENTRY                   : withGradleMetadata.app.main
            Scope                         : Test
        BUILD_TASKS
            TEST_COMPILE_MODE             : All
                CLEAN                         : :app:createMockableJar, :app:generateDebugAndroidTestSources, :app:generateDebugSources
                ASSEMBLE                      : :app:assembleDebug, :app:assembleDebugAndroidTest, :app:assembleDebugUnitTest
                REBUILD                       : :app:assembleDebug, :app:assembleDebugAndroidTest, :app:assembleDebugUnitTest, :app:clean
                COMPILE_JAVA                  : :app:compileDebugAndroidTestSources, :app:compileDebugSources, :app:compileDebugUnitTestSources
                SOURCE_GEN                    : :app:createMockableJar, :app:generateDebugAndroidTestSources, :app:generateDebugSources
                BUNDLE                        : :app:bundleDebug
                APK_FROM_BUNDLE               : :app:extractApksForDebug
            TEST_COMPILE_MODE             : Android tests
                CLEAN                         : :app:generateDebugAndroidTestSources, :app:generateDebugSources
                ASSEMBLE                      : :app:assembleDebug, :app:assembleDebugAndroidTest
                REBUILD                       : :app:assembleDebug, :app:assembleDebugAndroidTest, :app:clean
                COMPILE_JAVA                  : :app:compileDebugAndroidTestSources, :app:compileDebugSources
                SOURCE_GEN                    : :app:generateDebugAndroidTestSources, :app:generateDebugSources
                BUNDLE                        : :app:bundleDebug
                APK_FROM_BUNDLE               : :app:extractApksForDebug
            TEST_COMPILE_MODE             : Unit tests
                CLEAN                         : :app:createMockableJar, :app:generateDebugSources
                ASSEMBLE                      : :app:assembleDebug, :app:assembleDebugUnitTest
                REBUILD                       : :app:assembleDebug, :app:assembleDebugUnitTest, :app:clean
                COMPILE_JAVA                  : :app:compileDebugUnitTestSources
                SOURCE_GEN                    : :app:createMockableJar, :app:generateDebugSources
                BUNDLE                        : :app:bundleDebug
                APK_FROM_BUNDLE               : :app:extractApksForDebug
            TEST_COMPILE_MODE             : None
                CLEAN                         : :app:generateDebugSources
                ASSEMBLE                      : :app:assembleDebug
                REBUILD                       : :app:assembleDebug, :app:clean
                COMPILE_JAVA                  : :app:compileDebugSources
                SOURCE_GEN                    : :app:generateDebugSources
                BUNDLE                        : :app:bundleDebug
                APK_FROM_BUNDLE               : :app:extractApksForDebug
    MODULE                        : withGradleMetadata.app.main
        LINKED_ANDROID_MODULE_GROUP
            holder                        : withGradleMetadata.app
            main                          : withGradleMetadata.app.main
            unitTest                      : withGradleMetadata.app.unitTest
            androidTest                   : withGradleMetadata.app.androidTest
        ExternalModuleType            : sourceSet
        LinkedProjectId               : :app:main
        LinkedProjectPath             : <PROJECT>/app
        RootProjectPath               : <PROJECT>
        COMPILER_MODULE_EXTENSION
            compilerSourceOutputPath      : file://<PROJECT>/app/build/intermediates/javac/debug/classes [-]
            isCompilerPathInherited       : false
            isExcludeOutput               : true
        ModuleFile                    : <PROJECT>/.idea/modules/app/withGradleMetadata.app.main.iml [-]
        ModuleTypeName                : JAVA_MODULE
        FACET                         : Android
            TypeId                        : android
            ExternalSource                : GRADLE
            SelectedBuildVariant          : debug
            AllowUserConfiguration        : false
            GenFolderRelativePathApt      : /gen
            GenFolderRelativePathAidl     : /gen
            ManifestFileRelativePath      : /src/main/AndroidManifest.xml
            ResFolderRelativePath         : /src/main/res
            - ResFoldersRelativePath      : file://<PROJECT>/app/src/main/res [-]
            - ResFoldersRelativePath      : file://<PROJECT>/app/src/debug/res [-]
            - ResFoldersRelativePath      : file://<PROJECT>/app/build/generated/res/resValues/debug [-]
            - TestResFoldersRelativePath  :  [-]
            AssetsFolderRelativePath      : /src/main/assets
            LibsFolderRelativePath        : /libs
            ProjectType                   : 0
            PackTestCode                  : false
            RunProguard                   : false
            ProguardLogsFolderRelativePath          : /proguard_logs
            UseCustomManifestPackage      : false
            - ProGuardCfgFiles            : file://%MODULE_SDK_HOME%/tools/proguard/proguard-android.txt
        CONENT_ENTRY                  : file://<PROJECT>/app/build/generated/ap_generated_sources/debug/out [-]
        CONENT_ENTRY                  : file://<PROJECT>/app/build/generated/res/resValues/debug [-]
        CONENT_ENTRY                  : file://<PROJECT>/app/src/debug [-]
        CONENT_ENTRY                  : file://<PROJECT>/app/src/main
        WATCHED_SOURCE_FOLDER         : file://<PROJECT>/app/build/generated/ap_generated_sources/debug/out [-]
            Generated                     : true
        WATCHED_RESOURCE_FOLDER       : file://<PROJECT>/app/build/generated/res/resValues/debug [-]
            Generated                     : true
        WATCHED_RESOURCE_FOLDER       : file://<PROJECT>/app/src/debug/assets [-]
        WATCHED_RESOURCE_FOLDER       : file://<PROJECT>/app/src/debug/baselineProfiles [-]
        WATCHED_SOURCE_FOLDER         : file://<PROJECT>/app/src/debug/java [-]
        WATCHED_SOURCE_FOLDER         : file://<PROJECT>/app/src/debug/kotlin [-]
        WATCHED_RESOURCE_FOLDER       : file://<PROJECT>/app/src/debug/res [-]
        WATCHED_RESOURCE_FOLDER       : file://<PROJECT>/app/src/debug/resources [-]
        WATCHED_SOURCE_FOLDER         : file://<PROJECT>/app/src/debug/shaders [-]
        WATCHED_RESOURCE_FOLDER       : file://<PROJECT>/app/src/main/assets [-]
        WATCHED_RESOURCE_FOLDER       : file://<PROJECT>/app/src/main/baselineProfiles [-]
        WATCHED_SOURCE_FOLDER         : file://<PROJECT>/app/src/main/java [-]
        WATCHED_SOURCE_FOLDER         : file://<PROJECT>/app/src/main/kotlin [-]
        WATCHED_RESOURCE_FOLDER       : file://<PROJECT>/app/src/main/res [-]
        WATCHED_RESOURCE_FOLDER       : file://<PROJECT>/app/src/main/resources [-]
        WATCHED_SOURCE_FOLDER         : file://<PROJECT>/app/src/main/shaders [-]
        JDK                           : <NAME_CUT> Android SDK
        *isInherited                  : false
            SdkType                       : Android SDK
            HomePath                      : <ANDROID_SDK>
            VersionString                 : <JDK_VERSION>
        ORDER_ENTRY                   : <Module source>
        LIBRARY                       : Gradle: org.jetbrains.kotlin:kotlin-stdlib-common:<KOTLIN_VERSION> [=]
        LIBRARY                       : Gradle: org.jetbrains.kotlin:kotlin-stdlib-jdk7:<KOTLIN_VERSION> [=]
        LIBRARY                       : Gradle: org.jetbrains.kotlin:kotlin-stdlib-jdk8:<KOTLIN_VERSION> [=]
        LIBRARY                       : Gradle: org.jetbrains.kotlin:kotlin-stdlib:<KOTLIN_VERSION> [=]
        LIBRARY                       : Gradle: org.jetbrains.kotlinx:kotlinx-coroutines-android:1.5.2 [=]
        LIBRARY                       : Gradle: org.jetbrains.kotlinx:kotlinx-coroutines-core-jvm:1.5.2 [=]
        LIBRARY                       : Gradle: org.jetbrains:annotations:13.0 [=]
        BUILD_TASKS
            TEST_COMPILE_MODE             : All
                CLEAN                         : :app:createMockableJar, :app:generateDebugAndroidTestSources, :app:generateDebugSources
                ASSEMBLE                      : :app:assembleDebug, :app:assembleDebugAndroidTest, :app:assembleDebugUnitTest
                REBUILD                       : :app:assembleDebug, :app:assembleDebugAndroidTest, :app:assembleDebugUnitTest, :app:clean
                COMPILE_JAVA                  : :app:compileDebugAndroidTestSources, :app:compileDebugSources, :app:compileDebugUnitTestSources
                SOURCE_GEN                    : :app:createMockableJar, :app:generateDebugAndroidTestSources, :app:generateDebugSources
                BUNDLE                        : :app:bundleDebug
                APK_FROM_BUNDLE               : :app:extractApksForDebug
            TEST_COMPILE_MODE             : Android tests
                CLEAN                         : :app:generateDebugAndroidTestSources, :app:generateDebugSources
                ASSEMBLE                      : :app:assembleDebug, :app:assembleDebugAndroidTest
                REBUILD                       : :app:assembleDebug, :app:assembleDebugAndroidTest, :app:clean
                COMPILE_JAVA                  : :app:compileDebugAndroidTestSources, :app:compileDebugSources
                SOURCE_GEN                    : :app:generateDebugAndroidTestSources, :app:generateDebugSources
                BUNDLE                        : :app:bundleDebug
                APK_FROM_BUNDLE               : :app:extractApksForDebug
            TEST_COMPILE_MODE             : Unit tests
                CLEAN                         : :app:createMockableJar, :app:generateDebugSources
                ASSEMBLE                      : :app:assembleDebug, :app:assembleDebugUnitTest
                REBUILD                       : :app:assembleDebug, :app:assembleDebugUnitTest, :app:clean
                COMPILE_JAVA                  : :app:compileDebugUnitTestSources
                SOURCE_GEN                    : :app:createMockableJar, :app:generateDebugSources
                BUNDLE                        : :app:bundleDebug
                APK_FROM_BUNDLE               : :app:extractApksForDebug
            TEST_COMPILE_MODE             : None
                CLEAN                         : :app:generateDebugSources
                ASSEMBLE                      : :app:assembleDebug
                REBUILD                       : :app:assembleDebug, :app:clean
                COMPILE_JAVA                  : :app:compileDebugSources
                SOURCE_GEN                    : :app:generateDebugSources
                BUNDLE                        : :app:bundleDebug
                APK_FROM_BUNDLE               : :app:extractApksForDebug
    MODULE                        : withGradleMetadata.app.unitTest
        LINKED_ANDROID_MODULE_GROUP
            holder                        : withGradleMetadata.app
            main                          : withGradleMetadata.app.main
            unitTest                      : withGradleMetadata.app.unitTest
            androidTest                   : withGradleMetadata.app.androidTest
        ExternalModuleType            : sourceSet
        LinkedProjectId               : :app:unitTest
        LinkedProjectPath             : <PROJECT>/app
        RootProjectPath               : <PROJECT>
        COMPILER_MODULE_EXTENSION
            compilerTestOutputPath        : file://<PROJECT>/app/build/intermediates/javac/debugUnitTest/classes [-]
            isCompilerPathInherited       : false
            isExcludeOutput               : true
        TEST_MODULE_PROPERTIES
            productionModuleName          : withGradleMetadata.app.main
        ModuleFile                    : <PROJECT>/.idea/modules/app/withGradleMetadata.app.unitTest.iml [-]
        ModuleTypeName                : JAVA_MODULE
        FACET                         : Android
            TypeId                        : android
            ExternalSource                : GRADLE
            SelectedBuildVariant          : debug
            AllowUserConfiguration        : false
            GenFolderRelativePathApt      : /gen
            GenFolderRelativePathAidl     : /gen
            ManifestFileRelativePath      : /src/main/AndroidManifest.xml
            ResFolderRelativePath         : /src/main/res
            - ResFoldersRelativePath      :  [-]
            - TestResFoldersRelativePath  :  [-]
            AssetsFolderRelativePath      : /src/main/assets
            LibsFolderRelativePath        : /libs
            ProjectType                   : 0
            PackTestCode                  : false
            RunProguard                   : false
            ProguardLogsFolderRelativePath          : /proguard_logs
            UseCustomManifestPackage      : false
            - ProGuardCfgFiles            : file://%MODULE_SDK_HOME%/tools/proguard/proguard-android.txt
        CONENT_ENTRY                  : file://<PROJECT>/app/build/generated/ap_generated_sources/debugUnitTest/out [-]
        CONENT_ENTRY                  : file://<PROJECT>/app/src/test [-]
        CONENT_ENTRY                  : file://<PROJECT>/app/src/testDebug [-]
        WATCHED_TEST_SOURCE_FOLDER    : file://<PROJECT>/app/build/generated/ap_generated_sources/debugUnitTest/out [-]
            Generated                     : true
        WATCHED_TEST_RESOURCE_FOLDER  : file://<PROJECT>/app/src/test/assets [-]
        WATCHED_TEST_RESOURCE_FOLDER  : file://<PROJECT>/app/src/test/baselineProfiles [-]
        WATCHED_TEST_SOURCE_FOLDER    : file://<PROJECT>/app/src/test/java [-]
        WATCHED_TEST_SOURCE_FOLDER    : file://<PROJECT>/app/src/test/kotlin [-]
        WATCHED_TEST_RESOURCE_FOLDER  : file://<PROJECT>/app/src/test/res [-]
        WATCHED_TEST_RESOURCE_FOLDER  : file://<PROJECT>/app/src/test/resources [-]
        WATCHED_TEST_SOURCE_FOLDER    : file://<PROJECT>/app/src/test/shaders [-]
        WATCHED_TEST_RESOURCE_FOLDER  : file://<PROJECT>/app/src/testDebug/assets [-]
        WATCHED_TEST_RESOURCE_FOLDER  : file://<PROJECT>/app/src/testDebug/baselineProfiles [-]
        WATCHED_TEST_SOURCE_FOLDER    : file://<PROJECT>/app/src/testDebug/java [-]
        WATCHED_TEST_SOURCE_FOLDER    : file://<PROJECT>/app/src/testDebug/kotlin [-]
        WATCHED_TEST_RESOURCE_FOLDER  : file://<PROJECT>/app/src/testDebug/res [-]
        WATCHED_TEST_RESOURCE_FOLDER  : file://<PROJECT>/app/src/testDebug/resources [-]
        WATCHED_TEST_SOURCE_FOLDER    : file://<PROJECT>/app/src/testDebug/shaders [-]
        JDK                           : <NAME_CUT> Android SDK
        *isInherited                  : false
            SdkType                       : Android SDK
            HomePath                      : <ANDROID_SDK>
            VersionString                 : <JDK_VERSION>
        ORDER_ENTRY                   : <Module source>
        LIBRARY                       : Gradle: org.jetbrains.kotlin:kotlin-stdlib-common:<KOTLIN_VERSION> [=]
            Scope                         : Test
        LIBRARY                       : Gradle: org.jetbrains.kotlin:kotlin-stdlib-jdk7:<KOTLIN_VERSION> [=]
            Scope                         : Test
        LIBRARY                       : Gradle: org.jetbrains.kotlin:kotlin-stdlib-jdk8:<KOTLIN_VERSION> [=]
            Scope                         : Test
        LIBRARY                       : Gradle: org.jetbrains.kotlin:kotlin-stdlib:<KOTLIN_VERSION> [=]
            Scope                         : Test
        LIBRARY                       : Gradle: org.jetbrains.kotlinx:kotlinx-coroutines-android:1.5.2 [=]
            Scope                         : Test
        LIBRARY                       : Gradle: org.jetbrains.kotlinx:kotlinx-coroutines-core-jvm:1.5.2 [=]
            Scope                         : Test
        LIBRARY                       : Gradle: org.jetbrains:annotations:13.0 [=]
            Scope                         : Test
        ORDER_ENTRY                   : withGradleMetadata.app.main
            Scope                         : Test
        BUILD_TASKS
            TEST_COMPILE_MODE             : All
                CLEAN                         : :app:createMockableJar, :app:generateDebugAndroidTestSources, :app:generateDebugSources
                ASSEMBLE                      : :app:assembleDebug, :app:assembleDebugAndroidTest, :app:assembleDebugUnitTest
                REBUILD                       : :app:assembleDebug, :app:assembleDebugAndroidTest, :app:assembleDebugUnitTest, :app:clean
                COMPILE_JAVA                  : :app:compileDebugAndroidTestSources, :app:compileDebugSources, :app:compileDebugUnitTestSources
                SOURCE_GEN                    : :app:createMockableJar, :app:generateDebugAndroidTestSources, :app:generateDebugSources
                BUNDLE                        : :app:bundleDebug
                APK_FROM_BUNDLE               : :app:extractApksForDebug
            TEST_COMPILE_MODE             : Android tests
                CLEAN                         : :app:generateDebugAndroidTestSources, :app:generateDebugSources
                ASSEMBLE                      : :app:assembleDebug, :app:assembleDebugAndroidTest
                REBUILD                       : :app:assembleDebug, :app:assembleDebugAndroidTest, :app:clean
                COMPILE_JAVA                  : :app:compileDebugAndroidTestSources, :app:compileDebugSources
                SOURCE_GEN                    : :app:generateDebugAndroidTestSources, :app:generateDebugSources
                BUNDLE                        : :app:bundleDebug
                APK_FROM_BUNDLE               : :app:extractApksForDebug
            TEST_COMPILE_MODE             : Unit tests
                CLEAN                         : :app:createMockableJar, :app:generateDebugSources
                ASSEMBLE                      : :app:assembleDebug, :app:assembleDebugUnitTest
                REBUILD                       : :app:assembleDebug, :app:assembleDebugUnitTest, :app:clean
                COMPILE_JAVA                  : :app:compileDebugUnitTestSources
                SOURCE_GEN                    : :app:createMockableJar, :app:generateDebugSources
                BUNDLE                        : :app:bundleDebug
                APK_FROM_BUNDLE               : :app:extractApksForDebug
            TEST_COMPILE_MODE             : None
                CLEAN                         : :app:generateDebugSources
                ASSEMBLE                      : :app:assembleDebug
                REBUILD                       : :app:assembleDebug, :app:clean
                COMPILE_JAVA                  : :app:compileDebugSources
                SOURCE_GEN                    : :app:generateDebugSources
                BUNDLE                        : :app:bundleDebug
                APK_FROM_BUNDLE               : :app:extractApksForDebug
    RUN_CONFIGURATION             : app
        *class*                       : AndroidRunConfiguration
        ModuleName                    : withGradleMetadata.app.main
        Module                        : withGradleMetadata.app.main
    LIBRARY_TABLE
        LIBRARY                       : Gradle: org.jetbrains.kotlin:kotlin-stdlib-common:<KOTLIN_VERSION>
            *CLASSES                      : jar://<M2>/org/jetbrains/kotlin/kotlin-stdlib-common/<KOTLIN_VERSION>/kotlin-stdlib-common-<KOTLIN_VERSION>.jar!/
        LIBRARY                       : Gradle: org.jetbrains.kotlin:kotlin-stdlib-jdk7:<KOTLIN_VERSION>
            *CLASSES                      : jar://<M2>/org/jetbrains/kotlin/kotlin-stdlib-jdk7/<KOTLIN_VERSION>/kotlin-stdlib-jdk7-<KOTLIN_VERSION>.jar!/
        LIBRARY                       : Gradle: org.jetbrains.kotlin:kotlin-stdlib-jdk8:<KOTLIN_VERSION>
            *CLASSES                      : jar://<M2>/org/jetbrains/kotlin/kotlin-stdlib-jdk8/<KOTLIN_VERSION>/kotlin-stdlib-jdk8-<KOTLIN_VERSION>.jar!/
        LIBRARY                       : Gradle: org.jetbrains.kotlin:kotlin-stdlib:<KOTLIN_VERSION>
            *CLASSES                      : jar://<M2>/org/jetbrains/kotlin/kotlin-stdlib/<KOTLIN_VERSION>/kotlin-stdlib-<KOTLIN_VERSION>.jar!/
        LIBRARY                       : Gradle: org.jetbrains.kotlinx:kotlinx-coroutines-android:1.5.2
            *CLASSES                      : jar://<M2>/org/jetbrains/kotlinx/kotlinx-coroutines-android/1.5.2/kotlinx-coroutines-android-1.5.2.jar!/
        LIBRARY                       : Gradle: org.jetbrains.kotlinx:kotlinx-coroutines-core-jvm:1.5.2
            *CLASSES                      : jar://<M2>/org/jetbrains/kotlinx/kotlinx-coroutines-core-jvm/1.5.2/kotlinx-coroutines-core-jvm-1.5.2.jar!/
        LIBRARY                       : Gradle: org.jetbrains:annotations:13.0
            *CLASSES                      : jar://<M2>/org/jetbrains/annotations/13.0/annotations-13.0.jar!/
    BUILD_TASKS
        TEST_COMPILE_MODE             : All
            CLEAN                         : <PROJECT>::app:createMockableJar, <PROJECT>::app:generateDebugAndroidTestSources, <PROJECT>::app:generateDebugSources
            ASSEMBLE                      : :app:assembleDebug, :app:assembleDebugAndroidTest, :app:assembleDebugUnitTest
            REBUILD                       : <PROJECT>::app:assembleDebug, <PROJECT>::app:assembleDebugAndroidTest, <PROJECT>::app:assembleDebugUnitTest, <PROJECT>::app:clean
            COMPILE_JAVA                  : <PROJECT>::app:compileDebugAndroidTestSources, <PROJECT>::app:compileDebugSources, <PROJECT>::app:compileDebugUnitTestSources
            SOURCE_GEN                    : <PROJECT>::app:createMockableJar, <PROJECT>::app:generateDebugAndroidTestSources, <PROJECT>::app:generateDebugSources
            BUNDLE                        : :app:bundleDebug
            APK_FROM_BUNDLE               : :app:extractApksForDebug
        TEST_COMPILE_MODE             : Android tests
            CLEAN                         : <PROJECT>::app:generateDebugAndroidTestSources, <PROJECT>::app:generateDebugSources
            ASSEMBLE                      : :app:assembleDebug, :app:assembleDebugAndroidTest
            REBUILD                       : <PROJECT>::app:assembleDebug, <PROJECT>::app:assembleDebugAndroidTest, <PROJECT>::app:clean
            COMPILE_JAVA                  : <PROJECT>::app:compileDebugAndroidTestSources, <PROJECT>::app:compileDebugSources
            SOURCE_GEN                    : <PROJECT>::app:generateDebugAndroidTestSources, <PROJECT>::app:generateDebugSources
            BUNDLE                        : :app:bundleDebug
            APK_FROM_BUNDLE               : :app:extractApksForDebug
        TEST_COMPILE_MODE             : Unit tests
            CLEAN                         : <PROJECT>::app:createMockableJar, <PROJECT>::app:generateDebugSources
            ASSEMBLE                      : :app:assembleDebug, :app:assembleDebugUnitTest
            REBUILD                       : <PROJECT>::app:assembleDebug, <PROJECT>::app:assembleDebugUnitTest, <PROJECT>::app:clean
            COMPILE_JAVA                  : <PROJECT>::app:compileDebugUnitTestSources
            SOURCE_GEN                    : <PROJECT>::app:createMockableJar, <PROJECT>::app:generateDebugSources
            BUNDLE                        : :app:bundleDebug
            APK_FROM_BUNDLE               : :app:extractApksForDebug
        TEST_COMPILE_MODE             : None
            CLEAN                         : <PROJECT>::app:generateDebugSources
            ASSEMBLE                      : :app:assembleDebug
            REBUILD                       : <PROJECT>::app:assembleDebug, <PROJECT>::app:clean
            COMPILE_JAVA                  : <PROJECT>::app:compileDebugSources
            SOURCE_GEN                    : <PROJECT>::app:generateDebugSources
            BUNDLE                        : :app:bundleDebug
            APK_FROM_BUNDLE               : :app:extractApksForDebug