{
    "executionRoleArn": "arn:aws:iam::__AWS_ACCOUNT_ID__:role/cloudwatch-synthetics-demo-ecsTaskExecutionRole",
    "taskRoleArn": "arn:aws:iam::__AWS_ACCOUNT_ID__:role/cloudwatch-synthetics-demo-ecsTaskRole",
    "containerDefinitions": [
        {
            "name": "main",
            "image": "__DOCKER_IMAGE__",
            "essential": true,
            "portMappings": [
                {
                    "hostPort": __CONTAINER_PORT__,
                    "protocol": "tcp",
                    "containerPort": __CONTAINER_PORT__
                }
            ],
            "logConfiguration": {
                "logDriver": "awslogs",
                "options": {
                    "awslogs-group": "/aws/ecs/__FAMILY__",
                    "awslogs-region": "__AWS_REGION__",
                    "awslogs-stream-prefix": "main"
                }
            },
            "environment" : [
                  {
                      "name" : "AWS_ACCOUNT_ID",
                      "value" : "__AWS_ACCOUNT_ID__"
                  }
            ]
        }
    ],
    "requiresCompatibilities": [
        "FARGATE"
    ],
    "networkMode": "awsvpc",
    "cpu": "__CPU__",
    "memory": "__MEMORY__",
    "family": "__FAMILY__"
}
