{
  "domain": "www.npmjs.com",
  "url": "https://www.npmjs.com/",
  "title": "npm | Home",
  "images": [
    "https://static-production.npmjs.com/338e4905a2684ca96e08c7780fc68412.png"
  ],
  "sitename": [
    "npm | Home"
  ],
  "favicon": "https://static-production.npmjs.com/b0f1a8318363185cc2ea6a40ac23eeb2.png",
  "source": "@avstantso/node-js--site-metadata-extractor"
}