{
  "schemas": {
    "login": {
      "loginOrEmail": {
        "required": "Enter login or e-mail"
      },
      "token": {
        "required": "Enter token",
        "matches": "Enter 128 hexadecimal characters"
      }
    },
    "registration": {
      "login": {
        "required": "Enter login"
      },
      "email": {
        "required": "Enter e-mail",
        "matches": "Enter correct e-mail"
      },
      "captcha": {
        "required": "Input text from the picture",
        "notOneOf": "Invalid text"
      }
    },
    "role": {
      "name": { "required": "Enter name" }
    }
  }
}
