module gocdk-blob

go 1.20

require (
	github.com/google/go-cmdtest v0.4.0
	github.com/google/subcommands v1.2.0
	gocloud.dev v0.34.0
)

require (
	cloud.google.com/go v0.110.7 // indirect
	cloud.google.com/go/compute v1.23.0 // indirect
	cloud.google.com/go/compute/metadata v0.2.3 // indirect
	cloud.google.com/go/iam v1.1.1 // indirect
	cloud.google.com/go/storage v1.31.0 // indirect
	github.com/aws/aws-sdk-go v1.44.314 // indirect
	github.com/aws/aws-sdk-go-v2 v1.20.0 // indirect
	github.com/aws/aws-sdk-go-v2/aws/protocol/eventstream v1.4.11 // indirect
	github.com/aws/aws-sdk-go-v2/config v1.18.32 // indirect
	github.com/aws/aws-sdk-go-v2/credentials v1.13.31 // indirect
	github.com/aws/aws-sdk-go-v2/feature/ec2/imds v1.13.7 // indirect
	github.com/aws/aws-sdk-go-v2/feature/s3/manager v1.11.76 // indirect
	github.com/aws/aws-sdk-go-v2/internal/configsources v1.1.37 // indirect
	github.com/aws/aws-sdk-go-v2/internal/endpoints/v2 v2.4.31 // indirect
	github.com/aws/aws-sdk-go-v2/internal/ini v1.3.38 // indirect
	github.com/aws/aws-sdk-go-v2/internal/v4a v1.1.0 // indirect
	github.com/aws/aws-sdk-go-v2/service/internal/accept-encoding v1.9.12 // indirect
	github.com/aws/aws-sdk-go-v2/service/internal/checksum v1.1.32 // indirect
	github.com/aws/aws-sdk-go-v2/service/internal/presigned-url v1.9.31 // indirect
	github.com/aws/aws-sdk-go-v2/service/internal/s3shared v1.15.0 // indirect
	github.com/aws/aws-sdk-go-v2/service/s3 v1.38.1 // indirect
	github.com/aws/aws-sdk-go-v2/service/sso v1.13.1 // indirect
	github.com/aws/aws-sdk-go-v2/service/ssooidc v1.15.1 // indirect
	github.com/aws/aws-sdk-go-v2/service/sts v1.21.1 // indirect
	github.com/aws/smithy-go v1.14.0 // indirect
	github.com/golang/groupcache v0.0.0-20210331224755-41bb18bfe9da // indirect
	github.com/golang/protobuf v1.5.3 // indirect
	github.com/google/go-cmp v0.5.9 // indirect
	github.com/google/renameio v0.1.0 // indirect
	github.com/google/s2a-go v0.1.4 // indirect
	github.com/google/uuid v1.3.0 // indirect
	github.com/google/wire v0.5.0 // indirect
	github.com/googleapis/enterprise-certificate-proxy v0.2.5 // indirect
	github.com/googleapis/gax-go/v2 v2.12.0 // indirect
	github.com/jmespath/go-jmespath v0.4.0 // indirect
	go.opencensus.io v0.24.0 // indirect
	golang.org/x/crypto v0.11.0 // indirect
	golang.org/x/net v0.13.0 // indirect
	golang.org/x/oauth2 v0.10.0 // indirect
	golang.org/x/sync v0.3.0 // indirect
	golang.org/x/sys v0.10.0 // indirect
	golang.org/x/text v0.11.0 // indirect
	golang.org/x/xerrors v0.0.0-20220907171357-04be3eba64a2 // indirect
	google.golang.org/api v0.134.0 // indirect
	google.golang.org/appengine v1.6.7 // indirect
	google.golang.org/genproto v0.0.0-20230731193218-e0aa005b6bdf // indirect
	google.golang.org/genproto/googleapis/api v0.0.0-20230731193218-e0aa005b6bdf // indirect
	google.golang.org/genproto/googleapis/rpc v0.0.0-20230731193218-e0aa005b6bdf // indirect
	google.golang.org/grpc v1.57.0 // indirect
	google.golang.org/protobuf v1.31.0 // indirect
	gopkg.in/yaml.v2 v2.4.0 // indirect
)
