{
  "sw-cms": {
    "blocks": {
      "commerce": {
        "extSlider": {
          "label": "Ext-Slider",
          "config": {
            "label": {
              "title": "Slider Title",
              "selection": "Products",
              "productAssignmentType": "Product Assignment",
              "productStreamSorting": "Sorting",
              "productStreamLimit": "Maximum Number of Products",
              "productStreamChoice": "Dynamic Product Group",
              "slidesPerView": "Slides per View",
              "loop": "Loop",
              "autoplay": "Autoplay",
              "autoplayDelay": "Autoplay Delay",
              "effect": {
                "label": "Effekt",
                  "slide": "Slide"
              }
            },
            "placeholder": {
              "title": "Slider Title",
              "selection": "Select Products",
              "productStreamChoice": "Choose a dynamic product group...",
              "productStreamSorting": "Choose a sorting...",
              "slidesPerView": "Enter number of slides per view",
              "autoplayDelay": "Enter delay in milliseconds"
            },
            "productAssignmentTypeOptions": {
              "manual": "Manual Assignment",
              "productStream": "Dynamic Product Group"
            },
            "productStreamSortingOptions": {
              "nameAsc": "Name Ascending",
              "nameDesc": "Name Descending",
              "priceAsc": "Price Ascending",
              "priceDesc": "Price Descending",
              "creationDateAsc": "Creation Date Ascending",
              "creationDateDesc": "Creation Date Descending",
              "random": "Random"
            },
            "effectOptions": {
              "slide": "Slide",
              "fade": "Fade",
              "cube": "Cube",
              "coverflow": "Coverflow"
            },
            "textProductStreamPreviewLink": "Preview Dynamic Product Group",
            "textProductStreamPerformanceHint": "Please note: Dynamic product groups can have a noticeable impact on performance, depending on the complexity of the product group filters and the number of slider elements on the page."
          }
        }
      }
    },
    "elements": {
      "extSlider": {
        "label": "Ext-Slider",
        "config": {
          "label": {
            "title": "Slider Title",
            "selection": "Products",
            "productAssignmentType": "Product Assignment",
            "productStreamSorting": "Sorting",
            "productStreamLimit": "Maximum Number of Products",
            "productStreamChoice": "Dynamic Product Group",
            "slidesPerView": "Slides per View",
            "loop": "Loop",
            "autoplay": "Autoplay",
            "autoplayDelay": "Autoplay Delay",
            "effect": "Effect"
          },
          "placeholder": {
            "title": "Slider Title",
            "selection": "Select Products",
            "productStreamChoice": "Choose a dynamic product group...",
            "productStreamSorting": "Choose a sorting...",
            "slidesPerView": "Enter number of slides per view",
            "autoplayDelay": "Enter delay in milliseconds"
          },
          "productAssignmentTypeOptions": {
            "manual": "Manual Assignment",
            "productStream": "Dynamic Product Group"
          },
          "productStreamSortingOptions": {
            "nameAsc": "Name Ascending",
            "nameDesc": "Name Descending",
            "priceAsc": "Price Ascending",
            "priceDesc": "Price Descending",
            "creationDateAsc": "Creation Date Ascending",
            "creationDateDesc": "Creation Date Descending",
            "random": "Random"
          },
          "effectOptions": {
            "slide": "Slide",
            "fade": "Fade",
            "cube": "Cube",
            "coverflow": "Coverflow"
          },
          "textProductStreamPreviewLink": "Preview Dynamic Product Group",
          "textProductStreamPerformanceHint": "Please note: Dynamic product groups can have a noticeable impact on performance, depending on the complexity of the product group filters and the number of slider elements on the page."
        }
      }
    }
  }
}
