<?xml version="1.0" encoding="UTF-8" standalone="no"?>
<svg xmlns:xlink="http://www.w3.org/1999/xlink" height="17.75px" width="23.05px" xmlns="http://www.w3.org/2000/svg">
  <g transform="matrix(1.0, 0.0, 0.0, 1.0, 12.05, 12.0)">
    <use height="10.65" transform="matrix(1.0, 0.0, 0.0, 1.0, -8.35, -12.0)" width="19.35" xlink:href="#shape0"/>
  </g>
  <defs>
    <g id="shape0" transform="matrix(1.0, 0.0, 0.0, 1.0, 8.35, 12.0)">
      <path d="M7.75 -9.65 L7.85 -9.5 Q11.0 -8.75 11.0 -4.5 L10.9 -2.55 Q10.6 -1.35 9.25 -1.35 L4.25 -3.5 1.75 -4.5 -0.35 -3.9 -1.9 -4.15 Q-2.9 -4.15 -4.05 -3.4 -5.15 -2.65 -5.6 -2.65 -7.5 -2.65 -8.05 -4.85 L-8.35 -6.05 Q-7.5 -9.05 -4.7 -10.45 -0.15 -12.8 4.75 -11.55 6.5 -11.1 7.75 -9.65" fill="#cccccc" fill-rule="evenodd" stroke="none"/>
    </g>
  </defs>
</svg>
