<?xml version="1.0" encoding="UTF-8" standalone="no"?>
<svg xmlns:xlink="http://www.w3.org/1999/xlink" height="6.4px" width="8.6px" xmlns="http://www.w3.org/2000/svg">
  <g transform="matrix(1.0, 0.0, 0.0, 1.0, 3.2, 4.05)">
    <path d="M4.3 -2.4 L5.4 0.15 3.35 2.35 3.65 0.15 2.1 -1.65 0.15 -1.7 -2.65 0.25 -3.2 -1.65 -0.25 -4.05 2.75 -4.0 4.3 -2.4" fill="#ffff99" fill-rule="evenodd" stroke="none"/>
  </g>
</svg>
