<?xml version="1.0" encoding="UTF-8" standalone="no"?>
<svg xmlns:xlink="http://www.w3.org/1999/xlink" height="5.2px" width="11.2px" xmlns="http://www.w3.org/2000/svg">
  <g transform="matrix(1.0, 0.0, 0.0, 1.0, 13.55, 6.6)">
    <path d="M-2.35 -1.65 L-2.55 -1.4 -2.55 -1.5 -2.35 -1.65" fill="#ffffff" fill-rule="evenodd" stroke="none"/>
    <path d="M-11.25 -2.0 L-12.3 -1.85 Q-13.35 -1.85 -13.35 -2.45 L-12.9 -3.15 -13.25 -3.15 -13.55 -3.3 Q-12.6 -4.4 -10.05 -5.75 -7.25 -7.25 -7.25 -6.1 -7.25 -5.8 -8.45 -3.8 L-9.65 -1.85 -10.25 -2.45 -11.25 -2.0" fill="#631300" fill-opacity="0.3529412" fill-rule="evenodd" stroke="none"/>
  </g>
</svg>
