<?xml version="1.0" encoding="UTF-8" standalone="no"?>
<svg xmlns:xlink="http://www.w3.org/1999/xlink" height="116.5px" width="77.7px" xmlns="http://www.w3.org/2000/svg">
  <g transform="matrix(1.0, 0.0, 0.0, 1.0, 46.95, 20.45)">
    <use height="106.4" id="_p1" transform="matrix(1.0, 0.0, 0.0, 1.0, -46.95, -10.35)" width="77.7" xlink:href="#sprite0"/>
  </g>
  <defs/>
</svg>
