<?xml version="1.0" encoding="UTF-8" standalone="no"?>
<svg xmlns:xlink="http://www.w3.org/1999/xlink" height="19.65px" width="19.65px" xmlns="http://www.w3.org/2000/svg">
  <g transform="matrix(1.0, 0.0, 0.0, 1.0, 8.7, 9.45)">
    <use height="16.25" transform="matrix(1.0, 0.0, 0.0, 1.0, -7.85, -8.45)" width="16.35" xlink:href="#shape0"/>
  </g>
  <defs>
    <g id="shape0" transform="matrix(1.0, 0.0, 0.0, 1.0, 7.85, 8.45)">
      <path d="M7.55 -4.3 Q7.05 -4.9 6.65 -5.65 L6.2 -6.3 5.75 -6.8 4.65 -7.6 3.9 -7.85 Q3.45 -7.3 3.75 -6.65 4.45 -4.9 5.55 -3.45 L6.1 -2.6 6.05 -2.55 Q4.9 -3.15 4.2 -4.35 L4.5 -2.8 4.0 -2.8 3.8 -2.3 2.7 -2.45 1.7 -1.7 1.25 -1.1 -0.1 -0.05 -0.5 -0.1 -0.7 0.3 -0.2 0.0 -3.25 2.75 -3.45 2.9 -6.3 5.6 -7.1 7.05 -7.05 6.45 -7.25 6.55 -7.7 6.3 -7.85 5.8 -7.3 5.75 Q-4.2 3.45 -1.7 0.55 L0.1 -1.2 Q1.3 -2.2 2.15 -3.5 L2.5 -4.55 2.65 -6.7 2.85 -7.75 Q2.95 -8.2 3.4 -8.45 4.45 -8.55 5.4 -7.8 7.3 -6.45 8.05 -4.2 L7.55 -4.3 M2.85 -6.6 Q2.8 -5.2 3.7 -4.35 L3.8 -4.35 3.0 -7.5 2.85 -6.6 M2.95 -3.4 L2.85 -3.55 2.6 -3.45 2.15 -2.95 Q1.9 -2.65 2.15 -2.6 L2.5 -2.75 2.9 -3.15 2.95 -3.4 M2.5 0.95 L2.75 1.1 2.7 1.1 3.1 1.3 3.3 1.5 2.75 1.45 1.25 0.7 1.0 0.5 0.95 0.45 0.7 0.3 0.95 0.1 1.0 0.15 2.0 0.75 2.5 1.0 2.5 0.95" fill="#fff7aa" fill-rule="evenodd" stroke="none"/>
      <path d="M1.7 -1.7 L2.45 -1.9 3.55 -1.7 3.95 -1.75 4.1 -2.05 4.25 -2.2 4.6 -2.05 5.3 -2.3 5.7 -2.2 5.85 -2.15 Q6.25 -2.05 6.35 -2.4 L7.85 -1.1 7.85 -1.3 Q8.25 -2.7 7.55 -4.3 L8.05 -4.2 Q8.75 -2.8 8.35 -1.35 L8.1 -0.5 7.7 -0.2 6.65 -0.3 4.05 -1.55 3.7 -1.5 Q4.15 -1.0 3.75 -0.35 L2.75 1.1 2.5 0.95 3.3 -0.6 3.05 -0.95 2.9 -1.15 2.7 -1.4 2.2 -1.55 1.25 -1.1 1.7 -1.7 M-7.1 7.05 L-6.3 5.6 -6.55 6.35 -6.2 6.05 -6.8 7.0 -6.1 7.5 -5.75 7.4 Q-4.15 7.2 -3.05 6.0 L-1.4 4.6 -0.25 3.4 Q0.95 2.8 1.55 1.8 L1.85 1.75 2.25 1.5 0.7 3.0 -1.5 5.0 -3.7 6.7 Q-4.8 7.75 -6.3 7.8 L-7.1 7.05 M-3.45 2.9 L-3.25 2.75 -3.45 3.1 Q-2.45 1.95 -1.0 1.1 0.0 -0.05 1.3 -0.85 1.75 -1.4 2.45 -1.15 L0.5 -0.1 0.95 0.1 0.7 0.3 0.4 0.55 0.0 0.35 -0.25 0.55 0.95 1.8 1.45 1.3 1.35 1.65 -1.35 4.0 -0.7 3.3 -0.95 2.95 Q-0.7 3.2 -0.65 2.85 L-0.8 2.45 Q-1.05 2.15 -1.4 2.2 L-1.55 2.35 -1.85 2.0 -2.85 2.85 -1.65 4.2 -1.95 4.6 -2.2 4.35 Q-1.65 4.15 -2.25 3.7 L-2.7 3.5 -2.95 3.5 -3.25 3.2 -4.05 3.95 -3.45 2.9 M3.1 1.3 L3.85 1.6 3.75 1.85 3.35 1.9 3.35 2.1 2.85 1.95 2.75 1.45 3.3 1.5 3.1 1.3 M1.0 0.5 L1.25 0.7 1.0 0.55 1.0 0.5 M-0.45 1.15 L-0.65 0.9 -1.35 1.5 -0.25 2.85 0.55 2.15 0.0 1.65 0.5 1.95 Q0.5 1.2 -0.4 1.1 L-0.45 1.15" fill="#ffb444" fill-rule="evenodd" stroke="none"/>
      <path d="M1.7 -1.7 L2.7 -2.45 3.8 -2.3 4.0 -2.8 4.5 -2.8 4.2 -4.35 Q4.9 -3.15 6.05 -2.55 L6.1 -2.6 5.55 -3.45 Q4.45 -4.9 3.75 -6.65 3.45 -7.3 3.9 -7.85 L4.65 -7.6 5.75 -6.8 6.2 -6.3 6.65 -5.65 Q7.05 -4.9 7.55 -4.3 8.25 -2.7 7.85 -1.3 L7.85 -1.1 6.35 -2.4 Q6.25 -2.05 5.85 -2.15 L5.7 -2.2 5.3 -2.3 4.6 -2.05 4.25 -2.2 4.1 -2.05 3.95 -1.75 3.55 -1.7 2.45 -1.9 1.7 -1.7 M-6.3 5.6 L-3.45 2.9 -4.05 3.95 -6.0 5.8 -6.2 6.05 -6.55 6.35 -6.3 5.6 M-3.25 2.75 L-0.2 0.0 -0.1 -0.05 1.25 -1.1 2.2 -1.55 2.7 -1.4 2.9 -1.15 2.6 -1.2 2.45 -1.15 Q1.75 -1.4 1.3 -0.85 0.0 -0.05 -1.0 1.1 -2.45 1.95 -3.45 3.1 L-3.25 2.75 M3.05 -0.95 L3.3 -0.6 2.5 0.95 2.5 1.0 2.0 0.75 2.4 0.35 3.0 -0.4 3.1 -0.6 3.05 -0.95 M3.75 1.85 L3.5 2.15 3.35 2.1 3.35 1.9 3.75 1.85 M2.85 1.95 L2.25 1.5 1.85 1.75 1.55 1.8 Q0.95 2.8 -0.25 3.4 L-1.4 4.6 -3.05 6.0 Q-4.15 7.2 -5.75 7.4 L-1.95 4.6 -1.65 4.2 -1.35 4.0 1.35 1.65 1.45 1.3 0.4 0.55 0.7 0.3 0.95 0.45 1.0 0.5 1.0 0.55 1.25 0.7 2.75 1.45 2.85 1.95 M-0.45 1.15 L-0.4 1.1 Q0.5 1.2 0.5 1.95 L0.0 1.65 -0.45 1.15 M-1.55 2.35 L-1.4 2.2 Q-1.05 2.15 -0.8 2.45 L-0.65 2.85 Q-0.7 3.2 -0.95 2.95 L-1.55 2.35 M-2.95 3.5 L-2.7 3.5 -2.25 3.7 Q-1.65 4.15 -2.2 4.35 L-2.95 3.5" fill="#af6a03" fill-rule="evenodd" stroke="none"/>
      <path d="M-0.2 0.0 L-0.7 0.3 -0.5 -0.1 -0.1 -0.05 -0.2 0.0 M2.95 -3.4 L2.9 -3.15 2.5 -2.75 2.15 -2.6 Q1.9 -2.65 2.15 -2.95 L2.6 -3.45 2.85 -3.55 2.95 -3.4 M2.85 -6.6 L3.0 -7.5 3.8 -4.35 3.7 -4.35 Q2.8 -5.2 2.85 -6.6" fill="#ffffff" fill-rule="evenodd" stroke="none"/>
    </g>
  </defs>
</svg>
