<?xml version="1.0" encoding="UTF-8" standalone="no"?>
<svg xmlns:xlink="http://www.w3.org/1999/xlink" height="2.7px" width="2.95px" xmlns="http://www.w3.org/2000/svg">
  <g transform="matrix(1.0, 0.0, 0.0, 1.0, 7.05, 3.8)">
    <path d="M-4.25 -3.4 L-4.1 -2.9 Q-4.1 -1.5 -5.8 -1.15 -7.05 -0.85 -7.05 -2.15 L-6.45 -3.05 Q-5.8 -3.7 -5.35 -3.8 L-4.85 -3.8 Q-4.4 -3.9 -4.25 -3.4" fill="#ffffff" fill-opacity="0.8" fill-rule="evenodd" stroke="none"/>
  </g>
</svg>
