<?xml version="1.0" encoding="UTF-8" standalone="no"?>
<svg xmlns:xlink="http://www.w3.org/1999/xlink" height="15.65px" width="15.7px" xmlns="http://www.w3.org/2000/svg">
  <g transform="matrix(1.0, 0.0, 0.0, 1.0, 7.85, 7.75)">
    <path d="M-3.45 -0.55 L3.25 -7.05 7.85 -7.75 7.05 -3.75 0.7 3.6 -3.45 -0.55" fill="#e0e8eb" fill-rule="evenodd" stroke="none"/>
    <path d="M0.7 3.6 L1.2 5.9 -1.05 4.35 -6.3 7.9 -7.85 6.45 -4.5 0.7 -6.05 -1.35 -3.45 -0.55 0.7 3.6" fill="#000000" fill-rule="evenodd" stroke="none"/>
  </g>
</svg>
