<?xml version="1.0" encoding="UTF-8" standalone="no"?>
<svg xmlns:xlink="http://www.w3.org/1999/xlink" height="6.1px" width="17.4px" xmlns="http://www.w3.org/2000/svg">
  <g transform="matrix(1.0, 0.0, 0.0, 1.0, 9.15, 6.95)">
    <path d="M7.8 -1.15 Q7.4 -0.85 7.05 -0.85 6.55 -0.85 6.2 -1.35 L5.95 -1.9 6.4 -3.35 5.9 -4.5 Q5.4 -5.65 5.4 -5.95 5.4 -8.3 8.25 -1.85 L7.8 -1.15 M-6.85 -6.65 L-7.2 -5.15 -6.95 -4.5 Q-6.95 -3.75 -7.2 -2.95 -7.55 -1.7 -8.3 -1.7 -9.0 -1.7 -9.15 -2.4 L-7.0 -6.95 -6.85 -6.65" fill="#ffffff" fill-rule="evenodd" stroke="none"/>
  </g>
</svg>
