<?xml version="1.0" encoding="UTF-8" standalone="no"?>
<svg xmlns:xlink="http://www.w3.org/1999/xlink" height="5.05px" width="4.05px" xmlns="http://www.w3.org/2000/svg">
  <g transform="matrix(1.0, 0.0, 0.0, 1.0, 2.1, 2.5)">
    <path d="M-1.8 -1.7 L-0.9 -2.5 0.65 -2.5 1.95 -1.45 1.95 1.45 0.5 2.25 0.1 -0.65 -1.8 -1.7" fill="#910909" fill-rule="evenodd" stroke="none"/>
    <path d="M0.5 2.25 L-0.15 2.55 -2.1 1.45 -2.1 -1.45 -1.8 -1.7 0.1 -0.65 0.5 2.25" fill="#e00e0e" fill-rule="evenodd" stroke="none"/>
  </g>
</svg>
