<?xml version="1.0" encoding="UTF-8" standalone="no"?>
<svg xmlns:xlink="http://www.w3.org/1999/xlink" height="4.0px" width="108.8px" xmlns="http://www.w3.org/2000/svg">
  <g transform="matrix(1.0, 0.0, 0.0, 1.0, 54.4, 2.0)">
    <path d="M50.8 -2.0 Q58.0 0.0 50.8 2.0 L-49.2 2.0 Q-59.55 0.65 -49.2 -2.0 L50.8 -2.0" fill="#67b913" fill-rule="evenodd" stroke="none"/>
  </g>
</svg>
