<?xml version="1.0" encoding="UTF-8" standalone="no"?>
<svg xmlns:xlink="http://www.w3.org/1999/xlink" height="32.65px" width="498.25px" xmlns="http://www.w3.org/2000/svg">
  <g transform="matrix(1.0, 0.0, 0.0, 1.0, 249.1, 16.35)">
    <use height="32.65" id="+Da3+" transform="matrix(1.5, 0.0, 0.0, 1.0, -249.1, -16.35)" width="332.15" xlink:href="#text0"/>
  </g>
  <defs/>
</svg>
