{
  "contracts": {
    "Dao": {
      "address": "0x63eca4187381ef51b4654efcab45b074e57ca4d8",
      "constructorCode": "608060405233600160006101000a81548173ffffffffffffffffffffffffffffffffffffffff021916908373ffffffffffffffffffffffffffffffffffffffff160217905550611fe0806100546000396000f300",
      "bodyBytecodeHash": "6f4d5622204ce8b3ebc41985900c1fcba695718f0a4da42e10044ac97f2b1a5c",
      "bytecodeHash": "663ef5acac99b54ed53a26d68978511ad9b4eefd99272df32a5f5befaf5ac47f"
    },
    "CanYaCoin": {
      "address": "0xb31b2e6e995f2e4682652c3c9edea0b99eb887f0",
      "constructorCode": "608060405234801561001057600080fd5b506006600a0a6305f5e100026000803373ffffffffffffffffffffffffffffffffffffffff1673ffffffffffffffffffffffffffffffffffffffff16815260200190815260200160002081905550610bd38061006d6000396000f300",
      "bodyBytecodeHash": "90f1b924151569958e949828a42e4bf09f190bfcd1d05aceaee6b802a38fda88",
      "bytecodeHash": "6a82854f6b8c52a86da22fd9fd2c6780fdcf5e0e8399411d92834fde721992d4"
    }
  },
  "proxies": {},
  "app": {
    "address": "0x0cc7005d2cb507bc1070d2f3c388881d67a18917"
  },
  "version": "0.1.0",
  "package": {
    "address": "0x58332b57e5468b3933b99fce4cfedad056ca0823"
  },
  "provider": {
    "address": "0xcd4c40d16359c02f93fbf65877b3865ff3740343"
  }
}