module gitlab.com/avdgian.pavel/cerberus

go 1.18

require (
	github.com/go-kit/kit v0.12.0
	github.com/google/uuid v1.3.0
	github.com/joho/godotenv v1.4.0
	gopkg.in/oauth2.v3 v3.12.0
)

require (
	github.com/dgrijalva/jwt-go v3.2.0+incompatible // indirect
	github.com/go-kit/log v0.2.0 // indirect
	github.com/go-logfmt/logfmt v0.5.1 // indirect
	github.com/tidwall/btree v0.0.0-20170113224114-9876f1454cf0 // indirect
	github.com/tidwall/buntdb v1.1.0 // indirect
	github.com/tidwall/gjson v1.3.2 // indirect
	github.com/tidwall/grect v0.0.0-20161006141115-ba9a043346eb // indirect
	github.com/tidwall/match v1.0.1 // indirect
	github.com/tidwall/pretty v1.0.0 // indirect
	github.com/tidwall/rtree v0.0.0-20180113144539-6cd427091e0e // indirect
	github.com/tidwall/tinyqueue v0.0.0-20180302190814-1e39f5511563 // indirect
)
