Date : 2022-06-13 10:03:33
Directory : c:\Users\avazs.LAPTOP-I4FB2CH8\StudioProjects\My_Store
Total : 0 files,  0 codes, 0 comments, 0 blanks, all 0 lines

Languages
+----------+------------+------------+------------+------------+------------+
| language | files      | code       | comment    | blank      | total      |
+----------+------------+------------+------------+------------+------------+
+----------+------------+------------+------------+------------+------------+

Directories
+------+------------+------------+------------+------------+------------+
| path | files      | code       | comment    | blank      | total      |
+------+------------+------------+------------+------------+------------+
+------+------------+------------+------------+------------+------------+

Files
+----------+----------+------------+------------+------------+------------+
| filename | language | code       | comment    | blank      | total      |
+----------+----------+------------+------------+------------+------------+
| Total    |          |          0 |          0 |          0 |          0 |
+----------+----------+------------+------------+------------+------------+