###############################################################################
#  SPR-KKR input file    Fe_EKREL.inp 
#  created by xband on Thu Sep 19 00:07:17 EDT 2019
###############################################################################
 
CONTROL  DATASET     = Fe 
         ADSI        = EKREL 
         POTFIL      = Fe.pot 
         PRINT = 0    
 
TASK     EKREL   EMIN=-0.1  EMAX=1.0 Ry  NE=200
         NK = 300    KPATH = 5
