10001    SPACEGROUP_AP 
    1.000000000000     1.000000000000    90.000000000000    90.000000000000     90.000000000000 
1     NCL 
    0.500000000000     0.500000000000     0.500000000000  tauX  tauY  tauZ    ICL:  1   NQCL:  1  
 0 0 0    magnetization direction
