###############################################################################
#  SPR-KKR input file    Fe_SCF.inp 
#  created by xband on Thu Sep 19 00:22:33 EDT 2019
###############################################################################
 
CONTROL  DATASET     = Fe 
         ADSI        = SCF 
         POTFIL      = Fe.pot 
         PRINT = 0    
 
MODE     OP = LDA+U-AL   
         LOPT  = { d }
         UEFF1 = 1.00 eV   JEFF1 = 0.90 eV 
 
TAU      BZINT= POINTS  NKTAB= 250 
 
ENERGY   GRID={5}  NE={32} 
         ImE=0.0 Ry   EMIN=-0.2 Ry
 
SCF      NITER=200 MIX=0.20 VXC=VWN
         TOL=0.00001  MIXOP=0.20  ISTBRY=1 
         FULLPOT 
         QIONSCL=1.0 
         NOSSITER 
