###############################################################################
#  SPR-KKR input file    Fe_LDA+U_DOS.inp 
#  created by xband on Thu Sep 19 00:24:49 EDT 2019
###############################################################################
 
CONTROL  DATASET     = Fe 
         ADSI        = DOS LDA+U 
         POTFIL      = Fe.pot 
         PRINT = 0    
 
MODE     OP = LDA+U-AL   
         LOPT  = { n }
         UEFF1 = 1 eV   JEFF1 = 0.90 eV 
 
TAU      BZINT= POINTS  NKTAB= 250 
 
ENERGY   GRID={3}  NE={50} 
         ImE=0.01 Ry   EMIN=-0.2   EMAX=1.0 Ry
 
TASK     DOS
