GEOMETRY:  all done for optimisation_of_basis_vectors_3D
ERROR FLAG          0
NO CHANGES
   0.000000000000000   0.000000000000000   0.000000000000000
   0.500000000000000   0.500000000000000   0.500000000000000
