name of system file
Fe.sys
task
optimisation_of_basis_vectors_3D
primitive vectors     (cart. coord.) [A]
  -0.500000000000000   0.500000000000000   0.500000000000000
   0.500000000000000  -0.500000000000000   0.500000000000000
   0.500000000000000   0.500000000000000  -0.500000000000000
number of sites NQ
  1
    1     0.000000000000000   0.000000000000000   0.000000000000000
