# SCF ITER    RMSAVV    RMSAVB    EFERMI    SHFTEF  TOTDOSEF MUESPN   MUEORB           ETOT     Lloyd scaling
    1    1    0.0762   -1.0351   0.74883  -0.01254   9.638   2.2420   0.0555      -2541.17504690  0.00000000
    2    2   -0.0237   -1.1171   0.74155  -0.00728  10.593   2.2222   0.0536      -2541.17448083  0.00000000
    3    3   -1.6540   -1.9936   0.72705  -0.01449  11.048   2.3167   0.0523      -2541.17565109  0.00000000
    4    4   -2.3619   -1.9639   0.72454  -0.00251  13.218   2.2244   0.0519      -2541.17419459  0.00000000
    5    5   -2.7180   -2.0424   0.72392  -0.00062  13.066   2.2205   0.0516      -2541.17418691  0.00000000
    6    6   -3.0033   -2.1944   0.72355  -0.00037  12.875   2.2185   0.0516      -2541.17417807  0.00000000
    7    7   -3.0029   -3.2317   0.72344  -0.00012  12.597   2.2142   0.0515      -2541.17417109  0.00000000
    8    8   -3.4595   -3.3767   0.72359   0.00015  12.712   2.2136   0.0514      -2541.17418473  0.00000000
    9    9   -3.9610   -3.5769   0.72366   0.00007  12.639   2.2134   0.0514      -2541.17418395  0.00000000
   10   10   -3.9481   -3.5454   0.72370   0.00004  12.616   2.2134   0.0514      -2541.17418400  0.00000000
   11   11   -4.0107   -3.5957   0.72371   0.00002  12.598   2.2132   0.0514      -2541.17418357  0.00000000
   12   12   -4.2914   -4.0873   0.72374   0.00003  12.570   2.2125   0.0514      -2541.17418265  0.00000000
   13   13   -4.1379   -4.3429   0.72374   0.00000  12.553   2.2125   0.0514      -2541.17418163  0.00000000
   14   14   -4.2518   -4.4325   0.72375   0.00001  12.553   2.2124   0.0514      -2541.17418186  0.00000000
   15   15   -4.4919   -4.6284   0.72375   0.00000  12.552   2.2124   0.0514      -2541.17418197  0.00000000
   16   16   -5.0810   -5.5102   0.72375   0.00000  12.552   2.2124   0.0514      -2541.17418219  0.00000000
