{
    "dialect": "postgresql",
    "database": "${POSTGRES_DB}",
    "username": "${POSTGRES_USER}",
    "password": "${POSTGRES_PASSWORD}",
    "host": "${POSTGRES_HOST}",
    "port": ${POSTGRES_PORT},
    "params": {
      "sslmode": "disable"
    },
    "max_idle_conns": 10,
    "max_open_conns": 100,
    "log_level": "warn"
}
