{
    "serverRoot": "${VIRTUAL_PROTO}://${VIRTUAL_HOST}:${VIRTUAL_PORT}",
    "port": ${VIRTUAL_PORT},
    "dbtype": "postgres",
    "dbconfig": "postgres://${POSTGRES_USER}:${POSTGRES_PASSWORD}@${POSTGRES_HOST}/${POSTGRES_DB}?sslmode=disable&connect_timeout=60",
    "postgres_dbconfig": "dbname=${POSTGRES_DB} sslmode=disable",
    "useSSL": ${FOCALBOARD_SSL},
    "webpath": "./pack",
    "filespath": "./files",
    "telemetry": false,
    "session_expire_time": 2592000,
    "session_refresh_time": 18000,
    "localOnly": false,
    "enableLocalMode": true
}
