{
  "builders": [
    {
      "CPUs": "{{user `linux_cpus`}}",
      "RAM": "{{user `linux_ram`}}",
      "RAM_reserve_all": false,
      "boot_command": [
        "{{user `boot_command`}}"
      ],
      "boot_wait": "10s",
      "cluster": "{{user `vsphere_cluster`}}",
      "convert_to_template": "False",
      "create_snapshot": "False",
      "datacenter": "{{user `datacenter`}}",
      "datastore": "{{user `vsphere_datastore`}}",
      "disk_controller_type": "lsilogic-sas",
      "folder": "{{user `vm_folder`}}",
      "guest_os_type": "{{user `os_guest`}}",
      "host": "{{user `esxi_host`}}",
      "insecure_connection": "true",
      "ip_wait_timeout": "{{user `ip_wait_timeout`}}",
      "iso_paths": [
        "{{user `iso_path`}}"
      ],
      "network_adapters": [
        {
          "network": "{{user `network`}}",
          "network_card": "vmxnet3"
        }
      ],
      "password": "{{user `vsphere_password`}}",
      "ssh_password": "{{user `vm_password`}}",
      "ssh_timeout": "{{user `ssh_wait_timeout`}}",
      "ssh_username": "{{user `vm_user`}}",
      "storage": [
        {
          "disk_size": "{{user `linux_disk`}}",
          "disk_thin_provisioned": true
        }
      ],
      "type": "vsphere-iso",
      "username": "{{user `vsphere_user`}}",
      "vcenter_server": "{{user `vcenter_server`}}",
      "vm_name": "{{user `vm_name`}}"
    }
  ],
  "provisioners": [
    {
      "destination": "{{user `helpers_dest`}}",
      "source": "{{user `helpers_src`}}",
      "type": "file"
    },
    {
      "execute_command": "echo '{{user `vm_password`}}' | {{.Vars}} sudo -S -E sh '{{.Path}}' '{{user `os_variant`}}' '{{user `vm_name`}}' '{{user `file_server`}}' '{{user `helpers_dest`}}'",
      "scripts": [
        "{{user `setup_script`}}"
      ],
      "type": "shell"
    }
  ],
  "variables": {
    "boot_command": "{{env `boot_command`}}"
  }
}

