{
  "variables":{
    "boot_command":"{{env `boot_command`}}"
  },

  "builders": [
    {
      "type": "vsphere-iso",

      "vcenter_server":      "{{user `vcenter_server`}}",
      "username":            "{{user `vsphere_user`}}",
      "password":            "{{user `vsphere_password`}}",
      "insecure_connection": "true",
      "datacenter":          "{{user `datacenter`}}",

      "vm_name": "{{user `vm_name`}}",
      "folder": "{{user `vm_folder`}}",
      "cluster": "{{user `vsphere_cluster`}}",
      "host":"{{user `esxi_host`}}",
      "datastore": "{{user `vsphere_datastore`}}",

      "create_snapshot": "False",
      "convert_to_template": "False",

      "guest_os_type": "{{user `os_guest`}}",

      "ssh_username": "{{user `vm_user`}}",
      "ssh_password": "{{user `vm_password`}}",

      "CPUs":             "{{user `linux_cpus`}}",
      "RAM":              "{{user `linux_ram`}}",
      "RAM_reserve_all": false,

      "disk_controller_type":  "lsilogic-sas",
      "disk_size":        "{{user `linux_disk`}}",
      "disk_thin_provisioned": true,

      "network": "{{user `network`}}",
      "network_card": "e1000",

      "iso_paths": [
        "{{user `iso_path`}}"
      ],
      "ip_wait_timeout":"{{user `ip_wait_timeout`}}",
      "ssh_timeout":"{{user `ssh_wait_timeout`}}",
      "boot_wait":"10s",
      "boot_command": [
        "{{user `boot_command`}}"
      ]
    }
  ],

  "provisioners": [
    {
        "type": "file",
        "source":"{{user `helpers_src`}}",
        "destination":"{{user `helpers_dest`}}"
    },
    {
	  "type": "shell",
      "execute_command": "echo '{{user `vm_password`}}' | {{.Vars}} sudo -S bash '{{.Path}}' '{{user `os_variant`}}' '{{user `vm_name`}}' '{{user `file_server`}}' '{{user `helpers_dest`}}'",
	  "scripts": [
	    "{{user `setup_script`}}"
      ]
    }
  ]
}
