{
    "description": "Layer mapping",
    "mappings": [
        {
            "name": "BackGroundLayer",
            "role" : "map|radio|music|video",
            "type" : "stack",
            "id_range_begin": 0,
            "id_range_end": 0,
            "comment": "Work Around: This is evacuation layer that not stopping event loop"
        },
        {
            "name": "FarHomeScreen",
            "role": "",
            "type": "stack",
            "id_range_begin": 100,
            "id_range_end": 199,
            "comment": "FarHomeScreen is the part of HomeScreen. The z order of this layer is lower than NearHomeScreen"
        },
        {
            "name": "Apps",
            "role": "music|video|browser|radio|phone|map|navigation|hvac|settings|dashboard|poi|mixer|sdl|launcher|receiver|tachometer|fallback",
            "type": "tile",
            "id_range_begin": 1000,
            "id_range_end": 2999,
            "comment": "Range of IDs that will always be placed on layer 1001"
        },
        {
            "name": "NearHomeScreen",
            "role": "homescreen",
            "type": "tile",
            "id_range_begin": 3000,
            "id_range_end": 3000,
            "comment": "TOYOTA special software keyboard"
        },
        {
            "name": "Application Popup Layer",
            "role": "popup*",
            "type": "stack",
            "id_range_begin": 4000,
            "id_range_end": 4999,
            "comment": "[T.B.D]This layer is for application popup layer"
        },
        {
            "name": "Restriction",
            "role": "restriction",
            "type": "stack",
            "id_range_begin": 5000,
            "id_range_end": 5999,
            "comment": "This layer is for restriction notification. This is used by restriction role"
        },
        {
            "name": "OnScreen",
            "role": "^on_screen*",
            "type": "stack",
            "id_range_begin": 6000,
            "id_range_end": 6999,
            "comment": "Range of IDs that will always be placed on the OnScreen layer, that gets a very high 'dummy' id of 9999"
        },
        {
            "name": "Remote",
            "role": "tbtnavi",
            "type": "stack",
            "id_range_begin": 9000,
            "id_range_end": 9999,
            "comment": "Range of IDs that will always be placed on the OnScreen layer, that gets a very high 'dummy' id of 9999"
        }
    ]
}
