<?xml version="1.0" encoding="UTF-8"?>
<svg xmlns="http://www.w3.org/2000/svg" xmlns:xlink="http://www.w3.org/1999/xlink" width="923px" height="261px" viewBox="0 0 923 261" version="1.1">
<defs>
<g>
<symbol overflow="visible" id="glyph0-0">
<path style="stroke:none;" d="M 0.4375 1.546875 L 0.4375 -6.1875 L 4.8125 -6.1875 L 4.8125 1.546875 Z M 0.921875 1.0625 L 4.328125 1.0625 L 4.328125 -5.6875 L 0.921875 -5.6875 Z M 0.921875 1.0625 "/>
</symbol>
<symbol overflow="visible" id="glyph0-1">
<path style="stroke:none;" d="M 2.984375 -5.53125 L 1.8125 -2.359375 L 4.171875 -2.359375 Z M 2.5 -6.390625 L 3.484375 -6.390625 L 5.90625 0 L 5.015625 0 L 4.4375 -1.640625 L 1.5625 -1.640625 L 0.984375 0 L 0.0625 0 Z M 2.5 -6.390625 "/>
</symbol>
<symbol overflow="visible" id="glyph0-2">
<path style="stroke:none;" d="M 4.796875 -2.890625 L 4.796875 0 L 4.015625 0 L 4.015625 -2.875 C 4.015625 -3.320312 3.925781 -3.65625 3.75 -3.875 C 3.570312 -4.101562 3.304688 -4.21875 2.953125 -4.21875 C 2.523438 -4.21875 2.1875 -4.082031 1.9375 -3.8125 C 1.695312 -3.539062 1.578125 -3.171875 1.578125 -2.703125 L 1.578125 0 L 0.796875 0 L 0.796875 -4.796875 L 1.578125 -4.796875 L 1.578125 -4.046875 C 1.765625 -4.335938 1.984375 -4.550781 2.234375 -4.6875 C 2.492188 -4.832031 2.789062 -4.90625 3.125 -4.90625 C 3.675781 -4.90625 4.09375 -4.734375 4.375 -4.390625 C 4.65625 -4.054688 4.796875 -3.554688 4.796875 -2.890625 Z M 4.796875 -2.890625 "/>
</symbol>
<symbol overflow="visible" id="glyph0-3">
<path style="stroke:none;" d="M 3 -2.40625 C 2.363281 -2.40625 1.921875 -2.332031 1.671875 -2.1875 C 1.429688 -2.039062 1.3125 -1.796875 1.3125 -1.453125 C 1.3125 -1.171875 1.398438 -0.945312 1.578125 -0.78125 C 1.765625 -0.613281 2.019531 -0.53125 2.34375 -0.53125 C 2.769531 -0.53125 3.113281 -0.6875 3.375 -1 C 3.644531 -1.3125 3.78125 -1.722656 3.78125 -2.234375 L 3.78125 -2.40625 Z M 4.5625 -2.734375 L 4.5625 0 L 3.78125 0 L 3.78125 -0.734375 C 3.601562 -0.441406 3.378906 -0.222656 3.109375 -0.078125 C 2.835938 0.0546875 2.507812 0.125 2.125 0.125 C 1.632812 0.125 1.242188 -0.0078125 0.953125 -0.28125 C 0.671875 -0.5625 0.53125 -0.929688 0.53125 -1.390625 C 0.53125 -1.929688 0.707031 -2.335938 1.0625 -2.609375 C 1.425781 -2.890625 1.960938 -3.03125 2.671875 -3.03125 L 3.78125 -3.03125 L 3.78125 -3.109375 C 3.78125 -3.460938 3.660156 -3.738281 3.421875 -3.9375 C 3.179688 -4.132812 2.847656 -4.234375 2.421875 -4.234375 C 2.148438 -4.234375 1.882812 -4.203125 1.625 -4.140625 C 1.363281 -4.078125 1.113281 -3.976562 0.875 -3.84375 L 0.875 -4.578125 C 1.164062 -4.691406 1.445312 -4.773438 1.71875 -4.828125 C 1.988281 -4.878906 2.25 -4.90625 2.5 -4.90625 C 3.195312 -4.90625 3.710938 -4.722656 4.046875 -4.359375 C 4.390625 -4.003906 4.5625 -3.460938 4.5625 -2.734375 Z M 4.5625 -2.734375 "/>
</symbol>
<symbol overflow="visible" id="glyph0-4">
<path style="stroke:none;" d="M 0.828125 -6.65625 L 1.609375 -6.65625 L 1.609375 0 L 0.828125 0 Z M 0.828125 -6.65625 "/>
</symbol>
<symbol overflow="visible" id="glyph0-5">
<path style="stroke:none;" d="M 2.8125 0.4375 C 2.59375 1.007812 2.375 1.382812 2.15625 1.5625 C 1.945312 1.738281 1.664062 1.828125 1.3125 1.828125 L 0.6875 1.828125 L 0.6875 1.171875 L 1.15625 1.171875 C 1.375 1.171875 1.539062 1.117188 1.65625 1.015625 C 1.78125 0.910156 1.914062 0.664062 2.0625 0.28125 L 2.203125 -0.078125 L 0.265625 -4.796875 L 1.09375 -4.796875 L 2.59375 -1.046875 L 4.078125 -4.796875 L 4.921875 -4.796875 Z M 2.8125 0.4375 "/>
</symbol>
<symbol overflow="visible" id="glyph0-6">
<path style="stroke:none;" d="M 3.875 -4.65625 L 3.875 -3.90625 C 3.65625 -4.019531 3.425781 -4.101562 3.1875 -4.15625 C 2.945312 -4.21875 2.695312 -4.25 2.4375 -4.25 C 2.050781 -4.25 1.757812 -4.1875 1.5625 -4.0625 C 1.363281 -3.945312 1.265625 -3.769531 1.265625 -3.53125 C 1.265625 -3.34375 1.332031 -3.195312 1.46875 -3.09375 C 1.613281 -2.988281 1.894531 -2.890625 2.3125 -2.796875 L 2.59375 -2.75 C 3.144531 -2.625 3.535156 -2.453125 3.765625 -2.234375 C 4.003906 -2.015625 4.125 -1.710938 4.125 -1.328125 C 4.125 -0.878906 3.945312 -0.523438 3.59375 -0.265625 C 3.25 -0.00390625 2.769531 0.125 2.15625 0.125 C 1.894531 0.125 1.625 0.0976562 1.34375 0.046875 C 1.070312 -0.00390625 0.78125 -0.078125 0.46875 -0.171875 L 0.46875 -0.984375 C 0.757812 -0.835938 1.046875 -0.722656 1.328125 -0.640625 C 1.609375 -0.566406 1.890625 -0.53125 2.171875 -0.53125 C 2.535156 -0.53125 2.816406 -0.59375 3.015625 -0.71875 C 3.222656 -0.851562 3.328125 -1.035156 3.328125 -1.265625 C 3.328125 -1.472656 3.253906 -1.632812 3.109375 -1.75 C 2.960938 -1.863281 2.644531 -1.972656 2.15625 -2.078125 L 1.890625 -2.15625 C 1.398438 -2.25 1.046875 -2.398438 0.828125 -2.609375 C 0.617188 -2.828125 0.515625 -3.125 0.515625 -3.5 C 0.515625 -3.945312 0.671875 -4.289062 0.984375 -4.53125 C 1.304688 -4.78125 1.757812 -4.90625 2.34375 -4.90625 C 2.632812 -4.90625 2.90625 -4.882812 3.15625 -4.84375 C 3.414062 -4.800781 3.65625 -4.738281 3.875 -4.65625 Z M 3.875 -4.65625 "/>
</symbol>
<symbol overflow="visible" id="glyph0-7">
<path style="stroke:none;" d="M 4.921875 -2.59375 L 4.921875 -2.203125 L 1.296875 -2.203125 C 1.335938 -1.660156 1.503906 -1.25 1.796875 -0.96875 C 2.085938 -0.6875 2.492188 -0.546875 3.015625 -0.546875 C 3.316406 -0.546875 3.609375 -0.582031 3.890625 -0.65625 C 4.171875 -0.726562 4.453125 -0.835938 4.734375 -0.984375 L 4.734375 -0.25 C 4.453125 -0.125 4.160156 -0.03125 3.859375 0.03125 C 3.566406 0.09375 3.269531 0.125 2.96875 0.125 C 2.195312 0.125 1.585938 -0.0976562 1.140625 -0.546875 C 0.703125 -0.992188 0.484375 -1.59375 0.484375 -2.34375 C 0.484375 -3.132812 0.691406 -3.757812 1.109375 -4.21875 C 1.535156 -4.675781 2.109375 -4.90625 2.828125 -4.90625 C 3.472656 -4.90625 3.984375 -4.695312 4.359375 -4.28125 C 4.734375 -3.863281 4.921875 -3.300781 4.921875 -2.59375 Z M 4.125 -2.828125 C 4.125 -3.253906 4.003906 -3.59375 3.765625 -3.84375 C 3.535156 -4.101562 3.226562 -4.234375 2.84375 -4.234375 C 2.394531 -4.234375 2.039062 -4.109375 1.78125 -3.859375 C 1.519531 -3.617188 1.367188 -3.273438 1.328125 -2.828125 Z M 4.125 -2.828125 "/>
</symbol>
<symbol overflow="visible" id="glyph0-8">
<path style="stroke:none;" d=""/>
</symbol>
<symbol overflow="visible" id="glyph0-9">
<path style="stroke:none;" d="M 3.59375 -4.0625 C 3.507812 -4.113281 3.414062 -4.148438 3.3125 -4.171875 C 3.207031 -4.191406 3.09375 -4.203125 2.96875 -4.203125 C 2.519531 -4.203125 2.175781 -4.054688 1.9375 -3.765625 C 1.695312 -3.484375 1.578125 -3.070312 1.578125 -2.53125 L 1.578125 0 L 0.796875 0 L 0.796875 -4.796875 L 1.578125 -4.796875 L 1.578125 -4.046875 C 1.742188 -4.335938 1.957031 -4.550781 2.21875 -4.6875 C 2.488281 -4.832031 2.816406 -4.90625 3.203125 -4.90625 C 3.253906 -4.90625 3.3125 -4.898438 3.375 -4.890625 C 3.4375 -4.890625 3.507812 -4.878906 3.59375 -4.859375 Z M 3.59375 -4.0625 "/>
</symbol>
<symbol overflow="visible" id="glyph0-10">
<path style="stroke:none;" d="M -0.03125 -6.390625 L 5.375 -6.390625 L 5.375 -5.65625 L 3.109375 -5.65625 L 3.109375 0 L 2.234375 0 L 2.234375 -5.65625 L -0.03125 -5.65625 Z M -0.03125 -6.390625 "/>
</symbol>
<symbol overflow="visible" id="glyph0-11">
<path style="stroke:none;" d="M 1.578125 -0.71875 L 1.578125 1.828125 L 0.796875 1.828125 L 0.796875 -4.796875 L 1.578125 -4.796875 L 1.578125 -4.0625 C 1.742188 -4.351562 1.953125 -4.566406 2.203125 -4.703125 C 2.460938 -4.835938 2.765625 -4.90625 3.109375 -4.90625 C 3.691406 -4.90625 4.164062 -4.671875 4.53125 -4.203125 C 4.894531 -3.742188 5.078125 -3.140625 5.078125 -2.390625 C 5.078125 -1.640625 4.894531 -1.03125 4.53125 -0.5625 C 4.164062 -0.101562 3.691406 0.125 3.109375 0.125 C 2.765625 0.125 2.460938 0.0546875 2.203125 -0.078125 C 1.953125 -0.222656 1.742188 -0.4375 1.578125 -0.71875 Z M 4.265625 -2.390625 C 4.265625 -2.972656 4.144531 -3.425781 3.90625 -3.75 C 3.664062 -4.082031 3.335938 -4.25 2.921875 -4.25 C 2.503906 -4.25 2.175781 -4.082031 1.9375 -3.75 C 1.695312 -3.425781 1.578125 -2.972656 1.578125 -2.390625 C 1.578125 -1.816406 1.695312 -1.363281 1.9375 -1.03125 C 2.175781 -0.695312 2.503906 -0.53125 2.921875 -0.53125 C 3.335938 -0.53125 3.664062 -0.695312 3.90625 -1.03125 C 4.144531 -1.363281 4.265625 -1.816406 4.265625 -2.390625 Z M 4.265625 -2.390625 "/>
</symbol>
<symbol overflow="visible" id="glyph0-12">
<path style="stroke:none;" d="M 2.71875 -6.65625 C 2.332031 -6 2.046875 -5.347656 1.859375 -4.703125 C 1.671875 -4.054688 1.578125 -3.40625 1.578125 -2.75 C 1.578125 -2.09375 1.671875 -1.441406 1.859375 -0.796875 C 2.046875 -0.148438 2.332031 0.5 2.71875 1.15625 L 2.03125 1.15625 C 1.601562 0.488281 1.28125 -0.164062 1.0625 -0.8125 C 0.851562 -1.46875 0.75 -2.113281 0.75 -2.75 C 0.75 -3.382812 0.851562 -4.023438 1.0625 -4.671875 C 1.28125 -5.316406 1.601562 -5.976562 2.03125 -6.65625 Z M 2.71875 -6.65625 "/>
</symbol>
<symbol overflow="visible" id="glyph0-13">
<path style="stroke:none;" d="M 3.25 -6.65625 L 3.25 -6 L 2.5 -6 C 2.21875 -6 2.019531 -5.941406 1.90625 -5.828125 C 1.800781 -5.710938 1.75 -5.507812 1.75 -5.21875 L 1.75 -4.796875 L 3.03125 -4.796875 L 3.03125 -4.1875 L 1.75 -4.1875 L 1.75 0 L 0.953125 0 L 0.953125 -4.1875 L 0.203125 -4.1875 L 0.203125 -4.796875 L 0.953125 -4.796875 L 0.953125 -5.125 C 0.953125 -5.65625 1.078125 -6.039062 1.328125 -6.28125 C 1.578125 -6.53125 1.96875 -6.65625 2.5 -6.65625 Z M 3.25 -6.65625 "/>
</symbol>
<symbol overflow="visible" id="glyph0-14">
<path style="stroke:none;" d="M 0.75 -1.890625 L 0.75 -4.796875 L 1.53125 -4.796875 L 1.53125 -1.921875 C 1.53125 -1.460938 1.617188 -1.117188 1.796875 -0.890625 C 1.972656 -0.671875 2.238281 -0.5625 2.59375 -0.5625 C 3.007812 -0.5625 3.34375 -0.695312 3.59375 -0.96875 C 3.84375 -1.238281 3.96875 -1.609375 3.96875 -2.078125 L 3.96875 -4.796875 L 4.75 -4.796875 L 4.75 0 L 3.96875 0 L 3.96875 -0.734375 C 3.769531 -0.441406 3.546875 -0.222656 3.296875 -0.078125 C 3.046875 0.0546875 2.753906 0.125 2.421875 0.125 C 1.867188 0.125 1.453125 -0.046875 1.171875 -0.390625 C 0.890625 -0.734375 0.75 -1.234375 0.75 -1.890625 Z M 2.71875 -4.90625 Z M 2.71875 -4.90625 "/>
</symbol>
<symbol overflow="visible" id="glyph0-15">
<path style="stroke:none;" d="M 4.265625 -4.609375 L 4.265625 -3.875 C 4.046875 -4 3.820312 -4.085938 3.59375 -4.140625 C 3.375 -4.203125 3.148438 -4.234375 2.921875 -4.234375 C 2.410156 -4.234375 2.015625 -4.070312 1.734375 -3.75 C 1.453125 -3.425781 1.3125 -2.972656 1.3125 -2.390625 C 1.3125 -1.804688 1.453125 -1.351562 1.734375 -1.03125 C 2.015625 -0.707031 2.410156 -0.546875 2.921875 -0.546875 C 3.148438 -0.546875 3.375 -0.578125 3.59375 -0.640625 C 3.820312 -0.703125 4.046875 -0.789062 4.265625 -0.90625 L 4.265625 -0.1875 C 4.046875 -0.0820312 3.816406 -0.00390625 3.578125 0.046875 C 3.347656 0.0976562 3.101562 0.125 2.84375 0.125 C 2.113281 0.125 1.535156 -0.0976562 1.109375 -0.546875 C 0.691406 -1.003906 0.484375 -1.617188 0.484375 -2.390625 C 0.484375 -3.171875 0.695312 -3.785156 1.125 -4.234375 C 1.550781 -4.679688 2.140625 -4.90625 2.890625 -4.90625 C 3.128906 -4.90625 3.363281 -4.878906 3.59375 -4.828125 C 3.820312 -4.785156 4.046875 -4.710938 4.265625 -4.609375 Z M 4.265625 -4.609375 "/>
</symbol>
<symbol overflow="visible" id="glyph0-16">
<path style="stroke:none;" d="M 1.609375 -6.15625 L 1.609375 -4.796875 L 3.21875 -4.796875 L 3.21875 -4.1875 L 1.609375 -4.1875 L 1.609375 -1.578125 C 1.609375 -1.191406 1.660156 -0.941406 1.765625 -0.828125 C 1.867188 -0.710938 2.082031 -0.65625 2.40625 -0.65625 L 3.21875 -0.65625 L 3.21875 0 L 2.40625 0 C 1.800781 0 1.382812 -0.113281 1.15625 -0.34375 C 0.925781 -0.570312 0.8125 -0.984375 0.8125 -1.578125 L 0.8125 -4.1875 L 0.234375 -4.1875 L 0.234375 -4.796875 L 0.8125 -4.796875 L 0.8125 -6.15625 Z M 1.609375 -6.15625 "/>
</symbol>
<symbol overflow="visible" id="glyph0-17">
<path style="stroke:none;" d="M 0.828125 -4.796875 L 1.609375 -4.796875 L 1.609375 0 L 0.828125 0 Z M 0.828125 -6.65625 L 1.609375 -6.65625 L 1.609375 -5.65625 L 0.828125 -5.65625 Z M 0.828125 -6.65625 "/>
</symbol>
<symbol overflow="visible" id="glyph0-18">
<path style="stroke:none;" d="M 2.671875 -4.234375 C 2.253906 -4.234375 1.921875 -4.066406 1.671875 -3.734375 C 1.429688 -3.410156 1.3125 -2.960938 1.3125 -2.390625 C 1.3125 -1.816406 1.429688 -1.363281 1.671875 -1.03125 C 1.921875 -0.707031 2.253906 -0.546875 2.671875 -0.546875 C 3.097656 -0.546875 3.429688 -0.707031 3.671875 -1.03125 C 3.921875 -1.363281 4.046875 -1.816406 4.046875 -2.390625 C 4.046875 -2.960938 3.921875 -3.410156 3.671875 -3.734375 C 3.429688 -4.066406 3.097656 -4.234375 2.671875 -4.234375 Z M 2.671875 -4.90625 C 3.359375 -4.90625 3.894531 -4.679688 4.28125 -4.234375 C 4.675781 -3.796875 4.875 -3.179688 4.875 -2.390625 C 4.875 -1.609375 4.675781 -0.992188 4.28125 -0.546875 C 3.894531 -0.0976562 3.359375 0.125 2.671875 0.125 C 1.992188 0.125 1.457031 -0.0976562 1.0625 -0.546875 C 0.675781 -0.992188 0.484375 -1.609375 0.484375 -2.390625 C 0.484375 -3.179688 0.675781 -3.796875 1.0625 -4.234375 C 1.457031 -4.679688 1.992188 -4.90625 2.671875 -4.90625 Z M 2.671875 -4.90625 "/>
</symbol>
<symbol overflow="visible" id="glyph0-19">
<path style="stroke:none;" d="M 0.703125 -6.65625 L 1.390625 -6.65625 C 1.816406 -5.976562 2.132812 -5.316406 2.34375 -4.671875 C 2.550781 -4.023438 2.65625 -3.382812 2.65625 -2.75 C 2.65625 -2.113281 2.550781 -1.46875 2.34375 -0.8125 C 2.132812 -0.164062 1.816406 0.488281 1.390625 1.15625 L 0.703125 1.15625 C 1.078125 0.5 1.359375 -0.148438 1.546875 -0.796875 C 1.734375 -1.441406 1.828125 -2.09375 1.828125 -2.75 C 1.828125 -3.40625 1.734375 -4.054688 1.546875 -4.703125 C 1.359375 -5.347656 1.078125 -6 0.703125 -6.65625 Z M 0.703125 -6.65625 "/>
</symbol>
<symbol overflow="visible" id="glyph0-20">
<path style="stroke:none;" d="M 4.265625 -2.390625 C 4.265625 -2.972656 4.144531 -3.425781 3.90625 -3.75 C 3.664062 -4.082031 3.335938 -4.25 2.921875 -4.25 C 2.503906 -4.25 2.175781 -4.082031 1.9375 -3.75 C 1.695312 -3.425781 1.578125 -2.972656 1.578125 -2.390625 C 1.578125 -1.816406 1.695312 -1.363281 1.9375 -1.03125 C 2.175781 -0.695312 2.503906 -0.53125 2.921875 -0.53125 C 3.335938 -0.53125 3.664062 -0.695312 3.90625 -1.03125 C 4.144531 -1.363281 4.265625 -1.816406 4.265625 -2.390625 Z M 1.578125 -4.0625 C 1.742188 -4.351562 1.953125 -4.566406 2.203125 -4.703125 C 2.460938 -4.835938 2.765625 -4.90625 3.109375 -4.90625 C 3.691406 -4.90625 4.164062 -4.671875 4.53125 -4.203125 C 4.894531 -3.742188 5.078125 -3.140625 5.078125 -2.390625 C 5.078125 -1.640625 4.894531 -1.03125 4.53125 -0.5625 C 4.164062 -0.101562 3.691406 0.125 3.109375 0.125 C 2.765625 0.125 2.460938 0.0546875 2.203125 -0.078125 C 1.953125 -0.222656 1.742188 -0.4375 1.578125 -0.71875 L 1.578125 0 L 0.796875 0 L 0.796875 -6.65625 L 1.578125 -6.65625 Z M 1.578125 -4.0625 "/>
</symbol>
<symbol overflow="visible" id="glyph0-21">
<path style="stroke:none;" d="M 4.796875 -4.796875 L 3.078125 -2.46875 L 4.890625 0 L 3.96875 0 L 2.578125 -1.890625 L 1.171875 0 L 0.25 0 L 2.109375 -2.515625 L 0.40625 -4.796875 L 1.34375 -4.796875 L 2.609375 -3.09375 L 3.875 -4.796875 Z M 4.796875 -4.796875 "/>
</symbol>
<symbol overflow="visible" id="glyph0-22">
<path style="stroke:none;" d="M 1.03125 -1.09375 L 1.921875 -1.09375 L 1.921875 0 L 1.03125 0 Z M 1.03125 -4.53125 L 1.921875 -4.53125 L 1.921875 -3.453125 L 1.03125 -3.453125 Z M 1.03125 -4.53125 "/>
</symbol>
<symbol overflow="visible" id="glyph0-23">
<path style="stroke:none;" d="M 3.96875 -4.0625 L 3.96875 -6.65625 L 4.765625 -6.65625 L 4.765625 0 L 3.96875 0 L 3.96875 -0.71875 C 3.800781 -0.4375 3.59375 -0.222656 3.34375 -0.078125 C 3.09375 0.0546875 2.789062 0.125 2.4375 0.125 C 1.863281 0.125 1.394531 -0.101562 1.03125 -0.5625 C 0.664062 -1.03125 0.484375 -1.640625 0.484375 -2.390625 C 0.484375 -3.140625 0.664062 -3.742188 1.03125 -4.203125 C 1.394531 -4.671875 1.863281 -4.90625 2.4375 -4.90625 C 2.789062 -4.90625 3.09375 -4.835938 3.34375 -4.703125 C 3.59375 -4.566406 3.800781 -4.351562 3.96875 -4.0625 Z M 1.296875 -2.390625 C 1.296875 -1.816406 1.414062 -1.363281 1.65625 -1.03125 C 1.894531 -0.695312 2.21875 -0.53125 2.625 -0.53125 C 3.039062 -0.53125 3.367188 -0.695312 3.609375 -1.03125 C 3.847656 -1.363281 3.96875 -1.816406 3.96875 -2.390625 C 3.96875 -2.972656 3.847656 -3.425781 3.609375 -3.75 C 3.367188 -4.082031 3.039062 -4.25 2.625 -4.25 C 2.21875 -4.25 1.894531 -4.082031 1.65625 -3.75 C 1.414062 -3.425781 1.296875 -2.972656 1.296875 -2.390625 Z M 1.296875 -2.390625 "/>
</symbol>
<symbol overflow="visible" id="glyph0-24">
<path style="stroke:none;" d="M 4.546875 -3.875 C 4.742188 -4.226562 4.976562 -4.488281 5.25 -4.65625 C 5.53125 -4.820312 5.851562 -4.90625 6.21875 -4.90625 C 6.71875 -4.90625 7.101562 -4.726562 7.375 -4.375 C 7.644531 -4.03125 7.78125 -3.535156 7.78125 -2.890625 L 7.78125 0 L 6.984375 0 L 6.984375 -2.875 C 6.984375 -3.332031 6.898438 -3.671875 6.734375 -3.890625 C 6.578125 -4.109375 6.332031 -4.21875 6 -4.21875 C 5.59375 -4.21875 5.269531 -4.082031 5.03125 -3.8125 C 4.800781 -3.539062 4.6875 -3.171875 4.6875 -2.703125 L 4.6875 0 L 3.890625 0 L 3.890625 -2.875 C 3.890625 -3.332031 3.804688 -3.671875 3.640625 -3.890625 C 3.484375 -4.109375 3.234375 -4.21875 2.890625 -4.21875 C 2.492188 -4.21875 2.175781 -4.082031 1.9375 -3.8125 C 1.695312 -3.539062 1.578125 -3.171875 1.578125 -2.703125 L 1.578125 0 L 0.796875 0 L 0.796875 -4.796875 L 1.578125 -4.796875 L 1.578125 -4.046875 C 1.765625 -4.335938 1.984375 -4.550781 2.234375 -4.6875 C 2.484375 -4.832031 2.78125 -4.90625 3.125 -4.90625 C 3.46875 -4.90625 3.757812 -4.816406 4 -4.640625 C 4.25 -4.460938 4.429688 -4.207031 4.546875 -3.875 Z M 4.546875 -3.875 "/>
</symbol>
<symbol overflow="visible" id="glyph0-25">
<path style="stroke:none;" d="M 2.125 -3.4375 C 1.863281 -3.207031 1.671875 -2.976562 1.546875 -2.75 C 1.429688 -2.519531 1.375 -2.28125 1.375 -2.03125 C 1.375 -1.613281 1.523438 -1.265625 1.828125 -0.984375 C 2.128906 -0.703125 2.507812 -0.5625 2.96875 -0.5625 C 3.238281 -0.5625 3.488281 -0.609375 3.71875 -0.703125 C 3.957031 -0.796875 4.179688 -0.929688 4.390625 -1.109375 Z M 2.734375 -3.921875 L 4.90625 -1.6875 C 5.070312 -1.945312 5.203125 -2.21875 5.296875 -2.5 C 5.390625 -2.789062 5.441406 -3.097656 5.453125 -3.421875 L 6.25 -3.421875 C 6.21875 -3.046875 6.128906 -2.675781 5.984375 -2.3125 C 5.835938 -1.945312 5.628906 -1.582031 5.359375 -1.21875 L 6.546875 0 L 5.484375 0 L 4.859375 -0.625 C 4.566406 -0.375 4.257812 -0.1875 3.9375 -0.0625 C 3.613281 0.0625 3.265625 0.125 2.890625 0.125 C 2.203125 0.125 1.640625 -0.0664062 1.203125 -0.453125 C 0.765625 -0.847656 0.546875 -1.351562 0.546875 -1.96875 C 0.546875 -2.332031 0.640625 -2.675781 0.828125 -3 C 1.023438 -3.320312 1.316406 -3.625 1.703125 -3.90625 C 1.554688 -4.082031 1.445312 -4.257812 1.375 -4.4375 C 1.3125 -4.625 1.28125 -4.800781 1.28125 -4.96875 C 1.28125 -5.425781 1.4375 -5.796875 1.75 -6.078125 C 2.0625 -6.359375 2.484375 -6.5 3.015625 -6.5 C 3.242188 -6.5 3.476562 -6.472656 3.71875 -6.421875 C 3.957031 -6.378906 4.195312 -6.304688 4.4375 -6.203125 L 4.4375 -5.421875 C 4.1875 -5.554688 3.945312 -5.65625 3.71875 -5.71875 C 3.5 -5.789062 3.289062 -5.828125 3.09375 -5.828125 C 2.800781 -5.828125 2.5625 -5.75 2.375 -5.59375 C 2.1875 -5.4375 2.09375 -5.234375 2.09375 -4.984375 C 2.09375 -4.835938 2.132812 -4.6875 2.21875 -4.53125 C 2.300781 -4.382812 2.472656 -4.179688 2.734375 -3.921875 Z M 2.734375 -3.921875 "/>
</symbol>
<symbol overflow="visible" id="glyph0-26">
<path style="stroke:none;" d="M 0.859375 -6.390625 L 2.015625 -6.390625 L 4.84375 -1.046875 L 4.84375 -6.390625 L 5.6875 -6.390625 L 5.6875 0 L 4.53125 0 L 1.703125 -5.34375 L 1.703125 0 L 0.859375 0 Z M 0.859375 -6.390625 "/>
</symbol>
<symbol overflow="visible" id="glyph0-27">
<path style="stroke:none;" d="M 1.03125 -1.09375 L 1.921875 -1.09375 L 1.921875 -0.34375 L 1.21875 1.015625 L 0.671875 1.015625 L 1.03125 -0.34375 Z M 1.03125 -1.09375 "/>
</symbol>
<symbol overflow="visible" id="glyph0-28">
<path style="stroke:none;" d="M 4.6875 -6.1875 L 4.6875 -5.34375 C 4.351562 -5.5 4.039062 -5.613281 3.75 -5.6875 C 3.457031 -5.757812 3.175781 -5.796875 2.90625 -5.796875 C 2.4375 -5.796875 2.070312 -5.703125 1.8125 -5.515625 C 1.5625 -5.335938 1.4375 -5.082031 1.4375 -4.75 C 1.4375 -4.46875 1.519531 -4.253906 1.6875 -4.109375 C 1.863281 -3.960938 2.1875 -3.847656 2.65625 -3.765625 L 3.1875 -3.65625 C 3.832031 -3.53125 4.304688 -3.3125 4.609375 -3 C 4.910156 -2.695312 5.0625 -2.285156 5.0625 -1.765625 C 5.0625 -1.140625 4.851562 -0.664062 4.4375 -0.34375 C 4.03125 -0.03125 3.425781 0.125 2.625 0.125 C 2.320312 0.125 2 0.0859375 1.65625 0.015625 C 1.320312 -0.046875 0.972656 -0.144531 0.609375 -0.28125 L 0.609375 -1.171875 C 0.953125 -0.972656 1.289062 -0.820312 1.625 -0.71875 C 1.96875 -0.625 2.300781 -0.578125 2.625 -0.578125 C 3.113281 -0.578125 3.492188 -0.671875 3.765625 -0.859375 C 4.035156 -1.054688 4.171875 -1.335938 4.171875 -1.703125 C 4.171875 -2.015625 4.070312 -2.257812 3.875 -2.4375 C 3.6875 -2.613281 3.375 -2.742188 2.9375 -2.828125 L 2.40625 -2.9375 C 1.757812 -3.0625 1.289062 -3.257812 1 -3.53125 C 0.71875 -3.8125 0.578125 -4.195312 0.578125 -4.6875 C 0.578125 -5.25 0.773438 -5.691406 1.171875 -6.015625 C 1.566406 -6.335938 2.113281 -6.5 2.8125 -6.5 C 3.113281 -6.5 3.421875 -6.472656 3.734375 -6.421875 C 4.046875 -6.367188 4.363281 -6.289062 4.6875 -6.1875 Z M 4.6875 -6.1875 "/>
</symbol>
<symbol overflow="visible" id="glyph0-29">
<path style="stroke:none;" d="M 0.859375 -6.390625 L 2.140625 -6.390625 L 3.765625 -2.046875 L 5.40625 -6.390625 L 6.6875 -6.390625 L 6.6875 0 L 5.859375 0 L 5.859375 -5.609375 L 4.203125 -1.234375 L 3.34375 -1.234375 L 1.703125 -5.609375 L 1.703125 0 L 0.859375 0 Z M 0.859375 -6.390625 "/>
</symbol>
<symbol overflow="visible" id="glyph0-30">
<path style="stroke:none;" d="M 3.96875 -2.453125 C 3.96875 -3.023438 3.847656 -3.46875 3.609375 -3.78125 C 3.378906 -4.09375 3.050781 -4.25 2.625 -4.25 C 2.207031 -4.25 1.878906 -4.09375 1.640625 -3.78125 C 1.410156 -3.46875 1.296875 -3.023438 1.296875 -2.453125 C 1.296875 -1.878906 1.410156 -1.4375 1.640625 -1.125 C 1.878906 -0.8125 2.207031 -0.65625 2.625 -0.65625 C 3.050781 -0.65625 3.378906 -0.8125 3.609375 -1.125 C 3.847656 -1.4375 3.96875 -1.878906 3.96875 -2.453125 Z M 4.765625 -0.59375 C 4.765625 0.21875 4.582031 0.820312 4.21875 1.21875 C 3.851562 1.625 3.300781 1.828125 2.5625 1.828125 C 2.28125 1.828125 2.015625 1.804688 1.765625 1.765625 C 1.523438 1.722656 1.289062 1.660156 1.0625 1.578125 L 1.0625 0.796875 C 1.289062 0.929688 1.515625 1.023438 1.734375 1.078125 C 1.960938 1.140625 2.195312 1.171875 2.4375 1.171875 C 2.945312 1.171875 3.328125 1.035156 3.578125 0.765625 C 3.835938 0.492188 3.96875 0.0859375 3.96875 -0.453125 L 3.96875 -0.84375 C 3.8125 -0.5625 3.601562 -0.347656 3.34375 -0.203125 C 3.09375 -0.0664062 2.789062 0 2.4375 0 C 1.851562 0 1.378906 -0.222656 1.015625 -0.671875 C 0.660156 -1.117188 0.484375 -1.710938 0.484375 -2.453125 C 0.484375 -3.191406 0.660156 -3.785156 1.015625 -4.234375 C 1.378906 -4.679688 1.851562 -4.90625 2.4375 -4.90625 C 2.789062 -4.90625 3.09375 -4.832031 3.34375 -4.6875 C 3.601562 -4.550781 3.8125 -4.34375 3.96875 -4.0625 L 3.96875 -4.796875 L 4.765625 -4.796875 Z M 4.765625 -0.59375 "/>
</symbol>
<symbol overflow="visible" id="glyph0-31">
<path style="stroke:none;" d="M 4.109375 -5.34375 L 2.578125 -4.5 L 4.109375 -3.671875 L 3.859375 -3.25 L 2.4375 -4.125 L 2.4375 -2.515625 L 1.9375 -2.515625 L 1.9375 -4.125 L 0.515625 -3.25 L 0.265625 -3.671875 L 1.796875 -4.5 L 0.265625 -5.34375 L 0.515625 -5.765625 L 1.9375 -4.890625 L 1.9375 -6.5 L 2.4375 -6.5 L 2.4375 -4.890625 L 3.859375 -5.765625 Z M 4.109375 -5.34375 "/>
</symbol>
<symbol overflow="visible" id="glyph0-32">
<path style="stroke:none;" d="M 1.71875 -5.671875 L 1.71875 -3.28125 L 2.8125 -3.28125 C 3.207031 -3.28125 3.515625 -3.382812 3.734375 -3.59375 C 3.953125 -3.800781 4.0625 -4.097656 4.0625 -4.484375 C 4.0625 -4.867188 3.953125 -5.160156 3.734375 -5.359375 C 3.515625 -5.566406 3.207031 -5.671875 2.8125 -5.671875 Z M 0.859375 -6.390625 L 2.8125 -6.390625 C 3.519531 -6.390625 4.054688 -6.226562 4.421875 -5.90625 C 4.796875 -5.582031 4.984375 -5.109375 4.984375 -4.484375 C 4.984375 -3.847656 4.796875 -3.367188 4.421875 -3.046875 C 4.054688 -2.722656 3.519531 -2.5625 2.8125 -2.5625 L 1.71875 -2.5625 L 1.71875 0 L 0.859375 0 Z M 0.859375 -6.390625 "/>
</symbol>
<symbol overflow="visible" id="glyph0-33">
<path style="stroke:none;" d="M 1.71875 -3.046875 L 1.71875 -0.703125 L 3.109375 -0.703125 C 3.566406 -0.703125 3.90625 -0.796875 4.125 -0.984375 C 4.351562 -1.179688 4.46875 -1.484375 4.46875 -1.890625 C 4.46875 -2.285156 4.351562 -2.578125 4.125 -2.765625 C 3.90625 -2.953125 3.566406 -3.046875 3.109375 -3.046875 Z M 1.71875 -5.671875 L 1.71875 -3.75 L 3 -3.75 C 3.414062 -3.75 3.726562 -3.828125 3.9375 -3.984375 C 4.144531 -4.148438 4.25 -4.394531 4.25 -4.71875 C 4.25 -5.039062 4.144531 -5.28125 3.9375 -5.4375 C 3.726562 -5.59375 3.414062 -5.671875 3 -5.671875 Z M 0.859375 -6.390625 L 3.0625 -6.390625 C 3.71875 -6.390625 4.222656 -6.25 4.578125 -5.96875 C 4.941406 -5.695312 5.125 -5.3125 5.125 -4.8125 C 5.125 -4.414062 5.03125 -4.101562 4.84375 -3.875 C 4.664062 -3.644531 4.398438 -3.503906 4.046875 -3.453125 C 4.460938 -3.359375 4.789062 -3.164062 5.03125 -2.875 C 5.269531 -2.582031 5.390625 -2.222656 5.390625 -1.796875 C 5.390625 -1.222656 5.191406 -0.78125 4.796875 -0.46875 C 4.410156 -0.15625 3.863281 0 3.15625 0 L 0.859375 0 Z M 0.859375 -6.390625 "/>
</symbol>
<symbol overflow="visible" id="glyph0-34">
<path style="stroke:none;" d="M 3.453125 -5.796875 C 2.828125 -5.796875 2.328125 -5.5625 1.953125 -5.09375 C 1.585938 -4.632812 1.40625 -4 1.40625 -3.1875 C 1.40625 -2.382812 1.585938 -1.75 1.953125 -1.28125 C 2.328125 -0.8125 2.828125 -0.578125 3.453125 -0.578125 C 4.078125 -0.578125 4.570312 -0.8125 4.9375 -1.28125 C 5.300781 -1.75 5.484375 -2.382812 5.484375 -3.1875 C 5.484375 -4 5.300781 -4.632812 4.9375 -5.09375 C 4.570312 -5.5625 4.078125 -5.796875 3.453125 -5.796875 Z M 3.453125 -6.5 C 4.347656 -6.5 5.0625 -6.195312 5.59375 -5.59375 C 6.125 -5 6.390625 -4.195312 6.390625 -3.1875 C 6.390625 -2.175781 6.125 -1.367188 5.59375 -0.765625 C 5.0625 -0.171875 4.347656 0.125 3.453125 0.125 C 2.554688 0.125 1.835938 -0.171875 1.296875 -0.765625 C 0.753906 -1.367188 0.484375 -2.175781 0.484375 -3.1875 C 0.484375 -4.195312 0.753906 -5 1.296875 -5.59375 C 1.835938 -6.195312 2.554688 -6.5 3.453125 -6.5 Z M 3.453125 -6.5 "/>
</symbol>
<symbol overflow="visible" id="glyph0-35">
<path style="stroke:none;" d="M 0.421875 -2.75 L 2.734375 -2.75 L 2.734375 -2.046875 L 0.421875 -2.046875 Z M 0.421875 -2.75 "/>
</symbol>
<symbol overflow="visible" id="glyph0-36">
<path style="stroke:none;" d="M 0.921875 -4.3125 L 0.921875 -5.09375 L 6.40625 -3.109375 L 6.40625 -2.390625 L 0.921875 -0.40625 L 0.921875 -1.1875 L 5.328125 -2.75 Z M 0.921875 -4.3125 "/>
</symbol>
<symbol overflow="visible" id="glyph0-37">
<path style="stroke:none;" d="M 5.640625 -5.890625 L 5.640625 -4.984375 C 5.347656 -5.253906 5.035156 -5.457031 4.703125 -5.59375 C 4.378906 -5.726562 4.03125 -5.796875 3.65625 -5.796875 C 2.925781 -5.796875 2.367188 -5.570312 1.984375 -5.125 C 1.597656 -4.675781 1.40625 -4.03125 1.40625 -3.1875 C 1.40625 -2.34375 1.597656 -1.695312 1.984375 -1.25 C 2.367188 -0.8125 2.925781 -0.59375 3.65625 -0.59375 C 4.03125 -0.59375 4.378906 -0.65625 4.703125 -0.78125 C 5.035156 -0.914062 5.347656 -1.117188 5.640625 -1.390625 L 5.640625 -0.5 C 5.335938 -0.289062 5.015625 -0.132812 4.671875 -0.03125 C 4.335938 0.0703125 3.984375 0.125 3.609375 0.125 C 2.640625 0.125 1.875 -0.171875 1.3125 -0.765625 C 0.757812 -1.359375 0.484375 -2.164062 0.484375 -3.1875 C 0.484375 -4.21875 0.757812 -5.023438 1.3125 -5.609375 C 1.875 -6.203125 2.640625 -6.5 3.609375 -6.5 C 3.984375 -6.5 4.335938 -6.445312 4.671875 -6.34375 C 5.015625 -6.25 5.335938 -6.097656 5.640625 -5.890625 Z M 5.640625 -5.890625 "/>
</symbol>
<symbol overflow="visible" id="glyph0-38">
<path style="stroke:none;" d="M 0.9375 -1.09375 L 1.84375 -1.09375 L 1.84375 0 L 0.9375 0 Z M 0.9375 -1.09375 "/>
</symbol>
<symbol overflow="visible" id="glyph0-39">
<path style="stroke:none;" d="M 0.796875 -6.65625 L 1.578125 -6.65625 L 1.578125 -2.71875 L 3.9375 -4.796875 L 4.9375 -4.796875 L 2.390625 -2.546875 L 5.046875 0 L 4.015625 0 L 1.578125 -2.34375 L 1.578125 0 L 0.796875 0 Z M 0.796875 -6.65625 "/>
</symbol>
<symbol overflow="visible" id="glyph0-40">
<path style="stroke:none;" d="M 0.265625 -4.796875 L 1.09375 -4.796875 L 2.59375 -0.765625 L 4.078125 -4.796875 L 4.921875 -4.796875 L 3.125 0 L 2.0625 0 Z M 0.265625 -4.796875 "/>
</symbol>
<symbol overflow="visible" id="glyph0-41">
<path style="stroke:none;" d="M 1.5625 -6.390625 L 1.5625 -4.015625 L 0.84375 -4.015625 L 0.84375 -6.390625 Z M 3.1875 -6.390625 L 3.1875 -4.015625 L 2.453125 -4.015625 L 2.453125 -6.390625 Z M 3.1875 -6.390625 "/>
</symbol>
<symbol overflow="visible" id="glyph0-42">
<path style="stroke:none;" d="M 0.859375 -6.390625 L 1.71875 -6.390625 L 1.71875 -3.6875 L 4.578125 -6.390625 L 5.6875 -6.390625 L 2.53125 -3.40625 L 5.921875 0 L 4.78125 0 L 1.71875 -3.078125 L 1.71875 0 L 0.859375 0 Z M 0.859375 -6.390625 "/>
</symbol>
<symbol overflow="visible" id="glyph0-43">
<path style="stroke:none;" d="M 1.71875 -5.671875 L 1.71875 -0.703125 L 2.765625 -0.703125 C 3.640625 -0.703125 4.28125 -0.898438 4.6875 -1.296875 C 5.101562 -1.703125 5.3125 -2.335938 5.3125 -3.203125 C 5.3125 -4.054688 5.101562 -4.679688 4.6875 -5.078125 C 4.28125 -5.472656 3.640625 -5.671875 2.765625 -5.671875 Z M 0.859375 -6.390625 L 2.625 -6.390625 C 3.863281 -6.390625 4.769531 -6.128906 5.34375 -5.609375 C 5.925781 -5.097656 6.21875 -4.296875 6.21875 -3.203125 C 6.21875 -2.097656 5.925781 -1.285156 5.34375 -0.765625 C 4.769531 -0.253906 3.863281 0 2.625 0 L 0.859375 0 Z M 0.859375 -6.390625 "/>
</symbol>
<symbol overflow="visible" id="glyph0-44">
<path style="stroke:none;" d="M 0.484375 -4.796875 L 4.21875 -4.796875 L 4.21875 -4.078125 L 1.265625 -0.625 L 4.21875 -0.625 L 4.21875 0 L 0.375 0 L 0.375 -0.71875 L 3.328125 -4.171875 L 0.484375 -4.171875 Z M 0.484375 -4.796875 "/>
</symbol>
<symbol overflow="visible" id="glyph0-45">
<path style="stroke:none;" d="M 1.03125 -4.53125 L 1.921875 -4.53125 L 1.921875 -3.453125 L 1.03125 -3.453125 Z M 1.03125 -1.09375 L 1.921875 -1.09375 L 1.921875 -0.34375 L 1.21875 1.015625 L 0.671875 1.015625 L 1.03125 -0.34375 Z M 1.03125 -1.09375 "/>
</symbol>
<symbol overflow="visible" id="glyph0-46">
<path style="stroke:none;" d="M 2.5 0 L 0.0625 -6.390625 L 0.96875 -6.390625 L 2.984375 -1.015625 L 5.015625 -6.390625 L 5.90625 -6.390625 L 3.484375 0 Z M 2.5 0 "/>
</symbol>
<symbol overflow="visible" id="glyph0-47">
<path style="stroke:none;" d=""/>
</symbol>
<symbol overflow="visible" id="glyph0-48">
<path style="stroke:none;" d="M 0.921875 -3.984375 L 6.40625 -3.984375 L 6.40625 -3.265625 L 0.921875 -3.265625 Z M 0.921875 -2.234375 L 6.40625 -2.234375 L 6.40625 -1.5 L 0.921875 -1.5 Z M 0.921875 -2.234375 "/>
</symbol>
<symbol overflow="visible" id="glyph0-49">
<path style="stroke:none;" d="M 0.765625 -6.390625 L 1.625 -6.390625 L 1.625 -2.515625 C 1.625 -1.828125 1.75 -1.332031 2 -1.03125 C 2.25 -0.726562 2.648438 -0.578125 3.203125 -0.578125 C 3.753906 -0.578125 4.15625 -0.726562 4.40625 -1.03125 C 4.65625 -1.332031 4.78125 -1.828125 4.78125 -2.515625 L 4.78125 -6.390625 L 5.640625 -6.390625 L 5.640625 -2.40625 C 5.640625 -1.570312 5.429688 -0.941406 5.015625 -0.515625 C 4.609375 -0.0859375 4.003906 0.125 3.203125 0.125 C 2.398438 0.125 1.789062 -0.0859375 1.375 -0.515625 C 0.96875 -0.941406 0.765625 -1.570312 0.765625 -2.40625 Z M 0.765625 -6.390625 "/>
</symbol>
<symbol overflow="visible" id="glyph0-50">
<path style="stroke:none;" d="M 3.453125 -5.796875 C 2.828125 -5.796875 2.328125 -5.5625 1.953125 -5.09375 C 1.585938 -4.632812 1.40625 -4 1.40625 -3.1875 C 1.40625 -2.382812 1.585938 -1.75 1.953125 -1.28125 C 2.328125 -0.8125 2.828125 -0.578125 3.453125 -0.578125 C 4.078125 -0.578125 4.570312 -0.8125 4.9375 -1.28125 C 5.300781 -1.75 5.484375 -2.382812 5.484375 -3.1875 C 5.484375 -4 5.300781 -4.632812 4.9375 -5.09375 C 4.570312 -5.5625 4.078125 -5.796875 3.453125 -5.796875 Z M 4.65625 -0.109375 L 5.796875 1.125 L 4.75 1.125 L 3.8125 0.109375 C 3.71875 0.109375 3.644531 0.109375 3.59375 0.109375 C 3.539062 0.117188 3.492188 0.125 3.453125 0.125 C 2.554688 0.125 1.835938 -0.171875 1.296875 -0.765625 C 0.753906 -1.367188 0.484375 -2.175781 0.484375 -3.1875 C 0.484375 -4.195312 0.753906 -5 1.296875 -5.59375 C 1.835938 -6.195312 2.554688 -6.5 3.453125 -6.5 C 4.347656 -6.5 5.0625 -6.195312 5.59375 -5.59375 C 6.125 -5 6.390625 -4.195312 6.390625 -3.1875 C 6.390625 -2.445312 6.238281 -1.8125 5.9375 -1.28125 C 5.644531 -0.757812 5.21875 -0.367188 4.65625 -0.109375 Z M 4.65625 -0.109375 "/>
</symbol>
<symbol overflow="visible" id="glyph0-51">
<path style="stroke:none;" d="M 0.859375 -6.390625 L 4.890625 -6.390625 L 4.890625 -5.65625 L 1.71875 -5.65625 L 1.71875 -3.765625 L 4.765625 -3.765625 L 4.765625 -3.046875 L 1.71875 -3.046875 L 1.71875 -0.734375 L 4.96875 -0.734375 L 4.96875 0 L 0.859375 0 Z M 0.859375 -6.390625 "/>
</symbol>
</g>
</defs>
<g id="surface1">
<path style=" stroke:none;fill-rule:nonzero;fill:rgb(100%,100%,100%);fill-opacity:1;" d="M 0.222656 261 L 0.222656 0 L 922.777344 0 L 922.777344 261 Z M 0.222656 261 "/>
<path style="fill-rule:nonzero;fill:rgb(100%,100%,0%);fill-opacity:1;stroke-width:1;stroke-linecap:butt;stroke-linejoin:miter;stroke:rgb(100%,100%,0%);stroke-opacity:1;stroke-miterlimit:4;" d="M 361.998112 -317.49991 C 361.998112 -317.49991 810.001528 -317.49991 810.001528 -317.49991 C 816.001155 -317.49991 822.000783 -323.497531 822.000783 -329.501392 C 822.000783 -329.501392 822.000783 -396.498743 822.000783 -396.498743 C 822.000783 -402.502604 816.001155 -408.500224 810.001528 -408.500224 C 810.001528 -408.500224 361.998112 -408.500224 361.998112 -408.500224 C 355.998485 -408.500224 349.998858 -402.502604 349.998858 -396.498743 C 349.998858 -396.498743 349.998858 -329.501392 349.998858 -329.501392 C 349.998858 -323.497531 355.998485 -317.49991 361.998112 -317.49991 " transform="matrix(0.625039,0,0,0.625899,2.721498,258.496403)"/>
<g style="fill:rgb(0%,0%,0%);fill-opacity:1;">
  <use xlink:href="#glyph0-1" x="263.363281" y="12.328947"/>
  <use xlink:href="#glyph0-2" x="269.61367" y="12.328947"/>
  <use xlink:href="#glyph0-3" x="275.239019" y="12.328947"/>
  <use xlink:href="#glyph0-4" x="280.864369" y="12.328947"/>
  <use xlink:href="#glyph0-5" x="283.364524" y="12.328947"/>
  <use xlink:href="#glyph0-6" x="288.364834" y="12.328947"/>
  <use xlink:href="#glyph0-7" x="292.740106" y="12.328947"/>
  <use xlink:href="#glyph0-8" x="298.365456" y="12.328947"/>
  <use xlink:href="#glyph0-1" x="300.865611" y="12.328947"/>
  <use xlink:href="#glyph0-9" x="307.115999" y="12.328947"/>
  <use xlink:href="#glyph0-9" x="310.866232" y="12.328947"/>
  <use xlink:href="#glyph0-3" x="314.616465" y="12.328947"/>
  <use xlink:href="#glyph0-5" x="320.241815" y="12.328947"/>
  <use xlink:href="#glyph0-8" x="325.242125" y="12.328947"/>
  <use xlink:href="#glyph0-10" x="327.742281" y="12.328947"/>
  <use xlink:href="#glyph0-5" x="331.492514" y="12.328947"/>
  <use xlink:href="#glyph0-11" x="336.492824" y="12.328947"/>
  <use xlink:href="#glyph0-7" x="342.118174" y="12.328947"/>
  <use xlink:href="#glyph0-8" x="347.743523" y="12.328947"/>
  <use xlink:href="#glyph0-12" x="350.243679" y="12.328947"/>
  <use xlink:href="#glyph0-13" x="353.368873" y="12.328947"/>
  <use xlink:href="#glyph0-14" x="356.494067" y="12.328947"/>
  <use xlink:href="#glyph0-2" x="362.119417" y="12.328947"/>
  <use xlink:href="#glyph0-15" x="367.744766" y="12.328947"/>
  <use xlink:href="#glyph0-16" x="372.745077" y="12.328947"/>
  <use xlink:href="#glyph0-17" x="375.870271" y="12.328947"/>
  <use xlink:href="#glyph0-18" x="378.370426" y="12.328947"/>
  <use xlink:href="#glyph0-2" x="383.995776" y="12.328947"/>
  <use xlink:href="#glyph0-8" x="389.621125" y="12.328947"/>
  <use xlink:href="#glyph0-1" x="392.12128" y="12.328947"/>
  <use xlink:href="#glyph0-2" x="398.371669" y="12.328947"/>
  <use xlink:href="#glyph0-3" x="403.997018" y="12.328947"/>
  <use xlink:href="#glyph0-4" x="409.622368" y="12.328947"/>
  <use xlink:href="#glyph0-5" x="412.122523" y="12.328947"/>
  <use xlink:href="#glyph0-6" x="417.122834" y="12.328947"/>
  <use xlink:href="#glyph0-7" x="421.498105" y="12.328947"/>
  <use xlink:href="#glyph0-1" x="427.123455" y="12.328947"/>
  <use xlink:href="#glyph0-9" x="433.373843" y="12.328947"/>
  <use xlink:href="#glyph0-9" x="437.124076" y="12.328947"/>
  <use xlink:href="#glyph0-3" x="440.874309" y="12.328947"/>
  <use xlink:href="#glyph0-5" x="446.499659" y="12.328947"/>
  <use xlink:href="#glyph0-10" x="451.499969" y="12.328947"/>
  <use xlink:href="#glyph0-5" x="455.250202" y="12.328947"/>
  <use xlink:href="#glyph0-11" x="460.250513" y="12.328947"/>
  <use xlink:href="#glyph0-7" x="465.875862" y="12.328947"/>
  <use xlink:href="#glyph0-19" x="471.501212" y="12.328947"/>
</g>
<path style="fill:none;stroke-width:1;stroke-linecap:butt;stroke-linejoin:miter;stroke:rgb(100%,100%,0%);stroke-opacity:1;stroke-miterlimit:4;" d="M 349.998858 -385.502065 L 822.000783 -385.502065 " transform="matrix(0.625039,0,0,0.625899,2.721498,258.496403)"/>
<g style="fill:rgb(0%,0%,0%);fill-opacity:1;">
  <use xlink:href="#glyph0-1" x="223.046875" y="26.727384"/>
  <use xlink:href="#glyph0-2" x="229.297263" y="26.727384"/>
  <use xlink:href="#glyph0-3" x="234.922613" y="26.727384"/>
  <use xlink:href="#glyph0-4" x="240.547962" y="26.727384"/>
  <use xlink:href="#glyph0-5" x="243.048118" y="26.727384"/>
  <use xlink:href="#glyph0-6" x="248.048428" y="26.727384"/>
  <use xlink:href="#glyph0-7" x="252.4237" y="26.727384"/>
  <use xlink:href="#glyph0-1" x="258.04905" y="26.727384"/>
  <use xlink:href="#glyph0-9" x="264.299438" y="26.727384"/>
  <use xlink:href="#glyph0-9" x="268.049671" y="26.727384"/>
  <use xlink:href="#glyph0-3" x="271.799904" y="26.727384"/>
  <use xlink:href="#glyph0-5" x="277.425253" y="26.727384"/>
  <use xlink:href="#glyph0-10" x="282.425564" y="26.727384"/>
  <use xlink:href="#glyph0-5" x="286.175797" y="26.727384"/>
  <use xlink:href="#glyph0-11" x="291.176108" y="26.727384"/>
  <use xlink:href="#glyph0-7" x="296.801457" y="26.727384"/>
  <use xlink:href="#glyph0-12" x="302.426807" y="26.727384"/>
  <use xlink:href="#glyph0-20" x="305.552001" y="26.727384"/>
  <use xlink:href="#glyph0-6" x="311.17735" y="26.727384"/>
  <use xlink:href="#glyph0-18" x="315.552622" y="26.727384"/>
  <use xlink:href="#glyph0-2" x="321.177971" y="26.727384"/>
  <use xlink:href="#glyph0-15" x="326.803321" y="26.727384"/>
  <use xlink:href="#glyph0-21" x="331.803632" y="26.727384"/>
  <use xlink:href="#glyph0-21" x="336.803942" y="26.727384"/>
  <use xlink:href="#glyph0-22" x="341.804253" y="26.727384"/>
  <use xlink:href="#glyph0-22" x="344.929447" y="26.727384"/>
  <use xlink:href="#glyph0-20" x="348.054641" y="26.727384"/>
  <use xlink:href="#glyph0-14" x="353.679991" y="26.727384"/>
  <use xlink:href="#glyph0-17" x="359.30534" y="26.727384"/>
  <use xlink:href="#glyph0-4" x="361.805495" y="26.727384"/>
  <use xlink:href="#glyph0-23" x="364.305651" y="26.727384"/>
  <use xlink:href="#glyph0-7" x="369.931" y="26.727384"/>
  <use xlink:href="#glyph0-9" x="375.55635" y="26.727384"/>
  <use xlink:href="#glyph0-22" x="379.306583" y="26.727384"/>
  <use xlink:href="#glyph0-22" x="382.431777" y="26.727384"/>
  <use xlink:href="#glyph0-20" x="385.556971" y="26.727384"/>
  <use xlink:href="#glyph0-3" x="391.18232" y="26.727384"/>
  <use xlink:href="#glyph0-6" x="396.80767" y="26.727384"/>
  <use xlink:href="#glyph0-17" x="401.182942" y="26.727384"/>
  <use xlink:href="#glyph0-15" x="403.683097" y="26.727384"/>
  <use xlink:href="#glyph0-22" x="408.683408" y="26.727384"/>
  <use xlink:href="#glyph0-22" x="411.808602" y="26.727384"/>
  <use xlink:href="#glyph0-23" x="414.933796" y="26.727384"/>
  <use xlink:href="#glyph0-18" x="420.559146" y="26.727384"/>
  <use xlink:href="#glyph0-15" x="426.184495" y="26.727384"/>
  <use xlink:href="#glyph0-14" x="431.184806" y="26.727384"/>
  <use xlink:href="#glyph0-24" x="436.810155" y="26.727384"/>
  <use xlink:href="#glyph0-7" x="445.560699" y="26.727384"/>
  <use xlink:href="#glyph0-2" x="451.186048" y="26.727384"/>
  <use xlink:href="#glyph0-16" x="456.811398" y="26.727384"/>
  <use xlink:href="#glyph0-8" x="459.936592" y="26.727384"/>
  <use xlink:href="#glyph0-25" x="462.436747" y="26.727384"/>
  <use xlink:href="#glyph0-10" x="469.312174" y="26.727384"/>
  <use xlink:href="#glyph0-5" x="473.062407" y="26.727384"/>
  <use xlink:href="#glyph0-11" x="478.062718" y="26.727384"/>
  <use xlink:href="#glyph0-7" x="483.688067" y="26.727384"/>
  <use xlink:href="#glyph0-26" x="489.313417" y="26.727384"/>
  <use xlink:href="#glyph0-18" x="495.563805" y="26.727384"/>
  <use xlink:href="#glyph0-23" x="501.189155" y="26.727384"/>
  <use xlink:href="#glyph0-7" x="506.814504" y="26.727384"/>
  <use xlink:href="#glyph0-27" x="512.439854" y="26.727384"/>
</g>
<g style="fill:rgb(0%,0%,0%);fill-opacity:1;">
  <use xlink:href="#glyph0-15" x="279.925781" y="36.114103"/>
  <use xlink:href="#glyph0-18" x="284.926092" y="36.114103"/>
  <use xlink:href="#glyph0-2" x="290.551441" y="36.114103"/>
  <use xlink:href="#glyph0-6" x="296.176791" y="36.114103"/>
  <use xlink:href="#glyph0-16" x="300.552063" y="36.114103"/>
  <use xlink:href="#glyph0-8" x="303.677257" y="36.114103"/>
  <use xlink:href="#glyph0-28" x="306.177412" y="36.114103"/>
  <use xlink:href="#glyph0-18" x="311.802762" y="36.114103"/>
  <use xlink:href="#glyph0-14" x="317.428111" y="36.114103"/>
  <use xlink:href="#glyph0-9" x="323.053461" y="36.114103"/>
  <use xlink:href="#glyph0-15" x="326.178655" y="36.114103"/>
  <use xlink:href="#glyph0-7" x="331.178965" y="36.114103"/>
  <use xlink:href="#glyph0-29" x="336.804315" y="36.114103"/>
  <use xlink:href="#glyph0-3" x="344.304781" y="36.114103"/>
  <use xlink:href="#glyph0-2" x="349.93013" y="36.114103"/>
  <use xlink:href="#glyph0-3" x="355.55548" y="36.114103"/>
  <use xlink:href="#glyph0-30" x="361.180829" y="36.114103"/>
  <use xlink:href="#glyph0-7" x="366.806179" y="36.114103"/>
  <use xlink:href="#glyph0-9" x="372.431528" y="36.114103"/>
  <use xlink:href="#glyph0-8" x="376.181761" y="36.114103"/>
  <use xlink:href="#glyph0-25" x="378.681917" y="36.114103"/>
  <use xlink:href="#glyph0-28" x="385.557344" y="36.114103"/>
  <use xlink:href="#glyph0-18" x="391.182693" y="36.114103"/>
  <use xlink:href="#glyph0-14" x="396.808043" y="36.114103"/>
  <use xlink:href="#glyph0-9" x="402.433392" y="36.114103"/>
  <use xlink:href="#glyph0-15" x="405.558586" y="36.114103"/>
  <use xlink:href="#glyph0-7" x="410.558897" y="36.114103"/>
  <use xlink:href="#glyph0-29" x="416.184246" y="36.114103"/>
  <use xlink:href="#glyph0-3" x="423.684712" y="36.114103"/>
  <use xlink:href="#glyph0-2" x="429.310062" y="36.114103"/>
  <use xlink:href="#glyph0-3" x="434.935411" y="36.114103"/>
  <use xlink:href="#glyph0-30" x="440.560761" y="36.114103"/>
  <use xlink:href="#glyph0-7" x="446.18611" y="36.114103"/>
  <use xlink:href="#glyph0-9" x="451.81146" y="36.114103"/>
  <use xlink:href="#glyph0-27" x="455.561693" y="36.114103"/>
</g>
<g style="fill:rgb(0%,0%,0%);fill-opacity:1;">
  <use xlink:href="#glyph0-15" x="309.929688" y="45.504728"/>
  <use xlink:href="#glyph0-18" x="314.929998" y="45.504728"/>
  <use xlink:href="#glyph0-2" x="320.555348" y="45.504728"/>
  <use xlink:href="#glyph0-6" x="326.180697" y="45.504728"/>
  <use xlink:href="#glyph0-16" x="330.555969" y="45.504728"/>
  <use xlink:href="#glyph0-8" x="333.681163" y="45.504728"/>
  <use xlink:href="#glyph0-15" x="336.181318" y="45.504728"/>
  <use xlink:href="#glyph0-4" x="341.181629" y="45.504728"/>
  <use xlink:href="#glyph0-3" x="343.681784" y="45.504728"/>
  <use xlink:href="#glyph0-2" x="349.307134" y="45.504728"/>
  <use xlink:href="#glyph0-30" x="354.932483" y="45.504728"/>
  <use xlink:href="#glyph0-22" x="360.557833" y="45.504728"/>
  <use xlink:href="#glyph0-22" x="363.683027" y="45.504728"/>
  <use xlink:href="#glyph0-10" x="366.808221" y="45.504728"/>
  <use xlink:href="#glyph0-5" x="370.558454" y="45.504728"/>
  <use xlink:href="#glyph0-11" x="375.558765" y="45.504728"/>
  <use xlink:href="#glyph0-7" x="381.184114" y="45.504728"/>
  <use xlink:href="#glyph0-8" x="386.809464" y="45.504728"/>
  <use xlink:href="#glyph0-31" x="389.309619" y="45.504728"/>
  <use xlink:href="#glyph0-32" x="393.684891" y="45.504728"/>
  <use xlink:href="#glyph0-16" x="398.685201" y="45.504728"/>
  <use xlink:href="#glyph0-9" x="401.810396" y="45.504728"/>
  <use xlink:href="#glyph0-10" x="405.560629" y="45.504728"/>
  <use xlink:href="#glyph0-5" x="409.310862" y="45.504728"/>
  <use xlink:href="#glyph0-11" x="414.311172" y="45.504728"/>
  <use xlink:href="#glyph0-7" x="419.936522" y="45.504728"/>
  <use xlink:href="#glyph0-27" x="425.561871" y="45.504728"/>
</g>
<g style="fill:rgb(0%,0%,0%);fill-opacity:1;">
  <use xlink:href="#glyph0-33" x="295.238281" y="54.891447"/>
  <use xlink:href="#glyph0-17" x="301.48867" y="54.891447"/>
  <use xlink:href="#glyph0-2" x="303.988825" y="54.891447"/>
  <use xlink:href="#glyph0-3" x="309.614174" y="54.891447"/>
  <use xlink:href="#glyph0-9" x="315.239524" y="54.891447"/>
  <use xlink:href="#glyph0-5" x="318.989757" y="54.891447"/>
  <use xlink:href="#glyph0-34" x="323.990067" y="54.891447"/>
  <use xlink:href="#glyph0-11" x="330.865495" y="54.891447"/>
  <use xlink:href="#glyph0-32" x="336.490844" y="54.891447"/>
  <use xlink:href="#glyph0-9" x="341.491155" y="54.891447"/>
  <use xlink:href="#glyph0-18" x="344.616349" y="54.891447"/>
  <use xlink:href="#glyph0-11" x="350.241698" y="54.891447"/>
  <use xlink:href="#glyph0-7" x="355.867048" y="54.891447"/>
  <use xlink:href="#glyph0-9" x="361.492397" y="54.891447"/>
  <use xlink:href="#glyph0-16" x="365.24263" y="54.891447"/>
  <use xlink:href="#glyph0-17" x="368.367824" y="54.891447"/>
  <use xlink:href="#glyph0-7" x="370.86798" y="54.891447"/>
  <use xlink:href="#glyph0-6" x="376.493329" y="54.891447"/>
  <use xlink:href="#glyph0-8" x="380.868601" y="54.891447"/>
  <use xlink:href="#glyph0-25" x="383.368756" y="54.891447"/>
  <use xlink:href="#glyph0-33" x="390.244184" y="54.891447"/>
  <use xlink:href="#glyph0-17" x="396.494572" y="54.891447"/>
  <use xlink:href="#glyph0-2" x="398.994727" y="54.891447"/>
  <use xlink:href="#glyph0-34" x="404.620077" y="54.891447"/>
  <use xlink:href="#glyph0-11" x="411.495504" y="54.891447"/>
  <use xlink:href="#glyph0-32" x="417.120853" y="54.891447"/>
  <use xlink:href="#glyph0-9" x="422.121164" y="54.891447"/>
  <use xlink:href="#glyph0-18" x="425.246358" y="54.891447"/>
  <use xlink:href="#glyph0-11" x="430.871708" y="54.891447"/>
  <use xlink:href="#glyph0-19" x="436.497057" y="54.891447"/>
  <use xlink:href="#glyph0-19" x="439.622251" y="54.891447"/>
</g>
<path style="fill:none;stroke-width:1;stroke-linecap:butt;stroke-linejoin:miter;stroke:rgb(0%,0%,0%);stroke-opacity:1;stroke-miterlimit:4;" d="M 586.002945 -281.002425 L 367.479022 -262.997082 L 586.002945 -244.99798 L 804.520619 -262.997082 Z M 586.002945 -281.002425 " transform="matrix(0.625039,0,0,0.625899,2.721498,258.496403)"/>
<g style="fill:rgb(0%,0%,0%);fill-opacity:1;">
  <use xlink:href="#glyph0-32" x="299.300781" y="96.200041"/>
  <use xlink:href="#glyph0-16" x="304.301092" y="96.200041"/>
  <use xlink:href="#glyph0-9" x="307.426286" y="96.200041"/>
  <use xlink:href="#glyph0-10" x="311.176519" y="96.200041"/>
  <use xlink:href="#glyph0-5" x="314.926752" y="96.200041"/>
  <use xlink:href="#glyph0-11" x="319.927063" y="96.200041"/>
  <use xlink:href="#glyph0-7" x="325.552412" y="96.200041"/>
  <use xlink:href="#glyph0-35" x="331.177762" y="96.200041"/>
  <use xlink:href="#glyph0-36" x="334.302956" y="96.200041"/>
  <use xlink:href="#glyph0-17" x="341.803422" y="96.200041"/>
  <use xlink:href="#glyph0-6" x="344.303577" y="96.200041"/>
  <use xlink:href="#glyph0-37" x="348.678849" y="96.200041"/>
  <use xlink:href="#glyph0-18" x="354.929237" y="96.200041"/>
  <use xlink:href="#glyph0-2" x="360.554587" y="96.200041"/>
  <use xlink:href="#glyph0-6" x="366.179936" y="96.200041"/>
  <use xlink:href="#glyph0-16" x="370.555208" y="96.200041"/>
  <use xlink:href="#glyph0-3" x="373.680402" y="96.200041"/>
  <use xlink:href="#glyph0-2" x="379.305752" y="96.200041"/>
  <use xlink:href="#glyph0-16" x="384.931101" y="96.200041"/>
  <use xlink:href="#glyph0-1" x="388.056295" y="96.200041"/>
  <use xlink:href="#glyph0-9" x="394.306684" y="96.200041"/>
  <use xlink:href="#glyph0-9" x="398.056917" y="96.200041"/>
  <use xlink:href="#glyph0-3" x="401.807149" y="96.200041"/>
  <use xlink:href="#glyph0-5" x="407.432499" y="96.200041"/>
  <use xlink:href="#glyph0-10" x="412.43281" y="96.200041"/>
  <use xlink:href="#glyph0-5" x="416.183043" y="96.200041"/>
  <use xlink:href="#glyph0-11" x="421.183353" y="96.200041"/>
  <use xlink:href="#glyph0-7" x="426.808703" y="96.200041"/>
  <use xlink:href="#glyph0-12" x="432.434052" y="96.200041"/>
  <use xlink:href="#glyph0-19" x="435.559246" y="96.200041"/>
</g>
<path style="fill:none;stroke-width:1;stroke-linecap:butt;stroke-linejoin:miter;stroke:rgb(0%,0%,0%);stroke-opacity:1;stroke-miterlimit:4;" d="M 586.002945 -317.4375 C 586.002945 -308.918508 586.002945 -299.931439 586.002945 -291.150323 " transform="matrix(0.625039,0,0,0.625899,2.721498,258.496403)"/>
<path style="fill-rule:nonzero;fill:rgb(0%,0%,0%);fill-opacity:1;stroke-width:1;stroke-linecap:butt;stroke-linejoin:miter;stroke:rgb(0%,0%,0%);stroke-opacity:1;stroke-miterlimit:4;" d="M 589.502727 -291.000539 L 586.002945 -281.002425 L 582.496913 -291.000539 Z M 589.502727 -291.000539 " transform="matrix(0.625039,0,0,0.625899,2.721498,258.496403)"/>
<path style="fill:none;stroke-width:1;stroke-linecap:butt;stroke-linejoin:miter;stroke:rgb(0%,0%,0%);stroke-opacity:1;stroke-miterlimit:4;" d="M 1093.502664 -35.998698 L 696.50233 -35.998698 L 696.50233 -0.000493894 L 1093.502664 -0.000493894 Z M 1093.502664 -35.998698 " transform="matrix(0.625039,0,0,0.625899,2.721498,258.496403)"/>
<g style="fill:rgb(0%,0%,0%);fill-opacity:1;">
  <use xlink:href="#glyph0-10" x="442.4375" y="249.547697"/>
  <use xlink:href="#glyph0-5" x="446.187733" y="249.547697"/>
  <use xlink:href="#glyph0-11" x="451.188044" y="249.547697"/>
  <use xlink:href="#glyph0-7" x="456.813393" y="249.547697"/>
  <use xlink:href="#glyph0-26" x="462.438743" y="249.547697"/>
  <use xlink:href="#glyph0-18" x="468.689131" y="249.547697"/>
  <use xlink:href="#glyph0-23" x="474.31448" y="249.547697"/>
  <use xlink:href="#glyph0-7" x="479.93983" y="249.547697"/>
  <use xlink:href="#glyph0-38" x="485.565179" y="249.547697"/>
  <use xlink:href="#glyph0-3" x="488.065335" y="249.547697"/>
  <use xlink:href="#glyph0-11" x="493.690684" y="249.547697"/>
  <use xlink:href="#glyph0-11" x="499.316034" y="249.547697"/>
  <use xlink:href="#glyph0-7" x="504.941383" y="249.547697"/>
  <use xlink:href="#glyph0-2" x="510.566733" y="249.547697"/>
  <use xlink:href="#glyph0-23" x="516.192082" y="249.547697"/>
  <use xlink:href="#glyph0-12" x="521.817432" y="249.547697"/>
  <use xlink:href="#glyph0-39" x="524.942626" y="249.547697"/>
  <use xlink:href="#glyph0-40" x="529.942936" y="249.547697"/>
  <use xlink:href="#glyph0-11" x="534.943247" y="249.547697"/>
  <use xlink:href="#glyph0-12" x="540.568596" y="249.547697"/>
  <use xlink:href="#glyph0-41" x="543.693791" y="249.547697"/>
  <use xlink:href="#glyph0-42" x="547.444024" y="249.547697"/>
  <use xlink:href="#glyph0-17" x="553.069373" y="249.547697"/>
  <use xlink:href="#glyph0-2" x="555.569528" y="249.547697"/>
  <use xlink:href="#glyph0-23" x="561.194878" y="249.547697"/>
  <use xlink:href="#glyph0-41" x="566.820227" y="249.547697"/>
  <use xlink:href="#glyph0-27" x="570.57046" y="249.547697"/>
  <use xlink:href="#glyph0-41" x="573.070616" y="249.547697"/>
  <use xlink:href="#glyph0-43" x="576.820849" y="249.547697"/>
  <use xlink:href="#glyph0-7" x="583.696276" y="249.547697"/>
  <use xlink:href="#glyph0-11" x="589.321625" y="249.547697"/>
  <use xlink:href="#glyph0-7" x="594.946975" y="249.547697"/>
  <use xlink:href="#glyph0-2" x="600.572324" y="249.547697"/>
  <use xlink:href="#glyph0-23" x="606.197674" y="249.547697"/>
  <use xlink:href="#glyph0-7" x="611.823023" y="249.547697"/>
  <use xlink:href="#glyph0-2" x="617.448373" y="249.547697"/>
  <use xlink:href="#glyph0-16" x="623.073722" y="249.547697"/>
  <use xlink:href="#glyph0-28" x="626.198916" y="249.547697"/>
  <use xlink:href="#glyph0-17" x="631.824266" y="249.547697"/>
  <use xlink:href="#glyph0-44" x="634.324421" y="249.547697"/>
  <use xlink:href="#glyph0-7" x="638.699693" y="249.547697"/>
  <use xlink:href="#glyph0-1" x="644.325042" y="249.547697"/>
  <use xlink:href="#glyph0-9" x="650.575431" y="249.547697"/>
  <use xlink:href="#glyph0-9" x="654.325664" y="249.547697"/>
  <use xlink:href="#glyph0-3" x="658.075897" y="249.547697"/>
  <use xlink:href="#glyph0-5" x="663.701246" y="249.547697"/>
  <use xlink:href="#glyph0-41" x="668.701557" y="249.547697"/>
  <use xlink:href="#glyph0-19" x="672.45179" y="249.547697"/>
  <use xlink:href="#glyph0-19" x="675.576984" y="249.547697"/>
  <use xlink:href="#glyph0-45" x="678.702178" y="249.547697"/>
</g>
<path style="fill:none;stroke-width:1;stroke-linecap:butt;stroke-linejoin:miter;stroke:rgb(0%,0%,0%);stroke-opacity:1;stroke-miterlimit:4;" d="M 877.497335 -113.499686 L 530.500143 -113.499686 L 530.500143 -77.501482 L 877.497335 -77.501482 Z M 877.497335 -113.499686 " transform="matrix(0.625039,0,0,0.625899,2.721498,258.496403)"/>
<g style="fill:rgb(0%,0%,0%);fill-opacity:1;">
  <use xlink:href="#glyph0-10" x="338.367188" y="201.039884"/>
  <use xlink:href="#glyph0-5" x="342.11742" y="201.039884"/>
  <use xlink:href="#glyph0-11" x="347.117731" y="201.039884"/>
  <use xlink:href="#glyph0-7" x="352.743081" y="201.039884"/>
  <use xlink:href="#glyph0-26" x="358.36843" y="201.039884"/>
  <use xlink:href="#glyph0-18" x="364.618818" y="201.039884"/>
  <use xlink:href="#glyph0-23" x="370.244168" y="201.039884"/>
  <use xlink:href="#glyph0-7" x="375.869517" y="201.039884"/>
  <use xlink:href="#glyph0-38" x="381.494867" y="201.039884"/>
  <use xlink:href="#glyph0-3" x="383.995022" y="201.039884"/>
  <use xlink:href="#glyph0-11" x="389.620372" y="201.039884"/>
  <use xlink:href="#glyph0-11" x="395.245721" y="201.039884"/>
  <use xlink:href="#glyph0-7" x="400.871071" y="201.039884"/>
  <use xlink:href="#glyph0-2" x="406.49642" y="201.039884"/>
  <use xlink:href="#glyph0-23" x="412.12177" y="201.039884"/>
  <use xlink:href="#glyph0-12" x="417.747119" y="201.039884"/>
  <use xlink:href="#glyph0-39" x="420.872313" y="201.039884"/>
  <use xlink:href="#glyph0-40" x="425.872624" y="201.039884"/>
  <use xlink:href="#glyph0-11" x="430.872934" y="201.039884"/>
  <use xlink:href="#glyph0-12" x="436.498284" y="201.039884"/>
  <use xlink:href="#glyph0-41" x="439.623478" y="201.039884"/>
  <use xlink:href="#glyph0-42" x="443.373711" y="201.039884"/>
  <use xlink:href="#glyph0-17" x="448.999061" y="201.039884"/>
  <use xlink:href="#glyph0-2" x="451.499216" y="201.039884"/>
  <use xlink:href="#glyph0-23" x="457.124565" y="201.039884"/>
  <use xlink:href="#glyph0-41" x="462.749915" y="201.039884"/>
  <use xlink:href="#glyph0-27" x="466.500148" y="201.039884"/>
  <use xlink:href="#glyph0-41" x="469.000303" y="201.039884"/>
  <use xlink:href="#glyph0-46" x="472.750536" y="201.039884"/>
  <use xlink:href="#glyph0-3" x="478.375886" y="201.039884"/>
  <use xlink:href="#glyph0-9" x="484.001235" y="201.039884"/>
  <use xlink:href="#glyph0-17" x="487.751468" y="201.039884"/>
  <use xlink:href="#glyph0-3" x="490.251623" y="201.039884"/>
  <use xlink:href="#glyph0-20" x="495.876973" y="201.039884"/>
  <use xlink:href="#glyph0-4" x="501.502322" y="201.039884"/>
  <use xlink:href="#glyph0-7" x="504.002478" y="201.039884"/>
  <use xlink:href="#glyph0-1" x="509.627827" y="201.039884"/>
  <use xlink:href="#glyph0-9" x="515.878215" y="201.039884"/>
  <use xlink:href="#glyph0-9" x="519.628448" y="201.039884"/>
  <use xlink:href="#glyph0-3" x="523.378681" y="201.039884"/>
  <use xlink:href="#glyph0-5" x="529.004031" y="201.039884"/>
  <use xlink:href="#glyph0-41" x="534.004342" y="201.039884"/>
  <use xlink:href="#glyph0-19" x="537.754575" y="201.039884"/>
  <use xlink:href="#glyph0-19" x="540.879769" y="201.039884"/>
  <use xlink:href="#glyph0-45" x="544.004963" y="201.039884"/>
</g>
<path style="fill:none;stroke-width:1;stroke-linecap:butt;stroke-linejoin:miter;stroke:rgb(0%,0%,0%);stroke-opacity:1;stroke-miterlimit:4;" d="M 916.001192 -200.000224 L 703.851873 -182.001122 L 916.001192 -164.00202 L 1128.150512 -182.001122 Z M 916.001192 -200.000224 " transform="matrix(0.625039,0,0,0.625899,2.721498,258.496403)"/>
<g style="fill:rgb(0%,0%,0%);fill-opacity:1;">
  <use xlink:href="#glyph0-32" x="506.816406" y="146.899259"/>
  <use xlink:href="#glyph0-16" x="511.816717" y="146.899259"/>
  <use xlink:href="#glyph0-9" x="514.941911" y="146.899259"/>
  <use xlink:href="#glyph0-10" x="518.692144" y="146.899259"/>
  <use xlink:href="#glyph0-5" x="522.442377" y="146.899259"/>
  <use xlink:href="#glyph0-11" x="527.442688" y="146.899259"/>
  <use xlink:href="#glyph0-7" x="533.068037" y="146.899259"/>
  <use xlink:href="#glyph0-35" x="538.693387" y="146.899259"/>
  <use xlink:href="#glyph0-36" x="541.818581" y="146.899259"/>
  <use xlink:href="#glyph0-17" x="549.319047" y="146.899259"/>
  <use xlink:href="#glyph0-6" x="551.819202" y="146.899259"/>
  <use xlink:href="#glyph0-46" x="556.194474" y="146.899259"/>
  <use xlink:href="#glyph0-3" x="561.819823" y="146.899259"/>
  <use xlink:href="#glyph0-9" x="567.445173" y="146.899259"/>
  <use xlink:href="#glyph0-17" x="571.195406" y="146.899259"/>
  <use xlink:href="#glyph0-3" x="573.695561" y="146.899259"/>
  <use xlink:href="#glyph0-20" x="579.320911" y="146.899259"/>
  <use xlink:href="#glyph0-4" x="584.94626" y="146.899259"/>
  <use xlink:href="#glyph0-7" x="587.446415" y="146.899259"/>
  <use xlink:href="#glyph0-1" x="593.071765" y="146.899259"/>
  <use xlink:href="#glyph0-9" x="599.322153" y="146.899259"/>
  <use xlink:href="#glyph0-9" x="603.072386" y="146.899259"/>
  <use xlink:href="#glyph0-3" x="606.822619" y="146.899259"/>
  <use xlink:href="#glyph0-5" x="612.447969" y="146.899259"/>
  <use xlink:href="#glyph0-10" x="617.448279" y="146.899259"/>
  <use xlink:href="#glyph0-5" x="621.198512" y="146.899259"/>
  <use xlink:href="#glyph0-11" x="626.198823" y="146.899259"/>
  <use xlink:href="#glyph0-7" x="631.824172" y="146.899259"/>
  <use xlink:href="#glyph0-12" x="637.449522" y="146.899259"/>
  <use xlink:href="#glyph0-19" x="640.574716" y="146.899259"/>
</g>
<path style="fill:none;stroke-width:1;stroke-linecap:butt;stroke-linejoin:miter;stroke:rgb(0%,0%,0%);stroke-opacity:1;stroke-miterlimit:4;" d="M 806.001777 -262.997082 C 858.498515 -262.997082 909.051624 -257.84824 915.338734 -211.240302 " transform="matrix(0.625039,0,0,0.625899,2.721498,258.496403)"/>
<path style="fill-rule:nonzero;fill:rgb(0%,0%,0%);fill-opacity:1;stroke-width:1;stroke-linecap:butt;stroke-linejoin:miter;stroke:rgb(0%,0%,0%);stroke-opacity:1;stroke-miterlimit:4;" d="M 918.851015 -211.202856 L 916.001192 -200.998788 L 911.870199 -210.759743 Z M 918.851015 -211.202856 " transform="matrix(0.625039,0,0,0.625899,2.721498,258.496403)"/>
<path style="fill:none;stroke-width:1;stroke-linecap:butt;stroke-linejoin:miter;stroke:rgb(0%,0%,0%);stroke-opacity:1;stroke-miterlimit:4;" d="M 592.502541 -208.999776 L 107.501424 -208.999776 L 107.501424 -155.002469 L 592.502541 -155.002469 Z M 592.502541 -208.999776 " transform="matrix(0.625039,0,0,0.625899,2.721498,258.496403)"/>
<g style="fill:rgb(0%,0%,0%);fill-opacity:1;">
  <use xlink:href="#glyph0-15" x="77.414062" y="137.196134"/>
  <use xlink:href="#glyph0-18" x="82.414373" y="137.196134"/>
  <use xlink:href="#glyph0-2" x="88.039723" y="137.196134"/>
  <use xlink:href="#glyph0-6" x="93.665072" y="137.196134"/>
  <use xlink:href="#glyph0-16" x="98.040344" y="137.196134"/>
  <use xlink:href="#glyph0-8" x="101.165538" y="137.196134"/>
  <use xlink:href="#glyph0-15" x="103.665693" y="137.196134"/>
  <use xlink:href="#glyph0-4" x="108.666004" y="137.196134"/>
  <use xlink:href="#glyph0-3" x="111.166159" y="137.196134"/>
  <use xlink:href="#glyph0-2" x="116.791509" y="137.196134"/>
  <use xlink:href="#glyph0-30" x="122.416858" y="137.196134"/>
  <use xlink:href="#glyph0-22" x="128.042208" y="137.196134"/>
  <use xlink:href="#glyph0-22" x="131.167402" y="137.196134"/>
  <use xlink:href="#glyph0-1" x="134.292596" y="137.196134"/>
  <use xlink:href="#glyph0-9" x="140.542984" y="137.196134"/>
  <use xlink:href="#glyph0-9" x="144.293217" y="137.196134"/>
  <use xlink:href="#glyph0-3" x="148.04345" y="137.196134"/>
  <use xlink:href="#glyph0-5" x="153.6688" y="137.196134"/>
  <use xlink:href="#glyph0-10" x="158.66911" y="137.196134"/>
  <use xlink:href="#glyph0-5" x="162.419343" y="137.196134"/>
  <use xlink:href="#glyph0-11" x="167.419654" y="137.196134"/>
  <use xlink:href="#glyph0-7" x="173.045004" y="137.196134"/>
  <use xlink:href="#glyph0-8" x="178.670353" y="137.196134"/>
  <use xlink:href="#glyph0-47" x="181.170508" y="137.196134"/>
  <use xlink:href="#glyph0-31" x="183.670664" y="137.196134"/>
  <use xlink:href="#glyph0-3" x="188.045936" y="137.196134"/>
  <use xlink:href="#glyph0-9" x="193.671285" y="137.196134"/>
  <use xlink:href="#glyph0-9" x="197.421518" y="137.196134"/>
  <use xlink:href="#glyph0-8" x="201.171751" y="137.196134"/>
  <use xlink:href="#glyph0-48" x="203.671906" y="137.196134"/>
  <use xlink:href="#glyph0-8" x="211.172372" y="137.196134"/>
  <use xlink:href="#glyph0-32" x="213.672528" y="137.196134"/>
  <use xlink:href="#glyph0-16" x="218.672838" y="137.196134"/>
  <use xlink:href="#glyph0-9" x="221.798032" y="137.196134"/>
  <use xlink:href="#glyph0-10" x="225.548265" y="137.196134"/>
  <use xlink:href="#glyph0-5" x="229.298498" y="137.196134"/>
  <use xlink:href="#glyph0-11" x="234.298809" y="137.196134"/>
  <use xlink:href="#glyph0-7" x="239.924158" y="137.196134"/>
  <use xlink:href="#glyph0-35" x="245.549508" y="137.196134"/>
  <use xlink:href="#glyph0-36" x="248.674702" y="137.196134"/>
  <use xlink:href="#glyph0-30" x="256.175168" y="137.196134"/>
  <use xlink:href="#glyph0-7" x="261.800518" y="137.196134"/>
  <use xlink:href="#glyph0-16" x="267.425867" y="137.196134"/>
  <use xlink:href="#glyph0-1" x="270.551061" y="137.196134"/>
  <use xlink:href="#glyph0-6" x="276.80145" y="137.196134"/>
  <use xlink:href="#glyph0-1" x="281.176721" y="137.196134"/>
  <use xlink:href="#glyph0-9" x="287.42711" y="137.196134"/>
  <use xlink:href="#glyph0-9" x="291.177343" y="137.196134"/>
  <use xlink:href="#glyph0-3" x="294.927576" y="137.196134"/>
  <use xlink:href="#glyph0-5" x="300.552925" y="137.196134"/>
  <use xlink:href="#glyph0-10" x="305.553236" y="137.196134"/>
  <use xlink:href="#glyph0-5" x="309.303469" y="137.196134"/>
  <use xlink:href="#glyph0-11" x="314.303779" y="137.196134"/>
  <use xlink:href="#glyph0-7" x="319.929129" y="137.196134"/>
  <use xlink:href="#glyph0-49" x="325.554478" y="137.196134"/>
  <use xlink:href="#glyph0-2" x="331.804867" y="137.196134"/>
  <use xlink:href="#glyph0-6" x="337.430216" y="137.196134"/>
  <use xlink:href="#glyph0-3" x="341.805488" y="137.196134"/>
  <use xlink:href="#glyph0-13" x="347.430837" y="137.196134"/>
  <use xlink:href="#glyph0-7" x="350.556032" y="137.196134"/>
  <use xlink:href="#glyph0-12" x="356.181381" y="137.196134"/>
  <use xlink:href="#glyph0-19" x="359.306575" y="137.196134"/>
  <use xlink:href="#glyph0-45" x="362.431769" y="137.196134"/>
</g>
<g style="fill:rgb(0%,0%,0%);fill-opacity:1;">
  <use xlink:href="#glyph0-50" x="101.476562" y="156.598478"/>
  <use xlink:href="#glyph0-14" x="108.35199" y="156.598478"/>
  <use xlink:href="#glyph0-3" x="113.977339" y="156.598478"/>
  <use xlink:href="#glyph0-4" x="119.602689" y="156.598478"/>
  <use xlink:href="#glyph0-10" x="122.102844" y="156.598478"/>
  <use xlink:href="#glyph0-5" x="125.853077" y="156.598478"/>
  <use xlink:href="#glyph0-11" x="130.853388" y="156.598478"/>
  <use xlink:href="#glyph0-7" x="136.478737" y="156.598478"/>
  <use xlink:href="#glyph0-8" x="142.104086" y="156.598478"/>
  <use xlink:href="#glyph0-1" x="144.604242" y="156.598478"/>
  <use xlink:href="#glyph0-9" x="150.85463" y="156.598478"/>
  <use xlink:href="#glyph0-9" x="154.604863" y="156.598478"/>
  <use xlink:href="#glyph0-3" x="158.355096" y="156.598478"/>
  <use xlink:href="#glyph0-5" x="163.980446" y="156.598478"/>
  <use xlink:href="#glyph0-51" x="168.980756" y="156.598478"/>
  <use xlink:href="#glyph0-4" x="174.606106" y="156.598478"/>
  <use xlink:href="#glyph0-7" x="177.106261" y="156.598478"/>
  <use xlink:href="#glyph0-24" x="182.73161" y="156.598478"/>
  <use xlink:href="#glyph0-7" x="191.482154" y="156.598478"/>
  <use xlink:href="#glyph0-2" x="197.107504" y="156.598478"/>
  <use xlink:href="#glyph0-16" x="202.732853" y="156.598478"/>
  <use xlink:href="#glyph0-16" x="205.858047" y="156.598478"/>
  <use xlink:href="#glyph0-5" x="208.983241" y="156.598478"/>
  <use xlink:href="#glyph0-11" x="213.983552" y="156.598478"/>
  <use xlink:href="#glyph0-7" x="219.608902" y="156.598478"/>
  <use xlink:href="#glyph0-8" x="225.234251" y="156.598478"/>
  <use xlink:href="#glyph0-48" x="227.734406" y="156.598478"/>
  <use xlink:href="#glyph0-8" x="235.234872" y="156.598478"/>
  <use xlink:href="#glyph0-3" x="237.735028" y="156.598478"/>
  <use xlink:href="#glyph0-9" x="243.360377" y="156.598478"/>
  <use xlink:href="#glyph0-9" x="247.11061" y="156.598478"/>
  <use xlink:href="#glyph0-35" x="250.235804" y="156.598478"/>
  <use xlink:href="#glyph0-36" x="253.360998" y="156.598478"/>
  <use xlink:href="#glyph0-30" x="260.861464" y="156.598478"/>
  <use xlink:href="#glyph0-7" x="266.486814" y="156.598478"/>
  <use xlink:href="#glyph0-16" x="272.112163" y="156.598478"/>
  <use xlink:href="#glyph0-51" x="275.237357" y="156.598478"/>
  <use xlink:href="#glyph0-4" x="280.862707" y="156.598478"/>
  <use xlink:href="#glyph0-7" x="283.362862" y="156.598478"/>
  <use xlink:href="#glyph0-24" x="288.988212" y="156.598478"/>
  <use xlink:href="#glyph0-7" x="297.738755" y="156.598478"/>
  <use xlink:href="#glyph0-2" x="303.364105" y="156.598478"/>
  <use xlink:href="#glyph0-16" x="308.989454" y="156.598478"/>
  <use xlink:href="#glyph0-10" x="312.114648" y="156.598478"/>
  <use xlink:href="#glyph0-5" x="315.864881" y="156.598478"/>
  <use xlink:href="#glyph0-11" x="320.865192" y="156.598478"/>
  <use xlink:href="#glyph0-7" x="326.490542" y="156.598478"/>
  <use xlink:href="#glyph0-12" x="332.115891" y="156.598478"/>
  <use xlink:href="#glyph0-19" x="335.241085" y="156.598478"/>
  <use xlink:href="#glyph0-45" x="338.366279" y="156.598478"/>
</g>
<path style="fill:none;stroke-width:1;stroke-linecap:butt;stroke-linejoin:miter;stroke:rgb(0%,0%,0%);stroke-opacity:1;stroke-miterlimit:4;" d="M 365.997864 -262.997082 C 344.292962 -262.997082 348.198969 -241.222162 349.617631 -219.097746 " transform="matrix(0.625039,0,0,0.625899,2.721498,258.496403)"/>
<path style="fill-rule:nonzero;fill:rgb(0%,0%,0%);fill-opacity:1;stroke-width:1;stroke-linecap:butt;stroke-linejoin:miter;stroke:rgb(0%,0%,0%);stroke-opacity:1;stroke-miterlimit:4;" d="M 353.117414 -219.12271 L 349.998858 -208.999776 L 346.130348 -218.860587 Z M 353.117414 -219.12271 " transform="matrix(0.625039,0,0,0.625899,2.721498,258.496403)"/>
<path style="fill:none;stroke-width:1;stroke-linecap:butt;stroke-linejoin:miter;stroke:rgb(0%,0%,0%);stroke-opacity:1;stroke-miterlimit:4;" d="M 703.001926 -182.001122 C 676.278586 -182.001122 697.95224 -152.262662 703.008175 -124.552532 " transform="matrix(0.625039,0,0,0.625899,2.721498,258.496403)"/>
<path style="fill-rule:nonzero;fill:rgb(0%,0%,0%);fill-opacity:1;stroke-width:1;stroke-linecap:butt;stroke-linejoin:miter;stroke:rgb(0%,0%,0%);stroke-opacity:1;stroke-miterlimit:4;" d="M 706.501708 -124.802173 L 704.001864 -114.498249 L 699.527142 -124.10942 Z M 706.501708 -124.802173 " transform="matrix(0.625039,0,0,0.625899,2.721498,258.496403)"/>
<path style="fill:none;stroke-width:1;stroke-linecap:butt;stroke-linejoin:miter;stroke:rgb(0%,0%,0%);stroke-opacity:1;stroke-miterlimit:4;" d="M 1161.998409 -113.499686 L 895.389973 -95.500584 L 1161.998409 -77.501482 L 1428.613094 -95.500584 Z M 1161.998409 -113.499686 " transform="matrix(0.625039,0,0,0.625899,2.721498,258.496403)"/>
<g style="fill:rgb(0%,0%,0%);fill-opacity:1;">
  <use xlink:href="#glyph0-32" x="642.449219" y="201.039884"/>
  <use xlink:href="#glyph0-16" x="647.449529" y="201.039884"/>
  <use xlink:href="#glyph0-9" x="650.574724" y="201.039884"/>
  <use xlink:href="#glyph0-10" x="654.324957" y="201.039884"/>
  <use xlink:href="#glyph0-5" x="658.07519" y="201.039884"/>
  <use xlink:href="#glyph0-11" x="663.0755" y="201.039884"/>
  <use xlink:href="#glyph0-7" x="668.70085" y="201.039884"/>
  <use xlink:href="#glyph0-35" x="674.326199" y="201.039884"/>
  <use xlink:href="#glyph0-36" x="677.451393" y="201.039884"/>
  <use xlink:href="#glyph0-17" x="684.951859" y="201.039884"/>
  <use xlink:href="#glyph0-6" x="687.452015" y="201.039884"/>
  <use xlink:href="#glyph0-43" x="691.827286" y="201.039884"/>
  <use xlink:href="#glyph0-7" x="698.702714" y="201.039884"/>
  <use xlink:href="#glyph0-11" x="704.328063" y="201.039884"/>
  <use xlink:href="#glyph0-7" x="709.953412" y="201.039884"/>
  <use xlink:href="#glyph0-2" x="715.578762" y="201.039884"/>
  <use xlink:href="#glyph0-23" x="721.204111" y="201.039884"/>
  <use xlink:href="#glyph0-7" x="726.829461" y="201.039884"/>
  <use xlink:href="#glyph0-2" x="732.45481" y="201.039884"/>
  <use xlink:href="#glyph0-16" x="738.08016" y="201.039884"/>
  <use xlink:href="#glyph0-28" x="741.205354" y="201.039884"/>
  <use xlink:href="#glyph0-17" x="746.830703" y="201.039884"/>
  <use xlink:href="#glyph0-44" x="749.330859" y="201.039884"/>
  <use xlink:href="#glyph0-7" x="753.706131" y="201.039884"/>
  <use xlink:href="#glyph0-23" x="759.33148" y="201.039884"/>
  <use xlink:href="#glyph0-1" x="764.95683" y="201.039884"/>
  <use xlink:href="#glyph0-9" x="771.207218" y="201.039884"/>
  <use xlink:href="#glyph0-9" x="774.957451" y="201.039884"/>
  <use xlink:href="#glyph0-3" x="778.707684" y="201.039884"/>
  <use xlink:href="#glyph0-5" x="784.333033" y="201.039884"/>
  <use xlink:href="#glyph0-10" x="789.333344" y="201.039884"/>
  <use xlink:href="#glyph0-5" x="793.083577" y="201.039884"/>
  <use xlink:href="#glyph0-11" x="798.083888" y="201.039884"/>
  <use xlink:href="#glyph0-7" x="803.709237" y="201.039884"/>
  <use xlink:href="#glyph0-12" x="809.334587" y="201.039884"/>
  <use xlink:href="#glyph0-19" x="812.459781" y="201.039884"/>
</g>
<path style="fill:none;stroke-width:1;stroke-linecap:butt;stroke-linejoin:miter;stroke:rgb(0%,0%,0%);stroke-opacity:1;stroke-miterlimit:4;" d="M 1129.000459 -182.001122 C 1158.998595 -182.001122 1161.729676 -154.471983 1161.97966 -124.65863 " transform="matrix(0.625039,0,0,0.625899,2.721498,258.496403)"/>
<path style="fill-rule:nonzero;fill:rgb(0%,0%,0%);fill-opacity:1;stroke-width:1;stroke-linecap:butt;stroke-linejoin:miter;stroke:rgb(0%,0%,0%);stroke-opacity:1;stroke-miterlimit:4;" d="M 1165.479443 -124.508845 L 1161.998409 -114.498249 L 1158.479877 -124.490122 Z M 1165.479443 -124.508845 " transform="matrix(0.625039,0,0,0.625899,2.721498,258.496403)"/>
<path style="fill:none;stroke-width:1;stroke-linecap:butt;stroke-linejoin:miter;stroke:rgb(0%,0%,0%);stroke-opacity:1;stroke-miterlimit:4;" d="M 894.002559 -95.500584 C 883.84694 -95.500584 886.171796 -68.25229 889.702826 -46.271417 " transform="matrix(0.625039,0,0,0.625899,2.721498,258.496403)"/>
<path style="fill-rule:nonzero;fill:rgb(0%,0%,0%);fill-opacity:1;stroke-width:1;stroke-linecap:butt;stroke-linejoin:miter;stroke:rgb(0%,0%,0%);stroke-opacity:1;stroke-miterlimit:4;" d="M 893.158862 -46.808145 L 891.40897 -36.360677 L 886.25929 -45.609869 Z M 893.158862 -46.808145 " transform="matrix(0.625039,0,0,0.625899,2.721498,258.496403)"/>
<path style="fill:none;stroke-width:1;stroke-linecap:butt;stroke-linejoin:miter;stroke:rgb(0%,0%,0%);stroke-opacity:1;stroke-miterlimit:4;" d="M 1467.991898 -17.999596 C 1467.991898 -8.057651 1450.530483 -0.000493894 1429.00057 -0.000493894 C 1407.464408 -0.000493894 1390.009243 -8.057651 1390.009243 -17.999596 C 1390.009243 -27.941541 1407.464408 -35.998698 1429.00057 -35.998698 C 1450.530483 -35.998698 1467.991898 -27.941541 1467.991898 -17.999596 Z M 1467.991898 -17.999596 " transform="matrix(0.625039,0,0,0.625899,2.721498,258.496403)"/>
<g style="fill:rgb(0%,0%,0%);fill-opacity:1;">
  <use xlink:href="#glyph0-2" x="881.527344" y="249.547697"/>
  <use xlink:href="#glyph0-18" x="887.152693" y="249.547697"/>
  <use xlink:href="#glyph0-43" x="892.778043" y="249.547697"/>
  <use xlink:href="#glyph0-18" x="899.65347" y="249.547697"/>
  <use xlink:href="#glyph0-15" x="905.278819" y="249.547697"/>
</g>
<path style="fill:none;stroke-width:1;stroke-linecap:butt;stroke-linejoin:miter;stroke:rgb(0%,0%,0%);stroke-opacity:1;stroke-miterlimit:4;" d="M 1430.000508 -95.500584 C 1450.499235 -95.500584 1445.918269 -67.690598 1439.037447 -45.597387 " transform="matrix(0.625039,0,0,0.625899,2.721498,258.496403)"/>
<path style="fill-rule:nonzero;fill:rgb(0%,0%,0%);fill-opacity:1;stroke-width:1;stroke-linecap:butt;stroke-linejoin:miter;stroke:rgb(0%,0%,0%);stroke-opacity:1;stroke-miterlimit:4;" d="M 1442.312243 -44.342942 L 1435.812647 -35.979975 L 1435.681405 -46.570986 Z M 1442.312243 -44.342942 " transform="matrix(0.625039,0,0,0.625899,2.721498,258.496403)"/>
<path style="fill-rule:nonzero;fill:rgb(100%,64.705884%,0%);fill-opacity:1;stroke-width:1;stroke-linecap:butt;stroke-linejoin:miter;stroke:rgb(100%,64.705884%,0%);stroke-opacity:1;stroke-miterlimit:4;" d="M 12.001107 -72.502425 C 12.001107 -72.502425 500.002038 -72.502425 500.002038 -72.502425 C 506.001665 -72.502425 512.001293 -78.500045 512.001293 -84.497665 C 512.001293 -84.497665 512.001293 -106.497261 512.001293 -106.497261 C 512.001293 -112.501122 506.001665 -118.498743 500.002038 -118.498743 C 500.002038 -118.498743 12.001107 -118.498743 12.001107 -118.498743 C 6.00148 -118.498743 0.00185269 -112.501122 0.00185269 -106.497261 C 0.00185269 -106.497261 0.00185269 -84.497665 0.00185269 -84.497665 C 0.00185269 -78.500045 6.00148 -72.502425 12.001107 -72.502425 " transform="matrix(0.625039,0,0,0.625899,2.721498,258.496403)"/>
<g style="fill:rgb(0%,0%,0%);fill-opacity:1;">
  <use xlink:href="#glyph0-1" x="89.289062" y="193.840666"/>
  <use xlink:href="#glyph0-2" x="95.539451" y="193.840666"/>
  <use xlink:href="#glyph0-3" x="101.1648" y="193.840666"/>
  <use xlink:href="#glyph0-4" x="106.79015" y="193.840666"/>
  <use xlink:href="#glyph0-5" x="109.290305" y="193.840666"/>
  <use xlink:href="#glyph0-6" x="114.290616" y="193.840666"/>
  <use xlink:href="#glyph0-7" x="118.665888" y="193.840666"/>
  <use xlink:href="#glyph0-8" x="124.291237" y="193.840666"/>
  <use xlink:href="#glyph0-16" x="126.791392" y="193.840666"/>
  <use xlink:href="#glyph0-5" x="129.916586" y="193.840666"/>
  <use xlink:href="#glyph0-11" x="134.916897" y="193.840666"/>
  <use xlink:href="#glyph0-7" x="140.542247" y="193.840666"/>
  <use xlink:href="#glyph0-6" x="146.167596" y="193.840666"/>
  <use xlink:href="#glyph0-8" x="150.542868" y="193.840666"/>
  <use xlink:href="#glyph0-12" x="153.043023" y="193.840666"/>
  <use xlink:href="#glyph0-15" x="156.168217" y="193.840666"/>
  <use xlink:href="#glyph0-3" x="161.168528" y="193.840666"/>
  <use xlink:href="#glyph0-4" x="166.793878" y="193.840666"/>
  <use xlink:href="#glyph0-4" x="169.294033" y="193.840666"/>
  <use xlink:href="#glyph0-8" x="171.794188" y="193.840666"/>
  <use xlink:href="#glyph0-3" x="174.294343" y="193.840666"/>
  <use xlink:href="#glyph0-2" x="179.919693" y="193.840666"/>
  <use xlink:href="#glyph0-3" x="185.545042" y="193.840666"/>
  <use xlink:href="#glyph0-4" x="191.170392" y="193.840666"/>
  <use xlink:href="#glyph0-5" x="193.670547" y="193.840666"/>
  <use xlink:href="#glyph0-44" x="198.670858" y="193.840666"/>
  <use xlink:href="#glyph0-7" x="203.04613" y="193.840666"/>
  <use xlink:href="#glyph0-10" x="208.671479" y="193.840666"/>
  <use xlink:href="#glyph0-5" x="212.421712" y="193.840666"/>
  <use xlink:href="#glyph0-11" x="217.422023" y="193.840666"/>
  <use xlink:href="#glyph0-7" x="223.047372" y="193.840666"/>
  <use xlink:href="#glyph0-6" x="228.672722" y="193.840666"/>
  <use xlink:href="#glyph0-19" x="233.047994" y="193.840666"/>
</g>
<path style="fill:none;stroke-width:1;stroke-linecap:butt;stroke-linejoin:miter;stroke:rgb(100%,64.705884%,0%);stroke-opacity:1;stroke-miterlimit:4;" d="M 0.00185269 -95.500584 L 512.001293 -95.500584 " transform="matrix(0.625039,0,0,0.625899,2.721498,258.496403)"/>
<g style="fill:rgb(0%,0%,0%);fill-opacity:1;">
  <use xlink:href="#glyph0-3" x="4.910156" y="208.235197"/>
  <use xlink:href="#glyph0-2" x="10.535506" y="208.235197"/>
  <use xlink:href="#glyph0-3" x="16.160855" y="208.235197"/>
  <use xlink:href="#glyph0-4" x="21.786205" y="208.235197"/>
  <use xlink:href="#glyph0-5" x="24.28636" y="208.235197"/>
  <use xlink:href="#glyph0-44" x="29.286671" y="208.235197"/>
  <use xlink:href="#glyph0-7" x="33.661942" y="208.235197"/>
  <use xlink:href="#glyph0-10" x="39.287292" y="208.235197"/>
  <use xlink:href="#glyph0-5" x="43.037525" y="208.235197"/>
  <use xlink:href="#glyph0-11" x="48.037836" y="208.235197"/>
  <use xlink:href="#glyph0-7" x="53.663185" y="208.235197"/>
  <use xlink:href="#glyph0-6" x="59.288535" y="208.235197"/>
  <use xlink:href="#glyph0-12" x="63.663806" y="208.235197"/>
  <use xlink:href="#glyph0-10" x="66.789" y="208.235197"/>
  <use xlink:href="#glyph0-5" x="70.539233" y="208.235197"/>
  <use xlink:href="#glyph0-11" x="75.539544" y="208.235197"/>
  <use xlink:href="#glyph0-7" x="81.164894" y="208.235197"/>
  <use xlink:href="#glyph0-26" x="86.790243" y="208.235197"/>
  <use xlink:href="#glyph0-18" x="93.040631" y="208.235197"/>
  <use xlink:href="#glyph0-23" x="98.665981" y="208.235197"/>
  <use xlink:href="#glyph0-7" x="104.29133" y="208.235197"/>
  <use xlink:href="#glyph0-27" x="109.91668" y="208.235197"/>
  <use xlink:href="#glyph0-1" x="112.416835" y="208.235197"/>
  <use xlink:href="#glyph0-9" x="118.667223" y="208.235197"/>
  <use xlink:href="#glyph0-9" x="122.417456" y="208.235197"/>
  <use xlink:href="#glyph0-3" x="126.167689" y="208.235197"/>
  <use xlink:href="#glyph0-5" x="131.793039" y="208.235197"/>
  <use xlink:href="#glyph0-51" x="136.79335" y="208.235197"/>
  <use xlink:href="#glyph0-4" x="142.418699" y="208.235197"/>
  <use xlink:href="#glyph0-7" x="144.918854" y="208.235197"/>
  <use xlink:href="#glyph0-24" x="150.544204" y="208.235197"/>
  <use xlink:href="#glyph0-7" x="159.294747" y="208.235197"/>
  <use xlink:href="#glyph0-2" x="164.920097" y="208.235197"/>
  <use xlink:href="#glyph0-16" x="170.545446" y="208.235197"/>
  <use xlink:href="#glyph0-16" x="173.670641" y="208.235197"/>
  <use xlink:href="#glyph0-5" x="176.795835" y="208.235197"/>
  <use xlink:href="#glyph0-11" x="181.796145" y="208.235197"/>
  <use xlink:href="#glyph0-7" x="187.421495" y="208.235197"/>
  <use xlink:href="#glyph0-27" x="193.046844" y="208.235197"/>
  <use xlink:href="#glyph0-33" x="195.547" y="208.235197"/>
  <use xlink:href="#glyph0-17" x="201.797388" y="208.235197"/>
  <use xlink:href="#glyph0-2" x="204.297543" y="208.235197"/>
  <use xlink:href="#glyph0-34" x="209.922893" y="208.235197"/>
  <use xlink:href="#glyph0-11" x="216.79832" y="208.235197"/>
  <use xlink:href="#glyph0-32" x="222.423669" y="208.235197"/>
  <use xlink:href="#glyph0-9" x="227.42398" y="208.235197"/>
  <use xlink:href="#glyph0-18" x="230.549174" y="208.235197"/>
  <use xlink:href="#glyph0-11" x="236.174524" y="208.235197"/>
  <use xlink:href="#glyph0-27" x="241.799873" y="208.235197"/>
  <use xlink:href="#glyph0-28" x="244.300028" y="208.235197"/>
  <use xlink:href="#glyph0-18" x="249.925378" y="208.235197"/>
  <use xlink:href="#glyph0-14" x="255.550727" y="208.235197"/>
  <use xlink:href="#glyph0-9" x="261.176077" y="208.235197"/>
  <use xlink:href="#glyph0-15" x="264.301271" y="208.235197"/>
  <use xlink:href="#glyph0-7" x="269.301582" y="208.235197"/>
  <use xlink:href="#glyph0-29" x="274.926931" y="208.235197"/>
  <use xlink:href="#glyph0-3" x="282.427397" y="208.235197"/>
  <use xlink:href="#glyph0-2" x="288.052747" y="208.235197"/>
  <use xlink:href="#glyph0-3" x="293.678096" y="208.235197"/>
  <use xlink:href="#glyph0-30" x="299.303446" y="208.235197"/>
  <use xlink:href="#glyph0-7" x="304.928795" y="208.235197"/>
  <use xlink:href="#glyph0-9" x="310.554144" y="208.235197"/>
  <use xlink:href="#glyph0-19" x="314.304377" y="208.235197"/>
  <use xlink:href="#glyph0-45" x="317.429572" y="208.235197"/>
</g>
<path style="fill:none;stroke-width:1;stroke-linecap:butt;stroke-linejoin:miter;stroke:rgb(0%,0%,0%);stroke-opacity:1;stroke-miterlimit:4;" d="M 349.998858 -155.002469 C 349.998858 -114.279813 272.128696 -154.921336 258.142065 -128.82139 " transform="matrix(0.625039,0,0,0.625899,2.721498,258.496403)"/>
<path style="fill-rule:nonzero;fill:rgb(0%,0%,0%);fill-opacity:1;stroke-width:1;stroke-linecap:butt;stroke-linejoin:miter;stroke:rgb(0%,0%,0%);stroke-opacity:1;stroke-miterlimit:4;" d="M 261.548103 -128.028781 L 255.998448 -118.998024 L 254.711028 -129.520384 Z M 261.548103 -128.028781 " transform="matrix(0.625039,0,0,0.625899,2.721498,258.496403)"/>
</g>
</svg>
