<?xml version="1.0" encoding="UTF-8"?>
<svg xmlns="http://www.w3.org/2000/svg" xmlns:xlink="http://www.w3.org/1999/xlink" width="1077px" height="50px" viewBox="0 0 1077 50" version="1.1">
<defs>
<g>
<symbol overflow="visible" id="glyph0-0">
<path style="stroke:none;" d="M 0.75 0 L 0.75 -11.25 L 6.75 -11.25 L 6.75 0 Z M 6 -0.75 L 6 -10.5 L 1.5 -10.5 L 1.5 -0.75 Z M 6 -0.75 "/>
</symbol>
<symbol overflow="visible" id="glyph0-1">
<path style="stroke:none;" d="M 7.828125 -10.390625 L 9.28125 -10.390625 L 9.28125 0 L 7.828125 0 L 7.828125 -4.796875 L 2.75 -4.796875 L 2.75 0 L 1.296875 0 L 1.296875 -10.390625 L 2.75 -10.390625 L 2.75 -6.0625 L 7.828125 -6.0625 Z M 7.828125 -10.390625 "/>
</symbol>
<symbol overflow="visible" id="glyph0-2">
<path style="stroke:none;" d="M 8.234375 -10.390625 L 8.234375 -9.140625 L 4.96875 -9.140625 L 4.96875 0 L 3.515625 0 L 3.515625 -9.140625 L 0.234375 -9.140625 L 0.234375 -10.390625 Z M 8.234375 -10.390625 "/>
</symbol>
<symbol overflow="visible" id="glyph0-3">
<path style="stroke:none;" d="M 5.953125 -1.4375 C 5.859375 -1.675781 5.726562 -1.976562 5.5625 -2.34375 C 5.394531 -2.71875 5.210938 -3.117188 5.015625 -3.546875 C 4.828125 -3.984375 4.625 -4.425781 4.40625 -4.875 C 4.195312 -5.332031 4 -5.765625 3.8125 -6.171875 C 3.625 -6.578125 3.445312 -6.9375 3.28125 -7.25 C 3.113281 -7.570312 2.976562 -7.820312 2.875 -8 C 2.769531 -6.8125 2.679688 -5.53125 2.609375 -4.15625 C 2.535156 -2.78125 2.476562 -1.394531 2.4375 0 L 1 0 C 1.039062 -0.894531 1.085938 -1.800781 1.140625 -2.71875 C 1.191406 -3.632812 1.25 -4.535156 1.3125 -5.421875 C 1.375 -6.304688 1.441406 -7.164062 1.515625 -8 C 1.597656 -8.84375 1.679688 -9.640625 1.765625 -10.390625 L 3.046875 -10.390625 C 3.316406 -9.953125 3.601562 -9.429688 3.90625 -8.828125 C 4.21875 -8.234375 4.53125 -7.609375 4.84375 -6.953125 C 5.15625 -6.296875 5.457031 -5.640625 5.75 -4.984375 C 6.039062 -4.328125 6.304688 -3.726562 6.546875 -3.1875 C 6.785156 -3.726562 7.046875 -4.328125 7.328125 -4.984375 C 7.617188 -5.640625 7.921875 -6.296875 8.234375 -6.953125 C 8.546875 -7.609375 8.851562 -8.234375 9.15625 -8.828125 C 9.46875 -9.429688 9.757812 -9.953125 10.03125 -10.390625 L 11.3125 -10.390625 C 11.644531 -7.046875 11.898438 -3.582031 12.078125 0 L 10.65625 0 C 10.601562 -1.394531 10.539062 -2.78125 10.46875 -4.15625 C 10.394531 -5.53125 10.304688 -6.8125 10.203125 -8 C 10.097656 -7.820312 9.960938 -7.570312 9.796875 -7.25 C 9.640625 -6.9375 9.460938 -6.578125 9.265625 -6.171875 C 9.078125 -5.765625 8.875 -5.332031 8.65625 -4.875 C 8.445312 -4.425781 8.242188 -3.984375 8.046875 -3.546875 C 7.859375 -3.117188 7.679688 -2.71875 7.515625 -2.34375 C 7.359375 -1.976562 7.226562 -1.675781 7.125 -1.4375 Z M 5.953125 -1.4375 "/>
</symbol>
<symbol overflow="visible" id="glyph0-4">
<path style="stroke:none;" d="M 7.546875 -1.265625 L 7.546875 0 L 1.296875 0 L 1.296875 -10.390625 L 2.75 -10.390625 L 2.75 -1.265625 Z M 7.546875 -1.265625 "/>
</symbol>
<symbol overflow="visible" id="glyph0-5">
<path style="stroke:none;" d=""/>
</symbol>
<symbol overflow="visible" id="glyph0-6">
<path style="stroke:none;" d="M 0.796875 -5.078125 L 3.625 -5.078125 L 3.625 -8.171875 L 4.828125 -8.171875 L 4.828125 -5.078125 L 7.671875 -5.078125 L 7.671875 -3.90625 L 4.828125 -3.90625 L 4.828125 -0.796875 L 3.625 -0.796875 L 3.625 -3.90625 L 0.796875 -3.90625 Z M 0.796875 -5.078125 "/>
</symbol>
<symbol overflow="visible" id="glyph0-7">
<path style="stroke:none;" d="M 6.28125 -3.34375 C 6.28125 -2.84375 6.226562 -2.378906 6.125 -1.953125 C 6.019531 -1.523438 5.832031 -1.144531 5.5625 -0.8125 C 5.300781 -0.488281 4.945312 -0.234375 4.5 -0.046875 C 4.0625 0.128906 3.503906 0.21875 2.828125 0.21875 C 2.492188 0.21875 2.179688 0.191406 1.890625 0.140625 C 1.609375 0.0859375 1.351562 0.0195312 1.125 -0.0625 C 0.894531 -0.144531 0.691406 -0.234375 0.515625 -0.328125 C 0.347656 -0.429688 0.21875 -0.523438 0.125 -0.609375 L 0.6875 -1.765625 C 0.894531 -1.617188 1.164062 -1.460938 1.5 -1.296875 C 1.84375 -1.128906 2.265625 -1.046875 2.765625 -1.046875 C 3.484375 -1.046875 4.003906 -1.226562 4.328125 -1.59375 C 4.660156 -1.957031 4.828125 -2.585938 4.828125 -3.484375 L 4.828125 -10.390625 L 6.28125 -10.390625 Z M 6.28125 -3.34375 "/>
</symbol>
<symbol overflow="visible" id="glyph0-8">
<path style="stroke:none;" d="M 3.703125 -1.03125 C 5.222656 -1.03125 5.984375 -1.550781 5.984375 -2.59375 C 5.984375 -2.914062 5.914062 -3.1875 5.78125 -3.40625 C 5.644531 -3.632812 5.460938 -3.832031 5.234375 -4 C 5.003906 -4.164062 4.738281 -4.304688 4.4375 -4.421875 C 4.144531 -4.546875 3.835938 -4.664062 3.515625 -4.78125 C 3.128906 -4.914062 2.765625 -5.0625 2.421875 -5.21875 C 2.085938 -5.382812 1.796875 -5.582031 1.546875 -5.8125 C 1.296875 -6.039062 1.097656 -6.304688 0.953125 -6.609375 C 0.804688 -6.921875 0.734375 -7.296875 0.734375 -7.734375 C 0.734375 -8.648438 1.039062 -9.363281 1.65625 -9.875 C 2.28125 -10.382812 3.140625 -10.640625 4.234375 -10.640625 C 4.859375 -10.640625 5.425781 -10.570312 5.9375 -10.4375 C 6.457031 -10.300781 6.835938 -10.148438 7.078125 -9.984375 L 6.609375 -8.8125 C 6.398438 -8.9375 6.085938 -9.0625 5.671875 -9.1875 C 5.265625 -9.3125 4.785156 -9.375 4.234375 -9.375 C 3.953125 -9.375 3.691406 -9.34375 3.453125 -9.28125 C 3.210938 -9.21875 3 -9.125 2.8125 -9 C 2.632812 -8.882812 2.492188 -8.734375 2.390625 -8.546875 C 2.285156 -8.367188 2.234375 -8.15625 2.234375 -7.90625 C 2.234375 -7.625 2.285156 -7.390625 2.390625 -7.203125 C 2.503906 -7.015625 2.660156 -6.847656 2.859375 -6.703125 C 3.066406 -6.554688 3.300781 -6.421875 3.5625 -6.296875 C 3.820312 -6.179688 4.113281 -6.0625 4.4375 -5.9375 C 4.882812 -5.757812 5.296875 -5.578125 5.671875 -5.390625 C 6.046875 -5.210938 6.367188 -5 6.640625 -4.75 C 6.921875 -4.5 7.132812 -4.203125 7.28125 -3.859375 C 7.4375 -3.515625 7.515625 -3.097656 7.515625 -2.609375 C 7.515625 -1.703125 7.179688 -1.003906 6.515625 -0.515625 C 5.847656 -0.0234375 4.910156 0.21875 3.703125 0.21875 C 3.296875 0.21875 2.921875 0.191406 2.578125 0.140625 C 2.234375 0.0859375 1.925781 0.0234375 1.65625 -0.046875 C 1.382812 -0.128906 1.148438 -0.210938 0.953125 -0.296875 C 0.753906 -0.378906 0.601562 -0.453125 0.5 -0.515625 L 0.9375 -1.703125 C 1.164062 -1.578125 1.515625 -1.429688 1.984375 -1.265625 C 2.453125 -1.109375 3.023438 -1.03125 3.703125 -1.03125 Z M 3.703125 -1.03125 "/>
</symbol>
<symbol overflow="visible" id="glyph0-9">
<path style="stroke:none;" d="M 2.5625 -4.484375 C 2.5625 -3.203125 2.742188 -2.015625 3.109375 -0.921875 C 3.484375 0.160156 4.03125 1.164062 4.75 2.09375 L 3.765625 2.78125 C 2.984375 1.820312 2.351562 0.726562 1.875 -0.5 C 1.40625 -1.738281 1.171875 -3.066406 1.171875 -4.484375 C 1.171875 -5.898438 1.40625 -7.222656 1.875 -8.453125 C 2.351562 -9.691406 2.984375 -10.789062 3.765625 -11.75 L 4.75 -11.0625 C 4.03125 -10.132812 3.484375 -9.125 3.109375 -8.03125 C 2.742188 -6.945312 2.5625 -5.765625 2.5625 -4.484375 Z M 2.5625 -4.484375 "/>
</symbol>
<symbol overflow="visible" id="glyph0-10">
<path style="stroke:none;" d="M 7.40625 -0.21875 C 7.09375 -0.144531 6.671875 -0.0625 6.140625 0.03125 C 5.617188 0.125 5.007812 0.171875 4.3125 0.171875 C 3.71875 0.171875 3.210938 0.0820312 2.796875 -0.09375 C 2.390625 -0.269531 2.0625 -0.515625 1.8125 -0.828125 C 1.5625 -1.148438 1.378906 -1.53125 1.265625 -1.96875 C 1.160156 -2.40625 1.109375 -2.890625 1.109375 -3.421875 L 1.109375 -7.796875 L 2.5 -7.796875 L 2.5 -3.71875 C 2.5 -2.769531 2.648438 -2.085938 2.953125 -1.671875 C 3.253906 -1.265625 3.757812 -1.0625 4.46875 -1.0625 C 4.613281 -1.0625 4.765625 -1.066406 4.921875 -1.078125 C 5.085938 -1.085938 5.238281 -1.097656 5.375 -1.109375 C 5.519531 -1.128906 5.648438 -1.144531 5.765625 -1.15625 C 5.878906 -1.175781 5.960938 -1.195312 6.015625 -1.21875 L 6.015625 -7.796875 L 7.40625 -7.796875 Z M 7.40625 -0.21875 "/>
</symbol>
<symbol overflow="visible" id="glyph0-11">
<path style="stroke:none;" d="M 3.015625 -1 C 3.585938 -1 4.007812 -1.070312 4.28125 -1.21875 C 4.550781 -1.375 4.6875 -1.617188 4.6875 -1.953125 C 4.6875 -2.285156 4.550781 -2.550781 4.28125 -2.75 C 4.019531 -2.957031 3.578125 -3.1875 2.953125 -3.4375 C 2.648438 -3.550781 2.363281 -3.671875 2.09375 -3.796875 C 1.820312 -3.921875 1.582031 -4.066406 1.375 -4.234375 C 1.175781 -4.410156 1.015625 -4.617188 0.890625 -4.859375 C 0.773438 -5.097656 0.71875 -5.394531 0.71875 -5.75 C 0.71875 -6.4375 0.972656 -6.984375 1.484375 -7.390625 C 1.992188 -7.796875 2.6875 -8 3.5625 -8 C 3.789062 -8 4.015625 -7.984375 4.234375 -7.953125 C 4.453125 -7.929688 4.65625 -7.898438 4.84375 -7.859375 C 5.03125 -7.828125 5.195312 -7.789062 5.34375 -7.75 C 5.488281 -7.707031 5.601562 -7.675781 5.6875 -7.65625 L 5.4375 -6.453125 C 5.28125 -6.523438 5.039062 -6.601562 4.71875 -6.6875 C 4.40625 -6.78125 4.019531 -6.828125 3.5625 -6.828125 C 3.175781 -6.828125 2.835938 -6.75 2.546875 -6.59375 C 2.253906 -6.4375 2.109375 -6.191406 2.109375 -5.859375 C 2.109375 -5.691406 2.140625 -5.539062 2.203125 -5.40625 C 2.273438 -5.28125 2.378906 -5.164062 2.515625 -5.0625 C 2.648438 -4.957031 2.816406 -4.859375 3.015625 -4.765625 C 3.210938 -4.679688 3.453125 -4.585938 3.734375 -4.484375 C 4.109375 -4.347656 4.4375 -4.210938 4.71875 -4.078125 C 5.007812 -3.941406 5.257812 -3.78125 5.46875 -3.59375 C 5.675781 -3.414062 5.832031 -3.195312 5.9375 -2.9375 C 6.050781 -2.6875 6.109375 -2.378906 6.109375 -2.015625 C 6.109375 -1.296875 5.835938 -0.75 5.296875 -0.375 C 4.765625 0 4.003906 0.1875 3.015625 0.1875 C 2.328125 0.1875 1.785156 0.125 1.390625 0 C 1.003906 -0.113281 0.738281 -0.195312 0.59375 -0.25 L 0.859375 -1.453125 C 1.015625 -1.390625 1.265625 -1.296875 1.609375 -1.171875 C 1.960938 -1.054688 2.429688 -1 3.015625 -1 Z M 3.015625 -1 "/>
</symbol>
<symbol overflow="visible" id="glyph0-12">
<path style="stroke:none;" d="M 0.765625 -3.890625 C 0.765625 -4.578125 0.863281 -5.175781 1.0625 -5.6875 C 1.257812 -6.207031 1.523438 -6.632812 1.859375 -6.96875 C 2.191406 -7.3125 2.570312 -7.566406 3 -7.734375 C 3.425781 -7.910156 3.863281 -8 4.3125 -8 C 5.363281 -8 6.171875 -7.671875 6.734375 -7.015625 C 7.296875 -6.359375 7.578125 -5.359375 7.578125 -4.015625 C 7.578125 -3.960938 7.578125 -3.882812 7.578125 -3.78125 C 7.578125 -3.6875 7.570312 -3.601562 7.5625 -3.53125 L 2.21875 -3.53125 C 2.28125 -2.71875 2.515625 -2.097656 2.921875 -1.671875 C 3.335938 -1.253906 3.976562 -1.046875 4.84375 -1.046875 C 5.332031 -1.046875 5.742188 -1.085938 6.078125 -1.171875 C 6.410156 -1.265625 6.664062 -1.347656 6.84375 -1.421875 L 7.03125 -0.25 C 6.863281 -0.164062 6.566406 -0.0703125 6.140625 0.03125 C 5.710938 0.132812 5.226562 0.1875 4.6875 0.1875 C 4.007812 0.1875 3.421875 0.0820312 2.921875 -0.125 C 2.429688 -0.332031 2.023438 -0.613281 1.703125 -0.96875 C 1.390625 -1.332031 1.15625 -1.757812 1 -2.25 C 0.84375 -2.75 0.765625 -3.296875 0.765625 -3.890625 Z M 6.125 -4.65625 C 6.132812 -5.28125 5.972656 -5.796875 5.640625 -6.203125 C 5.316406 -6.609375 4.875 -6.8125 4.3125 -6.8125 C 3.988281 -6.8125 3.703125 -6.75 3.453125 -6.625 C 3.210938 -6.5 3.003906 -6.332031 2.828125 -6.125 C 2.660156 -5.925781 2.53125 -5.695312 2.4375 -5.4375 C 2.34375 -5.1875 2.28125 -4.925781 2.25 -4.65625 Z M 6.125 -4.65625 "/>
</symbol>
<symbol overflow="visible" id="glyph0-13">
<path style="stroke:none;" d="M 4.078125 -7.96875 C 4.203125 -7.96875 4.335938 -7.957031 4.484375 -7.9375 C 4.640625 -7.925781 4.789062 -7.90625 4.9375 -7.875 C 5.09375 -7.851562 5.234375 -7.828125 5.359375 -7.796875 C 5.484375 -7.773438 5.578125 -7.753906 5.640625 -7.734375 L 5.40625 -6.53125 C 5.289062 -6.5625 5.101562 -6.601562 4.84375 -6.65625 C 4.59375 -6.71875 4.269531 -6.75 3.875 -6.75 C 3.613281 -6.75 3.351562 -6.71875 3.09375 -6.65625 C 2.84375 -6.601562 2.675781 -6.570312 2.59375 -6.5625 L 2.59375 0 L 1.203125 0 L 1.203125 -7.46875 C 1.523438 -7.59375 1.929688 -7.707031 2.421875 -7.8125 C 2.921875 -7.914062 3.472656 -7.96875 4.078125 -7.96875 Z M 4.078125 -7.96875 "/>
</symbol>
<symbol overflow="visible" id="glyph0-14">
<path style="stroke:none;" d="M 7.296875 -7.796875 C 6.898438 -6.335938 6.4375 -4.9375 5.90625 -3.59375 C 5.382812 -2.257812 4.878906 -1.0625 4.390625 0 L 3.140625 0 C 2.648438 -1.0625 2.140625 -2.257812 1.609375 -3.59375 C 1.085938 -4.9375 0.628906 -6.335938 0.234375 -7.796875 L 1.734375 -7.796875 C 1.859375 -7.304688 2.003906 -6.785156 2.171875 -6.234375 C 2.335938 -5.679688 2.507812 -5.128906 2.6875 -4.578125 C 2.875 -4.035156 3.0625 -3.507812 3.25 -3 C 3.445312 -2.488281 3.628906 -2.035156 3.796875 -1.640625 C 3.960938 -2.035156 4.140625 -2.488281 4.328125 -3 C 4.523438 -3.507812 4.710938 -4.035156 4.890625 -4.578125 C 5.078125 -5.128906 5.253906 -5.679688 5.421875 -6.234375 C 5.585938 -6.785156 5.726562 -7.304688 5.84375 -7.796875 Z M 7.296875 -7.796875 "/>
</symbol>
<symbol overflow="visible" id="glyph0-15">
<path style="stroke:none;" d="M 1.203125 -7.578125 C 1.523438 -7.648438 1.945312 -7.734375 2.46875 -7.828125 C 3 -7.921875 3.613281 -7.96875 4.3125 -7.96875 C 4.925781 -7.96875 5.4375 -7.878906 5.84375 -7.703125 C 6.257812 -7.523438 6.585938 -7.28125 6.828125 -6.96875 C 7.078125 -6.65625 7.25 -6.273438 7.34375 -5.828125 C 7.445312 -5.390625 7.5 -4.90625 7.5 -4.375 L 7.5 0 L 6.109375 0 L 6.109375 -4.078125 C 6.109375 -4.554688 6.070312 -4.960938 6 -5.296875 C 5.9375 -5.640625 5.828125 -5.914062 5.671875 -6.125 C 5.523438 -6.34375 5.328125 -6.5 5.078125 -6.59375 C 4.828125 -6.6875 4.519531 -6.734375 4.15625 -6.734375 C 4.007812 -6.734375 3.851562 -6.726562 3.6875 -6.71875 C 3.53125 -6.707031 3.378906 -6.691406 3.234375 -6.671875 C 3.085938 -6.660156 2.957031 -6.644531 2.84375 -6.625 C 2.726562 -6.601562 2.644531 -6.585938 2.59375 -6.578125 L 2.59375 0 L 1.203125 0 Z M 1.203125 -7.578125 "/>
</symbol>
<symbol overflow="visible" id="glyph0-16">
<path style="stroke:none;" d="M 2.5 -7.796875 L 5.453125 -7.796875 L 5.453125 -6.625 L 2.5 -6.625 L 2.5 -3.03125 C 2.5 -2.632812 2.53125 -2.3125 2.59375 -2.0625 C 2.65625 -1.8125 2.742188 -1.613281 2.859375 -1.46875 C 2.984375 -1.320312 3.132812 -1.21875 3.3125 -1.15625 C 3.488281 -1.09375 3.695312 -1.0625 3.9375 -1.0625 C 4.363281 -1.0625 4.703125 -1.109375 4.953125 -1.203125 C 5.210938 -1.296875 5.390625 -1.363281 5.484375 -1.40625 L 5.765625 -0.25 C 5.617188 -0.1875 5.367188 -0.101562 5.015625 0 C 4.671875 0.113281 4.273438 0.171875 3.828125 0.171875 C 3.296875 0.171875 2.859375 0.101562 2.515625 -0.03125 C 2.171875 -0.164062 1.890625 -0.367188 1.671875 -0.640625 C 1.460938 -0.910156 1.316406 -1.242188 1.234375 -1.640625 C 1.148438 -2.035156 1.109375 -2.492188 1.109375 -3.015625 L 1.109375 -9.96875 L 2.5 -10.21875 Z M 2.5 -7.796875 "/>
</symbol>
<symbol overflow="visible" id="glyph0-17">
<path style="stroke:none;" d="M 2.296875 -4.484375 C 2.296875 -5.765625 2.109375 -6.945312 1.734375 -8.03125 C 1.367188 -9.125 0.828125 -10.132812 0.109375 -11.0625 L 1.09375 -11.75 C 1.875 -10.789062 2.5 -9.691406 2.96875 -8.453125 C 3.445312 -7.222656 3.6875 -5.898438 3.6875 -4.484375 C 3.6875 -3.066406 3.445312 -1.738281 2.96875 -0.5 C 2.5 0.726562 1.875 1.820312 1.09375 2.78125 L 0.109375 2.09375 C 0.828125 1.164062 1.367188 0.160156 1.734375 -0.921875 C 2.109375 -2.015625 2.296875 -3.203125 2.296875 -4.484375 Z M 2.296875 -4.484375 "/>
</symbol>
<symbol overflow="visible" id="glyph0-18">
<path style="stroke:none;" d="M 6.609375 -3.890625 C 6.609375 -4.796875 6.382812 -5.492188 5.9375 -5.984375 C 5.488281 -6.472656 4.890625 -6.71875 4.140625 -6.71875 C 3.722656 -6.71875 3.394531 -6.703125 3.15625 -6.671875 C 2.925781 -6.640625 2.738281 -6.601562 2.59375 -6.5625 L 2.59375 -1.65625 C 2.757812 -1.507812 3.003906 -1.367188 3.328125 -1.234375 C 3.648438 -1.109375 4 -1.046875 4.375 -1.046875 C 4.78125 -1.046875 5.125 -1.117188 5.40625 -1.265625 C 5.6875 -1.410156 5.914062 -1.609375 6.09375 -1.859375 C 6.28125 -2.117188 6.410156 -2.421875 6.484375 -2.765625 C 6.566406 -3.109375 6.609375 -3.484375 6.609375 -3.890625 Z M 8.0625 -3.890625 C 8.0625 -3.296875 7.984375 -2.75 7.828125 -2.25 C 7.679688 -1.75 7.457031 -1.316406 7.15625 -0.953125 C 6.851562 -0.597656 6.484375 -0.316406 6.046875 -0.109375 C 5.617188 0.0859375 5.125 0.1875 4.5625 0.1875 C 4.113281 0.1875 3.710938 0.125 3.359375 0 C 3.015625 -0.125 2.757812 -0.238281 2.59375 -0.34375 L 2.59375 2.78125 L 1.203125 2.78125 L 1.203125 -7.5625 C 1.523438 -7.644531 1.9375 -7.734375 2.4375 -7.828125 C 2.9375 -7.921875 3.507812 -7.96875 4.15625 -7.96875 C 4.757812 -7.96875 5.300781 -7.867188 5.78125 -7.671875 C 6.257812 -7.484375 6.664062 -7.210938 7 -6.859375 C 7.34375 -6.515625 7.601562 -6.085938 7.78125 -5.578125 C 7.96875 -5.078125 8.0625 -4.515625 8.0625 -3.890625 Z M 8.0625 -3.890625 "/>
</symbol>
<symbol overflow="visible" id="glyph0-19">
<path style="stroke:none;" d="M 8.078125 -3.90625 C 8.078125 -3.28125 7.988281 -2.71875 7.8125 -2.21875 C 7.632812 -1.71875 7.378906 -1.285156 7.046875 -0.921875 C 6.722656 -0.566406 6.335938 -0.289062 5.890625 -0.09375 C 5.441406 0.09375 4.953125 0.1875 4.421875 0.1875 C 3.890625 0.1875 3.398438 0.09375 2.953125 -0.09375 C 2.503906 -0.289062 2.117188 -0.566406 1.796875 -0.921875 C 1.472656 -1.285156 1.21875 -1.71875 1.03125 -2.21875 C 0.851562 -2.71875 0.765625 -3.28125 0.765625 -3.90625 C 0.765625 -4.507812 0.851562 -5.0625 1.03125 -5.5625 C 1.21875 -6.070312 1.472656 -6.503906 1.796875 -6.859375 C 2.117188 -7.222656 2.503906 -7.503906 2.953125 -7.703125 C 3.398438 -7.898438 3.890625 -8 4.421875 -8 C 4.953125 -8 5.441406 -7.898438 5.890625 -7.703125 C 6.335938 -7.503906 6.722656 -7.222656 7.046875 -6.859375 C 7.378906 -6.503906 7.632812 -6.070312 7.8125 -5.5625 C 7.988281 -5.0625 8.078125 -4.507812 8.078125 -3.90625 Z M 6.625 -3.90625 C 6.625 -4.78125 6.425781 -5.472656 6.03125 -5.984375 C 5.632812 -6.503906 5.097656 -6.765625 4.421875 -6.765625 C 3.742188 -6.765625 3.207031 -6.503906 2.8125 -5.984375 C 2.414062 -5.472656 2.21875 -4.78125 2.21875 -3.90625 C 2.21875 -3.019531 2.414062 -2.316406 2.8125 -1.796875 C 3.207031 -1.285156 3.742188 -1.03125 4.421875 -1.03125 C 5.097656 -1.03125 5.632812 -1.285156 6.03125 -1.796875 C 6.425781 -2.316406 6.625 -3.019531 6.625 -3.90625 Z M 6.625 -3.90625 "/>
</symbol>
<symbol overflow="visible" id="glyph0-20">
<path style="stroke:none;" d="M 6.09375 -0.78125 C 5.96875 -0.695312 5.734375 -0.59375 5.390625 -0.46875 C 5.046875 -0.34375 4.644531 -0.28125 4.1875 -0.28125 C 3.71875 -0.28125 3.273438 -0.351562 2.859375 -0.5 C 2.441406 -0.65625 2.078125 -0.890625 1.765625 -1.203125 C 1.460938 -1.523438 1.21875 -1.921875 1.03125 -2.390625 C 0.851562 -2.859375 0.765625 -3.414062 0.765625 -4.0625 C 0.765625 -4.632812 0.847656 -5.15625 1.015625 -5.625 C 1.191406 -6.101562 1.441406 -6.515625 1.765625 -6.859375 C 2.085938 -7.203125 2.484375 -7.472656 2.953125 -7.671875 C 3.421875 -7.867188 3.953125 -7.96875 4.546875 -7.96875 C 5.191406 -7.96875 5.753906 -7.921875 6.234375 -7.828125 C 6.722656 -7.734375 7.132812 -7.644531 7.46875 -7.5625 L 7.46875 -0.59375 C 7.46875 0.601562 7.15625 1.46875 6.53125 2 C 5.914062 2.539062 4.976562 2.8125 3.71875 2.8125 C 3.226562 2.8125 2.765625 2.769531 2.328125 2.6875 C 1.898438 2.613281 1.523438 2.523438 1.203125 2.421875 L 1.453125 1.203125 C 1.734375 1.304688 2.078125 1.398438 2.484375 1.484375 C 2.890625 1.578125 3.3125 1.625 3.75 1.625 C 4.582031 1.625 5.179688 1.457031 5.546875 1.125 C 5.910156 0.789062 6.09375 0.265625 6.09375 -0.453125 Z M 6.078125 -6.5625 C 5.929688 -6.601562 5.738281 -6.640625 5.5 -6.671875 C 5.269531 -6.710938 4.957031 -6.734375 4.5625 -6.734375 C 3.8125 -6.734375 3.234375 -6.488281 2.828125 -6 C 2.421875 -5.507812 2.21875 -4.859375 2.21875 -4.046875 C 2.21875 -3.597656 2.273438 -3.210938 2.390625 -2.890625 C 2.503906 -2.578125 2.660156 -2.3125 2.859375 -2.09375 C 3.054688 -1.882812 3.28125 -1.726562 3.53125 -1.625 C 3.789062 -1.53125 4.050781 -1.484375 4.3125 -1.484375 C 4.6875 -1.484375 5.03125 -1.535156 5.34375 -1.640625 C 5.65625 -1.742188 5.898438 -1.867188 6.078125 -2.015625 Z M 6.078125 -6.5625 "/>
</symbol>
<symbol overflow="visible" id="glyph0-21">
<path style="stroke:none;" d="M 9.828125 -5.203125 C 9.828125 -4.304688 9.6875 -3.523438 9.40625 -2.859375 C 9.125 -2.191406 8.726562 -1.640625 8.21875 -1.203125 C 7.707031 -0.773438 7.097656 -0.453125 6.390625 -0.234375 C 5.679688 -0.015625 4.898438 0.09375 4.046875 0.09375 C 3.628906 0.09375 3.164062 0.0703125 2.65625 0.03125 C 2.15625 0 1.703125 -0.0664062 1.296875 -0.171875 L 1.296875 -10.25 C 1.703125 -10.34375 2.15625 -10.40625 2.65625 -10.4375 C 3.164062 -10.476562 3.628906 -10.5 4.046875 -10.5 C 4.898438 -10.5 5.679688 -10.390625 6.390625 -10.171875 C 7.097656 -9.960938 7.707031 -9.640625 8.21875 -9.203125 C 8.726562 -8.765625 9.125 -8.210938 9.40625 -7.546875 C 9.6875 -6.890625 9.828125 -6.109375 9.828125 -5.203125 Z M 4.171875 -1.1875 C 5.546875 -1.1875 6.570312 -1.535156 7.25 -2.234375 C 7.9375 -2.941406 8.28125 -3.929688 8.28125 -5.203125 C 8.28125 -6.472656 7.9375 -7.457031 7.25 -8.15625 C 6.570312 -8.863281 5.546875 -9.21875 4.171875 -9.21875 C 3.765625 -9.21875 3.445312 -9.210938 3.21875 -9.203125 C 2.988281 -9.191406 2.832031 -9.1875 2.75 -9.1875 L 2.75 -1.234375 C 2.832031 -1.222656 2.988281 -1.210938 3.21875 -1.203125 C 3.445312 -1.191406 3.765625 -1.1875 4.171875 -1.1875 Z M 4.171875 -1.1875 "/>
</symbol>
<symbol overflow="visible" id="glyph0-22">
<path style="stroke:none;" d="M 4.09375 0.09375 C 3.882812 0.09375 3.65625 0.0859375 3.40625 0.078125 C 3.164062 0.0664062 2.921875 0.0507812 2.671875 0.03125 C 2.429688 0.0078125 2.191406 -0.015625 1.953125 -0.046875 C 1.710938 -0.078125 1.492188 -0.117188 1.296875 -0.171875 L 1.296875 -10.25 C 1.492188 -10.289062 1.710938 -10.328125 1.953125 -10.359375 C 2.191406 -10.390625 2.429688 -10.414062 2.671875 -10.4375 C 2.921875 -10.457031 3.164062 -10.472656 3.40625 -10.484375 C 3.644531 -10.492188 3.867188 -10.5 4.078125 -10.5 C 4.679688 -10.5 5.242188 -10.453125 5.765625 -10.359375 C 6.296875 -10.273438 6.75 -10.125 7.125 -9.90625 C 7.507812 -9.6875 7.8125 -9.398438 8.03125 -9.046875 C 8.257812 -8.703125 8.375 -8.273438 8.375 -7.765625 C 8.375 -7.203125 8.238281 -6.734375 7.96875 -6.359375 C 7.695312 -5.992188 7.335938 -5.722656 6.890625 -5.546875 C 7.492188 -5.367188 7.972656 -5.082031 8.328125 -4.6875 C 8.691406 -4.300781 8.875 -3.753906 8.875 -3.046875 C 8.875 -2.003906 8.488281 -1.21875 7.71875 -0.6875 C 6.957031 -0.164062 5.75 0.09375 4.09375 0.09375 Z M 2.734375 -4.84375 L 2.734375 -1.1875 C 2.835938 -1.175781 2.96875 -1.164062 3.125 -1.15625 C 3.25 -1.144531 3.398438 -1.132812 3.578125 -1.125 C 3.753906 -1.125 3.957031 -1.125 4.1875 -1.125 C 4.613281 -1.125 5.019531 -1.148438 5.40625 -1.203125 C 5.789062 -1.265625 6.128906 -1.363281 6.421875 -1.5 C 6.710938 -1.632812 6.941406 -1.828125 7.109375 -2.078125 C 7.285156 -2.328125 7.375 -2.644531 7.375 -3.03125 C 7.375 -3.375 7.304688 -3.660156 7.171875 -3.890625 C 7.046875 -4.128906 6.859375 -4.316406 6.609375 -4.453125 C 6.367188 -4.597656 6.078125 -4.695312 5.734375 -4.75 C 5.398438 -4.8125 5.023438 -4.84375 4.609375 -4.84375 Z M 2.734375 -6.015625 L 4.265625 -6.015625 C 4.617188 -6.015625 4.957031 -6.039062 5.28125 -6.09375 C 5.601562 -6.144531 5.878906 -6.234375 6.109375 -6.359375 C 6.347656 -6.492188 6.535156 -6.664062 6.671875 -6.875 C 6.804688 -7.082031 6.875 -7.347656 6.875 -7.671875 C 6.875 -7.960938 6.800781 -8.210938 6.65625 -8.421875 C 6.519531 -8.628906 6.328125 -8.796875 6.078125 -8.921875 C 5.835938 -9.046875 5.550781 -9.132812 5.21875 -9.1875 C 4.882812 -9.25 4.535156 -9.28125 4.171875 -9.28125 C 3.796875 -9.28125 3.503906 -9.273438 3.296875 -9.265625 C 3.085938 -9.253906 2.898438 -9.238281 2.734375 -9.21875 Z M 2.734375 -6.015625 "/>
</symbol>
<symbol overflow="visible" id="glyph0-23">
<path style="stroke:none;" d="M 3.84375 -1 C 4.164062 -1 4.453125 -1.003906 4.703125 -1.015625 C 4.960938 -1.035156 5.179688 -1.066406 5.359375 -1.109375 L 5.359375 -3.4375 C 5.253906 -3.488281 5.085938 -3.53125 4.859375 -3.5625 C 4.640625 -3.59375 4.367188 -3.609375 4.046875 -3.609375 C 3.835938 -3.609375 3.613281 -3.59375 3.375 -3.5625 C 3.144531 -3.539062 2.929688 -3.476562 2.734375 -3.375 C 2.535156 -3.28125 2.375 -3.148438 2.25 -2.984375 C 2.125 -2.828125 2.0625 -2.613281 2.0625 -2.34375 C 2.0625 -1.84375 2.21875 -1.492188 2.53125 -1.296875 C 2.851562 -1.097656 3.289062 -1 3.84375 -1 Z M 3.71875 -8 C 4.28125 -8 4.753906 -7.925781 5.140625 -7.78125 C 5.523438 -7.632812 5.832031 -7.425781 6.0625 -7.15625 C 6.300781 -6.894531 6.46875 -6.582031 6.5625 -6.21875 C 6.664062 -5.851562 6.71875 -5.453125 6.71875 -5.015625 L 6.71875 -0.140625 C 6.601562 -0.117188 6.4375 -0.0859375 6.21875 -0.046875 C 6 -0.015625 5.753906 0.015625 5.484375 0.046875 C 5.210938 0.078125 4.921875 0.101562 4.609375 0.125 C 4.296875 0.15625 3.984375 0.171875 3.671875 0.171875 C 3.234375 0.171875 2.828125 0.125 2.453125 0.03125 C 2.085938 -0.0625 1.769531 -0.203125 1.5 -0.390625 C 1.226562 -0.585938 1.015625 -0.847656 0.859375 -1.171875 C 0.710938 -1.492188 0.640625 -1.878906 0.640625 -2.328125 C 0.640625 -2.753906 0.726562 -3.125 0.90625 -3.4375 C 1.082031 -3.75 1.316406 -4 1.609375 -4.1875 C 1.910156 -4.375 2.257812 -4.507812 2.65625 -4.59375 C 3.0625 -4.6875 3.488281 -4.734375 3.9375 -4.734375 C 4.070312 -4.734375 4.210938 -4.722656 4.359375 -4.703125 C 4.515625 -4.691406 4.660156 -4.675781 4.796875 -4.65625 C 4.929688 -4.632812 5.046875 -4.613281 5.140625 -4.59375 C 5.242188 -4.570312 5.316406 -4.554688 5.359375 -4.546875 L 5.359375 -4.9375 C 5.359375 -5.164062 5.332031 -5.390625 5.28125 -5.609375 C 5.226562 -5.835938 5.132812 -6.039062 5 -6.21875 C 4.875 -6.394531 4.695312 -6.535156 4.46875 -6.640625 C 4.25 -6.742188 3.957031 -6.796875 3.59375 -6.796875 C 3.132812 -6.796875 2.734375 -6.757812 2.390625 -6.6875 C 2.046875 -6.625 1.789062 -6.5625 1.625 -6.5 L 1.453125 -7.65625 C 1.628906 -7.726562 1.925781 -7.800781 2.34375 -7.875 C 2.769531 -7.957031 3.226562 -8 3.71875 -8 Z M 3.71875 -8 "/>
</symbol>
<symbol overflow="visible" id="glyph0-24">
<path style="stroke:none;" d="M 4.015625 -4.296875 C 4.316406 -4.054688 4.632812 -3.765625 4.96875 -3.421875 C 5.300781 -3.085938 5.628906 -2.722656 5.953125 -2.328125 C 6.285156 -1.929688 6.59375 -1.53125 6.875 -1.125 C 7.164062 -0.726562 7.414062 -0.351562 7.625 0 L 5.984375 0 C 5.773438 -0.351562 5.53125 -0.710938 5.25 -1.078125 C 4.976562 -1.441406 4.691406 -1.789062 4.390625 -2.125 C 4.085938 -2.457031 3.78125 -2.765625 3.46875 -3.046875 C 3.164062 -3.328125 2.875 -3.5625 2.59375 -3.75 L 2.59375 0 L 1.203125 0 L 1.203125 -11.40625 L 2.59375 -11.640625 L 2.59375 -4.53125 C 2.832031 -4.769531 3.097656 -5.035156 3.390625 -5.328125 C 3.679688 -5.617188 3.96875 -5.910156 4.25 -6.203125 C 4.53125 -6.503906 4.796875 -6.789062 5.046875 -7.0625 C 5.296875 -7.34375 5.507812 -7.585938 5.6875 -7.796875 L 7.3125 -7.796875 C 7.082031 -7.546875 6.832031 -7.269531 6.5625 -6.96875 C 6.300781 -6.675781 6.023438 -6.375 5.734375 -6.0625 C 5.441406 -5.757812 5.144531 -5.453125 4.84375 -5.140625 C 4.550781 -4.835938 4.273438 -4.554688 4.015625 -4.296875 Z M 4.015625 -4.296875 "/>
</symbol>
<symbol overflow="visible" id="glyph0-25">
<path style="stroke:none;" d="M 4.59375 0.1875 C 3.957031 0.1875 3.398438 0.0859375 2.921875 -0.109375 C 2.453125 -0.316406 2.054688 -0.597656 1.734375 -0.953125 C 1.410156 -1.316406 1.164062 -1.742188 1 -2.234375 C 0.84375 -2.734375 0.765625 -3.285156 0.765625 -3.890625 C 0.765625 -4.484375 0.851562 -5.03125 1.03125 -5.53125 C 1.207031 -6.03125 1.453125 -6.460938 1.765625 -6.828125 C 2.085938 -7.191406 2.476562 -7.476562 2.9375 -7.6875 C 3.40625 -7.894531 3.925781 -8 4.5 -8 C 4.851562 -8 5.203125 -7.96875 5.546875 -7.90625 C 5.898438 -7.84375 6.238281 -7.75 6.5625 -7.625 L 6.234375 -6.4375 C 6.023438 -6.53125 5.78125 -6.609375 5.5 -6.671875 C 5.226562 -6.734375 4.941406 -6.765625 4.640625 -6.765625 C 3.859375 -6.765625 3.257812 -6.519531 2.84375 -6.03125 C 2.425781 -5.539062 2.21875 -4.828125 2.21875 -3.890625 C 2.21875 -3.460938 2.265625 -3.070312 2.359375 -2.71875 C 2.453125 -2.375 2.601562 -2.078125 2.8125 -1.828125 C 3.019531 -1.578125 3.28125 -1.382812 3.59375 -1.25 C 3.914062 -1.113281 4.304688 -1.046875 4.765625 -1.046875 C 5.140625 -1.046875 5.472656 -1.082031 5.765625 -1.15625 C 6.066406 -1.226562 6.304688 -1.300781 6.484375 -1.375 L 6.671875 -0.203125 C 6.597656 -0.160156 6.484375 -0.113281 6.328125 -0.0625 C 6.179688 -0.0195312 6.007812 0.015625 5.8125 0.046875 C 5.625 0.0859375 5.421875 0.117188 5.203125 0.140625 C 4.992188 0.171875 4.789062 0.1875 4.59375 0.1875 Z M 4.59375 0.1875 "/>
</symbol>
<symbol overflow="visible" id="glyph0-26">
<path style="stroke:none;" d="M 1.203125 0 L 1.203125 -11.40625 L 2.59375 -11.640625 L 2.59375 -7.65625 C 2.851562 -7.75 3.128906 -7.820312 3.421875 -7.875 C 3.722656 -7.9375 4.019531 -7.96875 4.3125 -7.96875 C 4.925781 -7.96875 5.4375 -7.878906 5.84375 -7.703125 C 6.257812 -7.523438 6.585938 -7.28125 6.828125 -6.96875 C 7.078125 -6.65625 7.25 -6.273438 7.34375 -5.828125 C 7.445312 -5.390625 7.5 -4.90625 7.5 -4.375 L 7.5 0 L 6.109375 0 L 6.109375 -4.078125 C 6.109375 -4.554688 6.070312 -4.960938 6 -5.296875 C 5.9375 -5.640625 5.828125 -5.914062 5.671875 -6.125 C 5.523438 -6.34375 5.328125 -6.5 5.078125 -6.59375 C 4.828125 -6.6875 4.519531 -6.734375 4.15625 -6.734375 C 4.007812 -6.734375 3.851562 -6.722656 3.6875 -6.703125 C 3.53125 -6.679688 3.378906 -6.65625 3.234375 -6.625 C 3.085938 -6.601562 2.957031 -6.578125 2.84375 -6.546875 C 2.726562 -6.523438 2.644531 -6.503906 2.59375 -6.484375 L 2.59375 0 Z M 1.203125 0 "/>
</symbol>
<symbol overflow="visible" id="glyph0-27">
<path style="stroke:none;" d="M 6.234375 -6.15625 C 6.066406 -6.289062 5.820312 -6.421875 5.5 -6.546875 C 5.1875 -6.679688 4.835938 -6.75 4.453125 -6.75 C 4.054688 -6.75 3.710938 -6.675781 3.421875 -6.53125 C 3.140625 -6.382812 2.90625 -6.179688 2.71875 -5.921875 C 2.539062 -5.671875 2.410156 -5.367188 2.328125 -5.015625 C 2.253906 -4.671875 2.21875 -4.300781 2.21875 -3.90625 C 2.21875 -2.988281 2.441406 -2.28125 2.890625 -1.78125 C 3.335938 -1.289062 3.9375 -1.046875 4.6875 -1.046875 C 5.070312 -1.046875 5.390625 -1.0625 5.640625 -1.09375 C 5.898438 -1.132812 6.097656 -1.175781 6.234375 -1.21875 Z M 6.234375 -11.40625 L 7.640625 -11.640625 L 7.640625 -0.21875 C 7.316406 -0.132812 6.90625 -0.046875 6.40625 0.046875 C 5.90625 0.140625 5.332031 0.1875 4.6875 0.1875 C 4.082031 0.1875 3.539062 0.09375 3.0625 -0.09375 C 2.582031 -0.289062 2.171875 -0.5625 1.828125 -0.90625 C 1.484375 -1.257812 1.21875 -1.6875 1.03125 -2.1875 C 0.851562 -2.695312 0.765625 -3.269531 0.765625 -3.90625 C 0.765625 -4.5 0.84375 -5.046875 1 -5.546875 C 1.15625 -6.046875 1.378906 -6.472656 1.671875 -6.828125 C 1.972656 -7.191406 2.34375 -7.472656 2.78125 -7.671875 C 3.21875 -7.878906 3.71875 -7.984375 4.28125 -7.984375 C 4.726562 -7.984375 5.125 -7.921875 5.46875 -7.796875 C 5.8125 -7.679688 6.066406 -7.566406 6.234375 -7.453125 Z M 6.234375 -11.40625 "/>
</symbol>
<symbol overflow="visible" id="glyph0-28">
<path style="stroke:none;" d="M 3.546875 0.15625 C 2.679688 0.132812 2.066406 -0.0507812 1.703125 -0.40625 C 1.347656 -0.757812 1.171875 -1.304688 1.171875 -2.046875 L 1.171875 -11.40625 L 2.5625 -11.640625 L 2.5625 -2.265625 C 2.5625 -2.035156 2.582031 -1.84375 2.625 -1.6875 C 2.664062 -1.539062 2.726562 -1.421875 2.8125 -1.328125 C 2.90625 -1.242188 3.023438 -1.175781 3.171875 -1.125 C 3.328125 -1.082031 3.515625 -1.046875 3.734375 -1.015625 Z M 3.546875 0.15625 "/>
</symbol>
<symbol overflow="visible" id="glyph0-29">
<path style="stroke:none;" d="M 1.203125 -7.578125 C 1.523438 -7.648438 1.945312 -7.734375 2.46875 -7.828125 C 2.988281 -7.921875 3.597656 -7.96875 4.296875 -7.96875 C 4.796875 -7.96875 5.210938 -7.898438 5.546875 -7.765625 C 5.890625 -7.628906 6.175781 -7.429688 6.40625 -7.171875 C 6.476562 -7.222656 6.585938 -7.289062 6.734375 -7.375 C 6.878906 -7.46875 7.0625 -7.554688 7.28125 -7.640625 C 7.507812 -7.722656 7.757812 -7.796875 8.03125 -7.859375 C 8.300781 -7.929688 8.585938 -7.96875 8.890625 -7.96875 C 9.492188 -7.96875 9.984375 -7.878906 10.359375 -7.703125 C 10.742188 -7.523438 11.039062 -7.273438 11.25 -6.953125 C 11.46875 -6.640625 11.613281 -6.257812 11.6875 -5.8125 C 11.769531 -5.375 11.8125 -4.894531 11.8125 -4.375 L 11.8125 0 L 10.40625 0 L 10.40625 -4.078125 C 10.40625 -4.535156 10.382812 -4.929688 10.34375 -5.265625 C 10.300781 -5.597656 10.21875 -5.875 10.09375 -6.09375 C 9.96875 -6.3125 9.796875 -6.472656 9.578125 -6.578125 C 9.359375 -6.679688 9.082031 -6.734375 8.75 -6.734375 C 8.28125 -6.734375 7.890625 -6.671875 7.578125 -6.546875 C 7.273438 -6.421875 7.066406 -6.304688 6.953125 -6.203125 C 7.035156 -5.941406 7.097656 -5.65625 7.140625 -5.34375 C 7.179688 -5.039062 7.203125 -4.71875 7.203125 -4.375 L 7.203125 0 L 5.8125 0 L 5.8125 -4.078125 C 5.8125 -4.535156 5.785156 -4.929688 5.734375 -5.265625 C 5.679688 -5.597656 5.59375 -5.875 5.46875 -6.09375 C 5.34375 -6.3125 5.171875 -6.472656 4.953125 -6.578125 C 4.742188 -6.679688 4.472656 -6.734375 4.140625 -6.734375 C 4.003906 -6.734375 3.851562 -6.726562 3.6875 -6.71875 C 3.53125 -6.707031 3.378906 -6.691406 3.234375 -6.671875 C 3.085938 -6.660156 2.953125 -6.644531 2.828125 -6.625 C 2.710938 -6.601562 2.632812 -6.585938 2.59375 -6.578125 L 2.59375 0 L 1.203125 0 Z M 1.203125 -7.578125 "/>
</symbol>
<symbol overflow="visible" id="glyph0-30">
<path style="stroke:none;" d="M 2.59375 -7.453125 C 2.757812 -7.566406 3.015625 -7.679688 3.359375 -7.796875 C 3.710938 -7.921875 4.113281 -7.984375 4.5625 -7.984375 C 5.125 -7.984375 5.617188 -7.878906 6.046875 -7.671875 C 6.484375 -7.472656 6.851562 -7.191406 7.15625 -6.828125 C 7.457031 -6.472656 7.679688 -6.046875 7.828125 -5.546875 C 7.984375 -5.046875 8.0625 -4.5 8.0625 -3.90625 C 8.0625 -3.269531 7.96875 -2.695312 7.78125 -2.1875 C 7.601562 -1.6875 7.34375 -1.257812 7 -0.90625 C 6.664062 -0.5625 6.257812 -0.289062 5.78125 -0.09375 C 5.300781 0.09375 4.757812 0.1875 4.15625 0.1875 C 3.507812 0.1875 2.9375 0.140625 2.4375 0.046875 C 1.9375 -0.046875 1.523438 -0.132812 1.203125 -0.21875 L 1.203125 -11.40625 L 2.59375 -11.640625 Z M 2.59375 -1.21875 C 2.738281 -1.175781 2.9375 -1.132812 3.1875 -1.09375 C 3.4375 -1.0625 3.753906 -1.046875 4.140625 -1.046875 C 4.890625 -1.046875 5.488281 -1.289062 5.9375 -1.78125 C 6.382812 -2.28125 6.609375 -2.988281 6.609375 -3.90625 C 6.609375 -4.300781 6.566406 -4.671875 6.484375 -5.015625 C 6.410156 -5.367188 6.28125 -5.671875 6.09375 -5.921875 C 5.914062 -6.179688 5.6875 -6.382812 5.40625 -6.53125 C 5.125 -6.675781 4.78125 -6.75 4.375 -6.75 C 4 -6.75 3.648438 -6.679688 3.328125 -6.546875 C 3.003906 -6.421875 2.757812 -6.289062 2.59375 -6.15625 Z M 2.59375 -1.21875 "/>
</symbol>
<symbol overflow="visible" id="glyph0-31">
<path style="stroke:none;" d="M 5.765625 0.21875 C 5.035156 0.21875 4.367188 0.0976562 3.765625 -0.140625 C 3.160156 -0.378906 2.644531 -0.726562 2.21875 -1.1875 C 1.789062 -1.644531 1.457031 -2.210938 1.21875 -2.890625 C 0.988281 -3.566406 0.875 -4.335938 0.875 -5.203125 C 0.875 -6.078125 1.003906 -6.847656 1.265625 -7.515625 C 1.535156 -8.191406 1.894531 -8.757812 2.34375 -9.21875 C 2.789062 -9.6875 3.3125 -10.039062 3.90625 -10.28125 C 4.507812 -10.519531 5.148438 -10.640625 5.828125 -10.640625 C 6.265625 -10.640625 6.65625 -10.609375 7 -10.546875 C 7.34375 -10.484375 7.640625 -10.410156 7.890625 -10.328125 C 8.148438 -10.253906 8.359375 -10.175781 8.515625 -10.09375 C 8.679688 -10.007812 8.789062 -9.953125 8.84375 -9.921875 L 8.4375 -8.71875 C 8.34375 -8.78125 8.207031 -8.84375 8.03125 -8.90625 C 7.863281 -8.976562 7.671875 -9.046875 7.453125 -9.109375 C 7.242188 -9.179688 7.007812 -9.238281 6.75 -9.28125 C 6.5 -9.332031 6.242188 -9.359375 5.984375 -9.359375 C 5.429688 -9.359375 4.9375 -9.265625 4.5 -9.078125 C 4.0625 -8.890625 3.6875 -8.613281 3.375 -8.25 C 3.0625 -7.882812 2.820312 -7.445312 2.65625 -6.9375 C 2.5 -6.425781 2.421875 -5.847656 2.421875 -5.203125 C 2.421875 -4.585938 2.488281 -4.023438 2.625 -3.515625 C 2.769531 -3.003906 2.988281 -2.566406 3.28125 -2.203125 C 3.570312 -1.835938 3.9375 -1.550781 4.375 -1.34375 C 4.8125 -1.144531 5.316406 -1.046875 5.890625 -1.046875 C 6.566406 -1.046875 7.125 -1.113281 7.5625 -1.25 C 8 -1.394531 8.328125 -1.523438 8.546875 -1.640625 L 8.921875 -0.4375 C 8.847656 -0.382812 8.722656 -0.320312 8.546875 -0.25 C 8.367188 -0.175781 8.144531 -0.101562 7.875 -0.03125 C 7.601562 0.0390625 7.285156 0.0976562 6.921875 0.140625 C 6.566406 0.191406 6.179688 0.21875 5.765625 0.21875 Z M 5.765625 0.21875 "/>
</symbol>
<symbol overflow="visible" id="glyph0-32">
<path style="stroke:none;" d="M 4.25 -11.640625 C 4.65625 -11.640625 5.003906 -11.609375 5.296875 -11.546875 C 5.597656 -11.484375 5.804688 -11.429688 5.921875 -11.390625 L 5.671875 -10.1875 C 5.546875 -10.25 5.375 -10.304688 5.15625 -10.359375 C 4.9375 -10.410156 4.664062 -10.4375 4.34375 -10.4375 C 3.695312 -10.4375 3.242188 -10.257812 2.984375 -9.90625 C 2.722656 -9.550781 2.59375 -9.070312 2.59375 -8.46875 L 2.59375 -7.796875 L 5.59375 -7.796875 L 5.59375 -6.625 L 2.59375 -6.625 L 2.59375 0 L 1.203125 0 L 1.203125 -8.5 C 1.203125 -9.5 1.445312 -10.269531 1.9375 -10.8125 C 2.425781 -11.363281 3.195312 -11.640625 4.25 -11.640625 Z M 4.25 -11.640625 "/>
</symbol>
<symbol overflow="visible" id="glyph0-33">
<path style="stroke:none;" d="M 2.59375 0 L 1.203125 0 L 1.203125 -7.796875 L 2.59375 -7.796875 Z M 1.890625 -9.203125 C 1.640625 -9.203125 1.425781 -9.285156 1.25 -9.453125 C 1.070312 -9.617188 0.984375 -9.84375 0.984375 -10.125 C 0.984375 -10.40625 1.070312 -10.628906 1.25 -10.796875 C 1.425781 -10.960938 1.640625 -11.046875 1.890625 -11.046875 C 2.140625 -11.046875 2.351562 -10.960938 2.53125 -10.796875 C 2.707031 -10.628906 2.796875 -10.40625 2.796875 -10.125 C 2.796875 -9.84375 2.707031 -9.617188 2.53125 -9.453125 C 2.351562 -9.285156 2.140625 -9.203125 1.890625 -9.203125 Z M 1.890625 -9.203125 "/>
</symbol>
<symbol overflow="visible" id="glyph1-0">
<path style="stroke:none;" d=""/>
</symbol>
<symbol overflow="visible" id="glyph1-1">
<path style="stroke:none;" d="M 5 -3.9375 L 5 -3.8125 C 5.296875 -3.75 5.375 -3.6875 5.375 -3.53125 C 5.375 -3.40625 5.328125 -3.1875 5.234375 -2.953125 L 4.4375 -1.015625 L 3.703125 -2.96875 C 3.5625 -3.375 3.5625 -3.375 3.5625 -3.484375 C 3.5625 -3.6875 3.65625 -3.75 4.0625 -3.8125 L 4.0625 -3.9375 L 2.296875 -3.9375 L 2.296875 -3.8125 C 2.609375 -3.765625 2.71875 -3.671875 2.890625 -3.203125 C 2.9375 -3.078125 3.015625 -2.859375 3.078125 -2.71875 L 2.28125 -0.96875 L 1.40625 -3.25 C 1.375 -3.34375 1.359375 -3.4375 1.359375 -3.515625 C 1.359375 -3.703125 1.453125 -3.765625 1.765625 -3.8125 L 1.765625 -3.9375 L 0.1875 -3.9375 L 0.1875 -3.8125 C 0.390625 -3.78125 0.453125 -3.703125 0.640625 -3.25 L 1.828125 -0.265625 C 1.9375 0.015625 2 0.125 2.0625 0.125 C 2.09375 0.125 2.171875 0.015625 2.28125 -0.21875 L 3.25 -2.3125 L 4.046875 -0.25 C 4.1875 0.078125 4.203125 0.125 4.265625 0.125 C 4.328125 0.125 4.359375 0.046875 4.5 -0.3125 L 5.71875 -3.328125 C 5.875 -3.703125 5.890625 -3.75 6.078125 -3.8125 L 6.078125 -3.9375 Z M 5 -3.9375 "/>
</symbol>
<symbol overflow="visible" id="glyph1-2">
<path style="stroke:none;" d="M 3.5625 -1.4375 C 3.15625 -0.765625 2.78125 -0.515625 2.21875 -0.515625 C 1.71875 -0.515625 1.34375 -0.765625 1.078125 -1.265625 C 0.921875 -1.59375 0.859375 -1.875 0.84375 -2.421875 L 3.546875 -2.421875 C 3.46875 -3 3.390625 -3.25 3.171875 -3.53125 C 2.90625 -3.84375 2.5 -4.03125 2.046875 -4.03125 C 1.609375 -4.03125 1.203125 -3.875 0.859375 -3.5625 C 0.453125 -3.21875 0.21875 -2.59375 0.21875 -1.875 C 0.21875 -0.671875 0.84375 0.09375 1.859375 0.09375 C 2.6875 0.09375 3.34375 -0.421875 3.703125 -1.375 Z M 0.859375 -2.703125 C 0.96875 -3.390625 1.265625 -3.703125 1.796875 -3.703125 C 2.328125 -3.703125 2.53125 -3.46875 2.65625 -2.703125 Z M 0.859375 -2.703125 "/>
</symbol>
<symbol overflow="visible" id="glyph1-3">
<path style="stroke:none;" d="M 1.34375 -5.953125 L 1.296875 -5.96875 C 0.9375 -5.859375 0.703125 -5.78125 0.28125 -5.65625 L 0.03125 -5.59375 L 0.03125 -5.453125 C 0.078125 -5.453125 0.109375 -5.453125 0.171875 -5.453125 C 0.53125 -5.453125 0.609375 -5.375 0.609375 -5.015625 L 0.609375 -0.46875 C 0.609375 -0.203125 1.34375 0.09375 2.046875 0.09375 C 3.203125 0.09375 4.09375 -0.875 4.09375 -2.125 C 4.09375 -3.21875 3.4375 -4.03125 2.5625 -4.03125 C 2.015625 -4.03125 1.515625 -3.71875 1.34375 -3.28125 Z M 1.34375 -2.8125 C 1.34375 -3.15625 1.75 -3.46875 2.203125 -3.46875 C 2.453125 -3.46875 2.671875 -3.390625 2.859375 -3.21875 C 3.125 -2.953125 3.328125 -2.359375 3.328125 -1.71875 C 3.328125 -0.75 2.90625 -0.1875 2.1875 -0.1875 C 1.734375 -0.1875 1.34375 -0.390625 1.34375 -0.609375 Z M 1.34375 -2.8125 "/>
</symbol>
<symbol overflow="visible" id="glyph1-4">
<path style="stroke:none;" d="M 2.75 -2.75 L 2.71875 -3.953125 L 2.625 -3.953125 C 2.578125 -3.875 2.53125 -3.84375 2.484375 -3.84375 C 2.4375 -3.84375 2.34375 -3.875 2.25 -3.90625 C 2.046875 -3.984375 1.84375 -4.03125 1.640625 -4.03125 C 0.9375 -4.03125 0.453125 -3.5625 0.453125 -2.9375 C 0.453125 -2.453125 0.71875 -2.09375 1.46875 -1.6875 L 1.984375 -1.390625 C 2.28125 -1.21875 2.4375 -1 2.4375 -0.734375 C 2.4375 -0.34375 2.15625 -0.109375 1.703125 -0.109375 C 1.109375 -0.109375 0.796875 -0.4375 0.59375 -1.328125 L 0.453125 -1.328125 L 0.453125 0.03125 L 0.5625 0.03125 C 0.625 -0.046875 0.671875 -0.0625 0.765625 -0.0625 C 0.859375 -0.0625 0.96875 -0.046875 1.171875 0 C 1.40625 0.046875 1.640625 0.09375 1.8125 0.09375 C 2.5 0.09375 3.046875 -0.421875 3.046875 -1.03125 C 3.046875 -1.46875 2.828125 -1.765625 2.3125 -2.078125 L 1.359375 -2.640625 C 1.125 -2.78125 0.984375 -3 0.984375 -3.234375 C 0.984375 -3.59375 1.265625 -3.828125 1.65625 -3.828125 C 2.15625 -3.828125 2.421875 -3.53125 2.625 -2.75 Z M 2.75 -2.75 "/>
</symbol>
<symbol overflow="visible" id="glyph1-5">
<path style="stroke:none;" d="M 2.1875 -4.03125 C 1.046875 -4.03125 0.25 -3.1875 0.25 -1.984375 C 0.25 -0.78125 1.0625 0.09375 2.171875 0.09375 C 3.265625 0.09375 4.109375 -0.828125 4.109375 -2.046875 C 4.109375 -3.203125 3.3125 -4.03125 2.1875 -4.03125 Z M 2.078125 -3.78125 C 2.8125 -3.78125 3.328125 -2.9375 3.328125 -1.734375 C 3.328125 -0.75 2.9375 -0.15625 2.28125 -0.15625 C 1.9375 -0.15625 1.609375 -0.375 1.421875 -0.71875 C 1.1875 -1.171875 1.046875 -1.78125 1.046875 -2.40625 C 1.046875 -3.234375 1.4375 -3.78125 2.078125 -3.78125 Z M 2.078125 -3.78125 "/>
</symbol>
<symbol overflow="visible" id="glyph1-6">
<path style="stroke:none;" d="M 3.484375 -1.359375 C 3.0625 -0.75 2.75 -0.546875 2.25 -0.546875 C 1.4375 -0.546875 0.890625 -1.25 0.890625 -2.25 C 0.890625 -3.15625 1.375 -3.765625 2.078125 -3.765625 C 2.390625 -3.765625 2.515625 -3.6875 2.59375 -3.34375 L 2.65625 -3.15625 C 2.71875 -2.90625 2.875 -2.75 3.078125 -2.75 C 3.296875 -2.75 3.484375 -2.921875 3.484375 -3.125 C 3.484375 -3.609375 2.875 -4.03125 2.140625 -4.03125 C 1.703125 -4.03125 1.265625 -3.84375 0.90625 -3.53125 C 0.46875 -3.15625 0.21875 -2.5625 0.21875 -1.859375 C 0.21875 -0.71875 0.90625 0.09375 1.875 0.09375 C 2.28125 0.09375 2.625 -0.046875 2.9375 -0.328125 C 3.171875 -0.53125 3.34375 -0.765625 3.609375 -1.28125 Z M 3.484375 -1.359375 "/>
</symbol>
<symbol overflow="visible" id="glyph1-7">
<path style="stroke:none;" d="M 0.0625 0 L 2.109375 0 L 2.109375 -0.125 L 1.9375 -0.140625 C 1.5625 -0.171875 1.46875 -0.265625 1.453125 -0.59375 L 1.453125 -2.203125 L 2.671875 -0.5625 C 2.71875 -0.515625 2.734375 -0.46875 2.765625 -0.453125 C 2.828125 -0.359375 2.859375 -0.3125 2.859375 -0.265625 C 2.859375 -0.1875 2.78125 -0.125 2.671875 -0.125 L 2.515625 -0.125 L 2.515625 0 L 4.421875 0 L 4.421875 -0.125 C 4.03125 -0.15625 3.765625 -0.328125 3.390625 -0.765625 L 2.0625 -2.46875 L 2.3125 -2.703125 C 3.40625 -3.6875 3.640625 -3.828125 4.203125 -3.8125 L 4.203125 -3.9375 L 2.421875 -3.9375 L 2.421875 -3.8125 C 2.75 -3.8125 2.859375 -3.765625 2.859375 -3.65625 C 2.859375 -3.578125 2.78125 -3.46875 2.65625 -3.34375 L 1.453125 -2.28125 L 1.453125 -5.953125 L 1.421875 -5.96875 C 1.078125 -5.875 0.828125 -5.796875 0.328125 -5.65625 L 0.0625 -5.59375 L 0.0625 -5.453125 C 0.171875 -5.453125 0.25 -5.46875 0.34375 -5.46875 C 0.640625 -5.46875 0.71875 -5.359375 0.71875 -4.9375 L 0.71875 -0.71875 C 0.703125 -0.25 0.6875 -0.234375 0.0625 -0.125 Z M 0.0625 0 "/>
</symbol>
<symbol overflow="visible" id="glyph1-8">
<path style="stroke:none;" d="M 2.234375 -3.9375 L 1.34375 -3.9375 L 1.34375 -4.953125 C 1.34375 -5.046875 1.328125 -5.0625 1.28125 -5.0625 C 0.78125 -4.328125 0.515625 -4.03125 0.265625 -3.890625 C 0.171875 -3.828125 0.109375 -3.765625 0.109375 -3.71875 C 0.109375 -3.6875 0.125 -3.671875 0.15625 -3.65625 L 0.609375 -3.65625 L 0.609375 -1.03125 C 0.609375 -0.28125 0.875 0.09375 1.390625 0.09375 C 1.8125 0.09375 2.15625 -0.125 2.4375 -0.578125 L 2.328125 -0.671875 C 2.140625 -0.453125 2 -0.375 1.796875 -0.375 C 1.484375 -0.375 1.34375 -0.609375 1.34375 -1.15625 L 1.34375 -3.65625 L 2.234375 -3.65625 Z M 2.234375 -3.9375 "/>
</symbol>
<symbol overflow="visible" id="glyph1-9">
<path style="stroke:none;" d=""/>
</symbol>
<symbol overflow="visible" id="glyph1-10">
<path style="stroke:none;" d="M 0.140625 0 L 2.21875 0 L 2.21875 -0.125 C 1.640625 -0.171875 1.578125 -0.25 1.5625 -0.890625 L 1.5625 -4 L 1.53125 -4.03125 L 0.171875 -3.546875 L 0.171875 -3.40625 L 0.25 -3.421875 C 0.34375 -3.4375 0.453125 -3.453125 0.546875 -3.453125 C 0.75 -3.453125 0.828125 -3.3125 0.828125 -2.921875 L 0.828125 -0.890625 C 0.8125 -0.25 0.734375 -0.15625 0.140625 -0.125 Z M 1.125 -5.96875 C 0.890625 -5.96875 0.6875 -5.78125 0.6875 -5.53125 C 0.6875 -5.28125 0.875 -5.078125 1.125 -5.078125 C 1.375 -5.078125 1.578125 -5.28125 1.578125 -5.53125 C 1.578125 -5.78125 1.375 -5.96875 1.125 -5.96875 Z M 1.125 -5.96875 "/>
</symbol>
<symbol overflow="visible" id="glyph1-11">
<path style="stroke:none;" d="M 0.140625 0 L 2.078125 0 L 2.078125 -0.125 C 1.640625 -0.140625 1.5 -0.234375 1.484375 -0.59375 L 1.484375 -3.046875 C 1.484375 -3.078125 1.5625 -3.15625 1.625 -3.21875 C 1.84375 -3.421875 2.21875 -3.5625 2.515625 -3.5625 C 2.90625 -3.5625 3.09375 -3.265625 3.09375 -2.65625 L 3.09375 -0.75 C 3.078125 -0.25 3 -0.15625 2.5 -0.125 L 2.5 0 L 4.46875 0 L 4.46875 -0.125 C 3.96875 -0.125 3.84375 -0.265625 3.828125 -0.828125 L 3.828125 -3.03125 C 4.09375 -3.40625 4.375 -3.5625 4.78125 -3.5625 C 5.28125 -3.5625 5.4375 -3.328125 5.4375 -2.609375 L 5.4375 -0.765625 C 5.421875 -0.25 5.375 -0.1875 4.859375 -0.125 L 4.859375 0 L 6.78125 0 L 6.78125 -0.125 L 6.546875 -0.15625 C 6.28125 -0.1875 6.171875 -0.328125 6.171875 -0.671875 L 6.171875 -2.46875 C 6.171875 -3.5 5.84375 -4.03125 5.15625 -4.03125 C 4.65625 -4.03125 4.203125 -3.796875 3.734375 -3.296875 C 3.578125 -3.78125 3.28125 -4.03125 2.8125 -4.03125 C 2.421875 -4.03125 2.171875 -3.90625 1.453125 -3.34375 L 1.453125 -4 L 1.390625 -4.03125 C 0.921875 -3.859375 0.625 -3.765625 0.171875 -3.625 L 0.171875 -3.484375 C 0.265625 -3.515625 0.34375 -3.515625 0.453125 -3.515625 C 0.671875 -3.515625 0.75 -3.375 0.75 -2.953125 L 0.75 -0.75 C 0.734375 -0.25 0.625 -0.125 0.140625 -0.125 Z M 0.140625 0 "/>
</symbol>
<symbol overflow="visible" id="glyph1-12">
<path style="stroke:none;" d="M 4.1875 -0.4375 L 4.140625 -0.4375 C 3.71875 -0.453125 3.65625 -0.53125 3.65625 -0.9375 L 3.65625 -3.9375 L 2.265625 -3.9375 L 2.265625 -3.78125 C 2.8125 -3.765625 2.90625 -3.671875 2.90625 -3.234375 L 2.90625 -1.1875 C 2.90625 -0.9375 2.875 -0.8125 2.75 -0.71875 C 2.515625 -0.53125 2.234375 -0.421875 1.984375 -0.421875 C 1.640625 -0.421875 1.359375 -0.71875 1.359375 -1.078125 L 1.359375 -3.9375 L 0.078125 -3.9375 L 0.078125 -3.8125 C 0.484375 -3.796875 0.609375 -3.671875 0.625 -3.25 L 0.625 -1.046875 C 0.625 -0.359375 1.046875 0.09375 1.6875 0.09375 C 2 0.09375 2.34375 -0.046875 2.578125 -0.28125 L 2.953125 -0.671875 L 2.953125 0.0625 L 3 0.078125 C 3.4375 -0.09375 3.75 -0.1875 4.1875 -0.3125 Z M 4.1875 -0.4375 "/>
</symbol>
<symbol overflow="visible" id="glyph1-13">
<path style="stroke:none;" d="M 0.1875 0 L 2.25 0 L 2.25 -0.125 C 1.703125 -0.15625 1.59375 -0.25 1.59375 -0.734375 L 1.59375 -5.953125 L 1.5625 -5.96875 C 1.109375 -5.84375 0.78125 -5.734375 0.171875 -5.59375 L 0.171875 -5.453125 L 0.21875 -5.453125 C 0.3125 -5.453125 0.421875 -5.46875 0.484375 -5.46875 C 0.765625 -5.46875 0.859375 -5.34375 0.859375 -4.9375 L 0.859375 -0.765625 C 0.84375 -0.28125 0.71875 -0.171875 0.1875 -0.125 Z M 0.1875 0 "/>
</symbol>
<symbol overflow="visible" id="glyph1-14">
<path style="stroke:none;" d="M 3.875 -0.578125 C 3.71875 -0.453125 3.609375 -0.40625 3.484375 -0.40625 C 3.28125 -0.40625 3.21875 -0.53125 3.21875 -0.921875 L 3.21875 -2.625 C 3.21875 -3.078125 3.171875 -3.328125 3.046875 -3.546875 C 2.859375 -3.859375 2.46875 -4.03125 1.953125 -4.03125 C 1.140625 -4.03125 0.484375 -3.59375 0.484375 -3.046875 C 0.484375 -2.84375 0.65625 -2.671875 0.859375 -2.671875 C 1.078125 -2.671875 1.265625 -2.84375 1.265625 -3.03125 C 1.265625 -3.078125 1.25 -3.109375 1.25 -3.171875 C 1.21875 -3.25 1.21875 -3.328125 1.21875 -3.390625 C 1.21875 -3.625 1.5 -3.8125 1.84375 -3.8125 C 2.28125 -3.8125 2.515625 -3.5625 2.515625 -3.09375 L 2.515625 -2.5625 C 1.171875 -2.015625 1.015625 -1.9375 0.640625 -1.609375 C 0.453125 -1.4375 0.328125 -1.140625 0.328125 -0.84375 C 0.328125 -0.296875 0.703125 0.09375 1.25 0.09375 C 1.625 0.09375 1.984375 -0.09375 2.515625 -0.546875 C 2.5625 -0.09375 2.71875 0.09375 3.078125 0.09375 C 3.375 0.09375 3.5625 -0.015625 3.875 -0.34375 Z M 2.515625 -1.078125 C 2.515625 -0.8125 2.46875 -0.71875 2.28125 -0.609375 C 2.0625 -0.484375 1.828125 -0.421875 1.640625 -0.421875 C 1.34375 -0.421875 1.09375 -0.71875 1.09375 -1.09375 L 1.09375 -1.125 C 1.109375 -1.65625 1.484375 -1.984375 2.515625 -2.34375 Z M 2.515625 -1.078125 "/>
</symbol>
<symbol overflow="visible" id="glyph1-15">
<path style="stroke:none;" d="M 0.15625 0 L 2.015625 0 L 2.015625 -0.125 C 1.578125 -0.15625 1.4375 -0.265625 1.4375 -0.59375 L 1.4375 -3.046875 C 1.859375 -3.4375 2.046875 -3.546875 2.34375 -3.546875 C 2.765625 -3.546875 2.96875 -3.265625 2.96875 -2.6875 L 2.96875 -0.859375 C 2.953125 -0.296875 2.859375 -0.15625 2.421875 -0.125 L 2.421875 0 L 4.25 0 L 4.25 -0.125 C 3.8125 -0.171875 3.71875 -0.28125 3.703125 -0.703125 L 3.703125 -2.71875 C 3.703125 -3.53125 3.328125 -4.03125 2.671875 -4.03125 C 2.28125 -4.03125 2 -3.875 1.40625 -3.3125 L 1.40625 -4 L 1.34375 -4.03125 C 0.890625 -3.859375 0.59375 -3.765625 0.140625 -3.625 L 0.140625 -3.484375 C 0.203125 -3.515625 0.28125 -3.515625 0.375 -3.515625 C 0.625 -3.515625 0.703125 -3.390625 0.703125 -2.953125 L 0.703125 -0.78125 C 0.6875 -0.265625 0.59375 -0.15625 0.15625 -0.125 Z M 0.15625 0 "/>
</symbol>
<symbol overflow="visible" id="glyph1-16">
<path style="stroke:none;" d="M 4.296875 -0.5 C 4.1875 -0.5 4.125 -0.5 4.09375 -0.5 C 3.78125 -0.5 3.703125 -0.59375 3.703125 -1 L 3.703125 -5.953125 L 3.671875 -5.96875 C 3.25 -5.84375 2.953125 -5.734375 2.375 -5.59375 L 2.375 -5.453125 C 2.453125 -5.453125 2.5 -5.453125 2.578125 -5.453125 C 2.890625 -5.453125 2.96875 -5.375 2.96875 -5.015625 L 2.96875 -3.65625 C 2.640625 -3.921875 2.40625 -4.03125 2.0625 -4.03125 C 1.046875 -4.03125 0.234375 -3.03125 0.234375 -1.796875 C 0.234375 -0.671875 0.890625 0.09375 1.859375 0.09375 C 2.34375 0.09375 2.671875 -0.09375 2.96875 -0.5 L 2.96875 0.0625 L 3.015625 0.09375 L 4.296875 -0.375 Z M 2.96875 -0.890625 C 2.96875 -0.828125 2.90625 -0.71875 2.828125 -0.625 C 2.671875 -0.453125 2.453125 -0.375 2.203125 -0.375 C 1.46875 -0.375 0.984375 -1.0625 0.984375 -2.15625 C 0.984375 -3.125 1.421875 -3.78125 2.078125 -3.78125 C 2.5625 -3.78125 2.96875 -3.375 2.96875 -2.90625 Z M 2.96875 -0.890625 "/>
</symbol>
<symbol overflow="visible" id="glyph1-17">
<path style="stroke:none;" d="M 3.15625 -3.71875 C 2.75 -3.953125 2.5 -4.03125 2.140625 -4.03125 C 1.046875 -4.03125 0.203125 -3.046875 0.203125 -1.78125 C 0.203125 -0.6875 0.78125 0.09375 1.609375 0.09375 C 2.125 0.09375 2.59375 -0.140625 2.984375 -0.5625 L 2.984375 1.078125 C 2.96875 1.578125 2.8125 1.71875 2.203125 1.75 L 2.203125 1.90625 L 4.265625 1.90625 L 4.265625 1.78125 C 3.796875 1.671875 3.734375 1.609375 3.71875 1.234375 L 3.71875 -3.984375 L 3.625 -4 Z M 2.984375 -1.109375 C 2.984375 -0.90625 2.953125 -0.78125 2.859375 -0.703125 C 2.671875 -0.546875 2.375 -0.453125 2.109375 -0.453125 C 1.84375 -0.453125 1.59375 -0.53125 1.421875 -0.703125 C 1.140625 -0.96875 0.96875 -1.515625 0.96875 -2.109375 C 0.96875 -3.140625 1.421875 -3.78125 2.171875 -3.78125 C 2.71875 -3.78125 2.984375 -3.484375 2.984375 -2.90625 Z M 2.984375 -1.109375 "/>
</symbol>
<symbol overflow="visible" id="glyph1-18">
<path style="stroke:none;" d="M 0.046875 1.90625 L 2.15625 1.90625 L 2.15625 1.734375 C 1.5 1.734375 1.40625 1.640625 1.390625 1.078125 L 1.390625 -0.28125 C 1.703125 0 1.90625 0.09375 2.28125 0.09375 C 3.3125 0.09375 4.109375 -0.890625 4.109375 -2.15625 C 4.109375 -3.25 3.5 -4.03125 2.65625 -4.03125 C 2.15625 -4.03125 1.78125 -3.8125 1.390625 -3.328125 L 1.390625 -4 L 1.34375 -4.03125 C 0.859375 -3.84375 0.5625 -3.734375 0.078125 -3.578125 L 0.078125 -3.4375 C 0.15625 -3.453125 0.203125 -3.453125 0.296875 -3.453125 C 0.59375 -3.453125 0.65625 -3.359375 0.65625 -2.953125 L 0.65625 1.140625 C 0.65625 1.609375 0.5625 1.703125 0.046875 1.75 Z M 1.390625 -2.921875 C 1.390625 -3.1875 1.875 -3.5 2.28125 -3.5 C 2.9375 -3.5 3.359375 -2.828125 3.359375 -1.8125 C 3.359375 -0.84375 2.9375 -0.1875 2.296875 -0.1875 C 1.890625 -0.1875 1.390625 -0.5 1.390625 -0.765625 Z M 1.390625 -2.921875 "/>
</symbol>
<symbol overflow="visible" id="glyph1-19">
<path style="stroke:none;" d="M 4.109375 -3.390625 L 4.109375 -3.734375 L 3.4375 -3.734375 C 3.25 -3.734375 3.125 -3.765625 2.953125 -3.828125 L 2.765625 -3.890625 C 2.53125 -3.984375 2.296875 -4.03125 2.0625 -4.03125 C 1.25 -4.03125 0.609375 -3.40625 0.609375 -2.59375 C 0.609375 -2.046875 0.828125 -1.71875 1.421875 -1.421875 L 1.1875 -1.21875 C 1 -1.046875 0.90625 -0.9375 0.875 -0.90625 C 0.6875 -0.71875 0.640625 -0.625 0.640625 -0.46875 C 0.640625 -0.28125 0.734375 -0.1875 1.109375 -0.015625 C 0.46875 0.453125 0.25 0.734375 0.25 1.0625 C 0.25 1.515625 0.921875 1.90625 1.765625 1.90625 C 2.421875 1.90625 3.09375 1.6875 3.546875 1.3125 C 3.890625 1.046875 4.03125 0.765625 4.03125 0.421875 C 4.03125 -0.109375 3.625 -0.46875 2.96875 -0.5 L 1.84375 -0.5625 C 1.375 -0.578125 1.15625 -0.65625 1.15625 -0.796875 C 1.15625 -0.96875 1.453125 -1.28125 1.6875 -1.34375 C 2 -1.328125 2.171875 -1.296875 2.1875 -1.296875 C 2.515625 -1.296875 2.859375 -1.4375 3.125 -1.671875 C 3.421875 -1.921875 3.546875 -2.21875 3.546875 -2.65625 C 3.546875 -2.90625 3.515625 -3.109375 3.390625 -3.390625 Z M 1.28125 0.015625 C 1.578125 0.078125 2.265625 0.125 2.71875 0.125 C 3.5 0.125 3.78125 0.25 3.78125 0.5625 C 3.78125 1.0625 3.125 1.40625 2.140625 1.40625 C 1.359375 1.40625 0.859375 1.15625 0.859375 0.765625 C 0.859375 0.5625 0.9375 0.4375 1.28125 0.015625 Z M 1.328125 -2.953125 C 1.328125 -3.46875 1.578125 -3.78125 1.984375 -3.78125 C 2.25 -3.78125 2.46875 -3.625 2.609375 -3.375 C 2.78125 -3.0625 2.875 -2.671875 2.875 -2.3125 C 2.875 -1.828125 2.640625 -1.515625 2.234375 -1.515625 C 1.6875 -1.515625 1.328125 -2.09375 1.328125 -2.9375 Z M 1.328125 -2.953125 "/>
</symbol>
<symbol overflow="visible" id="glyph1-20">
<path style="stroke:none;" d="M 0.046875 0 L 2.140625 0 L 2.140625 -0.125 C 1.5625 -0.15625 1.421875 -0.265625 1.40625 -0.78125 L 1.40625 -2.75 C 1.40625 -3.03125 1.765625 -3.46875 2.015625 -3.46875 C 2.0625 -3.46875 2.140625 -3.4375 2.234375 -3.34375 C 2.375 -3.21875 2.46875 -3.171875 2.59375 -3.171875 C 2.796875 -3.171875 2.9375 -3.3125 2.9375 -3.5625 C 2.9375 -3.84375 2.75 -4.03125 2.453125 -4.03125 C 2.078125 -4.03125 1.84375 -3.828125 1.40625 -3.203125 L 1.40625 -4 L 1.359375 -4.03125 C 0.859375 -3.828125 0.546875 -3.703125 0.0625 -3.546875 L 0.0625 -3.40625 C 0.1875 -3.4375 0.265625 -3.453125 0.375 -3.453125 C 0.59375 -3.453125 0.671875 -3.3125 0.671875 -2.921875 L 0.671875 -0.734375 C 0.640625 -0.28125 0.59375 -0.234375 0.046875 -0.125 Z M 0.046875 0 "/>
</symbol>
<symbol overflow="visible" id="glyph1-21">
<path style="stroke:none;" d="M 2.578125 -5.921875 C 1.9375 -5.484375 1.671875 -5.265625 1.34375 -4.859375 C 0.71875 -4.109375 0.421875 -3.234375 0.421875 -2.203125 C 0.421875 -1.078125 0.75 -0.234375 1.515625 0.65625 C 1.875 1.078125 2.09375 1.265625 2.5625 1.546875 L 2.65625 1.40625 C 1.953125 0.859375 1.71875 0.546875 1.484375 -0.109375 C 1.265625 -0.6875 1.171875 -1.34375 1.171875 -2.234375 C 1.171875 -3.15625 1.28125 -3.875 1.515625 -4.40625 C 1.765625 -4.953125 2.03125 -5.265625 2.65625 -5.78125 Z M 2.578125 -5.921875 "/>
</symbol>
<symbol overflow="visible" id="glyph1-22">
<path style="stroke:none;" d="M 3.953125 -0.171875 C 3.234375 -0.203125 3.125 -0.3125 3.109375 -0.953125 L 3.109375 -5.421875 L 3.59375 -5.421875 C 4.609375 -5.40625 4.78125 -5.265625 4.984375 -4.3125 L 5.1875 -4.3125 L 5.140625 -5.796875 L 0.203125 -5.796875 L 0.15625 -4.3125 L 0.359375 -4.3125 C 0.5625 -5.265625 0.75 -5.40625 1.75 -5.421875 L 2.21875 -5.421875 L 2.21875 -1.046875 C 2.21875 -0.296875 2.140625 -0.203125 1.40625 -0.171875 L 1.40625 0 L 3.953125 0 Z M 3.953125 -0.171875 "/>
</symbol>
<symbol overflow="visible" id="glyph1-23">
<path style="stroke:none;" d="M 5.421875 -3.953125 L 5.34375 -5.921875 L 5.15625 -5.921875 C 5.109375 -5.734375 4.96875 -5.625 4.796875 -5.625 C 4.71875 -5.625 4.578125 -5.65625 4.453125 -5.703125 C 4.03125 -5.84375 3.59375 -5.921875 3.171875 -5.921875 C 2.453125 -5.921875 1.734375 -5.640625 1.1875 -5.15625 C 0.578125 -4.625 0.25 -3.8125 0.25 -2.859375 C 0.25 -1.0625 1.40625 0.125 3.15625 0.125 C 4.140625 0.125 5.015625 -0.28125 5.53125 -0.984375 L 5.375 -1.140625 C 4.75 -0.53125 4.15625 -0.265625 3.4375 -0.265625 C 2.875 -0.265625 2.390625 -0.4375 2.015625 -0.765625 C 1.53125 -1.203125 1.265625 -1.984375 1.265625 -2.96875 C 1.265625 -4.546875 2.078125 -5.5625 3.34375 -5.5625 C 3.84375 -5.5625 4.296875 -5.375 4.640625 -5.046875 C 4.921875 -4.765625 5.0625 -4.515625 5.21875 -3.953125 Z M 5.421875 -3.953125 "/>
</symbol>
<symbol overflow="visible" id="glyph1-24">
<path style="stroke:none;" d="M 0.140625 -5.625 C 0.78125 -5.5625 0.859375 -5.484375 0.875 -4.84375 L 0.875 -1.046875 C 0.859375 -0.3125 0.8125 -0.234375 0.140625 -0.171875 L 0.140625 0 L 2.59375 0 L 2.59375 -0.171875 C 1.90625 -0.1875 1.78125 -0.3125 1.765625 -0.953125 L 1.765625 -2.546875 C 2 -2.53125 2.140625 -2.515625 2.375 -2.515625 C 3.0625 -2.515625 3.53125 -2.609375 3.90625 -2.8125 C 4.421875 -3.09375 4.75 -3.625 4.75 -4.203125 C 4.75 -4.578125 4.625 -4.90625 4.390625 -5.15625 C 4.03125 -5.546875 3.265625 -5.796875 2.453125 -5.796875 L 0.140625 -5.796875 Z M 1.765625 -5.171875 C 1.765625 -5.40625 1.828125 -5.46875 2.0625 -5.46875 C 3.25 -5.46875 3.78125 -5.0625 3.78125 -4.15625 C 3.78125 -3.3125 3.265625 -2.875 2.265625 -2.875 C 2.09375 -2.875 1.96875 -2.875 1.765625 -2.890625 Z M 1.765625 -5.171875 "/>
</symbol>
<symbol overflow="visible" id="glyph1-25">
<path style="stroke:none;" d="M 2.515625 -5.921875 L 1.921875 -5.921875 L -0.078125 0.125 L 0.515625 0.125 Z M 2.515625 -5.921875 "/>
</symbol>
<symbol overflow="visible" id="glyph1-26">
<path style="stroke:none;" d="M 0.15625 0 L 2.75 0 L 2.75 -0.171875 C 2.03125 -0.1875 1.921875 -0.3125 1.90625 -0.953125 L 1.90625 -4.84375 C 1.921875 -5.5 2.03125 -5.59375 2.75 -5.625 L 2.75 -5.796875 L 0.15625 -5.796875 L 0.15625 -5.625 C 0.90625 -5.578125 1 -5.5 1 -4.84375 L 1 -0.953125 C 1 -0.28125 0.890625 -0.1875 0.15625 -0.171875 Z M 0.15625 0 "/>
</symbol>
<symbol overflow="visible" id="glyph1-27">
<path style="stroke:none;" d="M 0.328125 1.546875 C 0.984375 1.125 1.25 0.90625 1.5625 0.5 C 2.1875 -0.265625 2.5 -1.140625 2.5 -2.15625 C 2.5 -3.28125 2.171875 -4.125 1.40625 -5.015625 C 1.046875 -5.4375 0.8125 -5.640625 0.359375 -5.921875 L 0.25 -5.78125 C 0.953125 -5.21875 1.1875 -4.921875 1.4375 -4.265625 C 1.640625 -3.671875 1.734375 -3.015625 1.734375 -2.140625 C 1.734375 -1.21875 1.625 -0.5 1.390625 0.03125 C 1.15625 0.578125 0.890625 0.90625 0.25 1.40625 Z M 0.328125 1.546875 "/>
</symbol>
<symbol overflow="visible" id="glyph1-28">
<path style="stroke:none;" d="M 4.265625 -0.125 C 3.78125 -0.203125 3.75 -0.265625 3.734375 -0.890625 L 3.734375 -2.640625 C 3.734375 -3.546875 3.375 -4.03125 2.65625 -4.03125 C 2.140625 -4.03125 1.78125 -3.8125 1.375 -3.296875 L 1.375 -5.953125 L 1.328125 -5.96875 C 1.03125 -5.875 0.8125 -5.796875 0.328125 -5.65625 L 0.09375 -5.59375 L 0.09375 -5.453125 C 0.125 -5.453125 0.140625 -5.453125 0.1875 -5.453125 C 0.5625 -5.453125 0.640625 -5.390625 0.640625 -5.015625 L 0.640625 -0.890625 C 0.625 -0.265625 0.578125 -0.1875 0.078125 -0.125 L 0.078125 0 L 1.96875 0 L 1.96875 -0.125 C 1.46875 -0.171875 1.390625 -0.265625 1.375 -0.890625 L 1.375 -3 C 1.734375 -3.40625 2 -3.546875 2.359375 -3.546875 C 2.78125 -3.546875 3 -3.234375 3 -2.625 L 3 -0.890625 C 2.984375 -0.265625 2.90625 -0.171875 2.40625 -0.125 L 2.40625 0 L 4.265625 0 Z M 4.265625 -0.125 "/>
</symbol>
<symbol overflow="visible" id="glyph1-29">
<path style="stroke:none;" d="M 5.765625 -0.171875 C 5.4375 -0.1875 5.265625 -0.28125 5 -0.578125 L 3.203125 -2.796875 C 4.3125 -3.015625 4.78125 -3.453125 4.78125 -4.25 C 4.78125 -4.625 4.671875 -4.953125 4.4375 -5.203125 C 4.109375 -5.5625 3.375 -5.796875 2.5625 -5.796875 L 0.15625 -5.796875 L 0.15625 -5.625 C 0.796875 -5.5625 0.890625 -5.484375 0.890625 -4.84375 L 0.890625 -1.046875 C 0.890625 -0.3125 0.8125 -0.21875 0.15625 -0.171875 L 0.15625 0 L 2.578125 0 L 2.578125 -0.171875 C 1.90625 -0.203125 1.796875 -0.3125 1.78125 -0.953125 L 1.78125 -2.671875 L 2.28125 -2.6875 L 4.359375 0 L 5.765625 0 Z M 1.78125 -5.15625 C 1.78125 -5.40625 1.875 -5.46875 2.234375 -5.46875 C 3.328125 -5.46875 3.828125 -5.09375 3.828125 -4.265625 C 3.828125 -3.828125 3.65625 -3.46875 3.328125 -3.296875 C 2.9375 -3.078125 2.625 -3.015625 1.78125 -3 Z M 1.78125 -5.15625 "/>
</symbol>
<symbol overflow="visible" id="glyph1-30">
<path style="stroke:none;" d="M 6.171875 -0.171875 C 5.78125 -0.1875 5.703125 -0.28125 5.390625 -0.921875 L 3.21875 -5.890625 L 3.03125 -5.890625 L 1.21875 -1.59375 C 0.65625 -0.328125 0.546875 -0.1875 0.125 -0.171875 L 0.125 0 L 1.859375 0 L 1.859375 -0.171875 C 1.4375 -0.171875 1.265625 -0.265625 1.265625 -0.53125 C 1.265625 -0.625 1.296875 -0.75 1.34375 -0.859375 L 1.734375 -1.890625 L 4.03125 -1.890625 L 4.390625 -1.046875 C 4.5 -0.8125 4.5625 -0.59375 4.5625 -0.46875 C 4.5625 -0.25 4.40625 -0.171875 3.953125 -0.171875 L 3.953125 0 L 6.171875 0 Z M 1.890625 -2.25 L 2.890625 -4.65625 L 3.90625 -2.25 Z M 1.890625 -2.25 "/>
</symbol>
<symbol overflow="visible" id="glyph1-31">
<path style="stroke:none;" d="M 7.546875 -5.796875 L 5.8125 -5.796875 L 3.875 -1.375 L 1.859375 -5.796875 L 0.125 -5.796875 L 0.125 -5.625 C 0.84375 -5.59375 0.9375 -5.5 0.953125 -4.84375 L 0.953125 -1.28125 C 0.9375 -0.359375 0.828125 -0.203125 0.109375 -0.171875 L 0.109375 0 L 2.15625 0 L 2.15625 -0.171875 C 1.484375 -0.203125 1.359375 -0.390625 1.34375 -1.28125 L 1.34375 -4.8125 L 3.53125 0 L 3.65625 0 L 5.890625 -5.015625 L 5.890625 -1.046875 C 5.890625 -0.3125 5.796875 -0.203125 5.09375 -0.171875 L 5.09375 0 L 7.546875 0 L 7.546875 -0.171875 C 6.921875 -0.203125 6.8125 -0.328125 6.796875 -0.953125 L 6.796875 -4.84375 C 6.8125 -5.46875 6.90625 -5.578125 7.546875 -5.625 Z M 7.546875 -5.796875 "/>
</symbol>
</g>
</defs>
<g id="surface1">
<path style=" stroke:none;fill-rule:nonzero;fill:rgb(100%,100%,100%);fill-opacity:1;" d="M 0.0664062 50 L 0.0664062 0 L 1076.933594 0 L 1076.933594 50 Z M 0.0664062 50 "/>
<path style="fill-rule:nonzero;fill:rgb(80.000001%,80.000001%,100%);fill-opacity:1;stroke-width:6;stroke-linecap:butt;stroke-linejoin:miter;stroke:rgb(80.000001%,80.000001%,100%);stroke-opacity:1;stroke-miterlimit:4;" d="M 293.731635 -36 C 293.731635 -16.11875 227.993418 0 146.912328 0 C 65.82499 0 0.0930208 -16.11875 0.0930208 -36 C 0.0930208 -55.88125 65.82499 -72 146.912328 -72 C 227.993418 -72 293.731635 -55.88125 293.731635 -36 Z M 293.731635 -36 " transform="matrix(0.62529,0,0,0.625,2.566835,47.5)"/>
<g style="fill:rgb(0%,0%,0%);fill-opacity:1;">
  <use xlink:href="#glyph0-1" x="17.515625" y="28.874634"/>
  <use xlink:href="#glyph0-2" x="28.14556" y="28.874634"/>
  <use xlink:href="#glyph0-3" x="36.899624" y="28.874634"/>
  <use xlink:href="#glyph0-4" x="50.03072" y="28.874634"/>
  <use xlink:href="#glyph0-5" x="57.534204" y="28.874634"/>
  <use xlink:href="#glyph0-6" x="61.285945" y="28.874634"/>
  <use xlink:href="#glyph0-5" x="70.04001" y="28.874634"/>
  <use xlink:href="#glyph0-7" x="73.791751" y="28.874634"/>
  <use xlink:href="#glyph0-8" x="81.295235" y="28.874634"/>
  <use xlink:href="#glyph0-9" x="89.424009" y="28.874634"/>
  <use xlink:href="#glyph0-10" x="94.426331" y="28.874634"/>
  <use xlink:href="#glyph0-11" x="103.180395" y="28.874634"/>
  <use xlink:href="#glyph0-12" x="110.058588" y="28.874634"/>
  <use xlink:href="#glyph0-13" x="118.187362" y="28.874634"/>
  <use xlink:href="#glyph0-5" x="123.814975" y="28.874634"/>
  <use xlink:href="#glyph0-12" x="127.566717" y="28.874634"/>
  <use xlink:href="#glyph0-14" x="135.69549" y="28.874634"/>
  <use xlink:href="#glyph0-12" x="143.198974" y="28.874634"/>
  <use xlink:href="#glyph0-15" x="151.327748" y="28.874634"/>
  <use xlink:href="#glyph0-16" x="160.081812" y="28.874634"/>
  <use xlink:href="#glyph0-17" x="166.334715" y="28.874634"/>
</g>
<path style="fill-rule:nonzero;fill:rgb(20%,100%,20%);fill-opacity:1;stroke-width:6;stroke-linecap:butt;stroke-linejoin:miter;stroke:rgb(20%,100%,20%);stroke-opacity:1;stroke-miterlimit:4;" d="M 672.080904 -36 C 672.080904 -16.11875 633.948615 0 586.907964 0 C 539.87356 0 501.741271 -16.11875 501.741271 -36 C 501.741271 -55.88125 539.87356 -72 586.907964 -72 C 633.948615 -72 672.080904 -55.88125 672.080904 -36 Z M 672.080904 -36 " transform="matrix(0.62529,0,0,0.625,2.566835,47.5)"/>
<g style="fill:rgb(0%,0%,0%);fill-opacity:1;">
  <use xlink:href="#glyph0-18" x="327.972656" y="28.874634"/>
  <use xlink:href="#glyph0-19" x="336.72672" y="28.874634"/>
  <use xlink:href="#glyph0-11" x="345.480784" y="28.874634"/>
  <use xlink:href="#glyph0-16" x="352.358978" y="28.874634"/>
  <use xlink:href="#glyph0-20" x="357.98659" y="28.874634"/>
  <use xlink:href="#glyph0-13" x="366.740654" y="28.874634"/>
  <use xlink:href="#glyph0-12" x="372.368267" y="28.874634"/>
  <use xlink:href="#glyph0-11" x="380.497041" y="28.874634"/>
  <use xlink:href="#glyph0-5" x="387.375234" y="28.874634"/>
  <use xlink:href="#glyph0-21" x="391.126976" y="28.874634"/>
  <use xlink:href="#glyph0-22" x="401.756911" y="28.874634"/>
</g>
<path style="fill:none;stroke-width:1;stroke-linecap:butt;stroke-linejoin:miter;stroke:rgb(0%,0%,0%);stroke-opacity:1;stroke-miterlimit:4;" d="M 279.669417 -20.51875 C 340.297507 -15.58125 413.001238 -12.61875 478.327146 -18 C 481.731815 -18.28125 485.192707 -18.6125 488.678588 -18.98125 " transform="matrix(0.62529,0,0,0.625,2.566835,47.5)"/>
<path style="fill-rule:nonzero;fill:rgb(0%,0%,0%);fill-opacity:1;stroke-width:1;stroke-linecap:butt;stroke-linejoin:miter;stroke:rgb(0%,0%,0%);stroke-opacity:1;stroke-miterlimit:4;" d="M 488.097608 -25.9625 L 508.812987 -21.48125 L 489.828055 -12.06875 Z M 488.097608 -25.9625 " transform="matrix(0.62529,0,0,0.625,2.566835,47.5)"/>
<g style="fill:rgb(0%,0%,0%);fill-opacity:1;">
  <use xlink:href="#glyph1-1" x="212.558594" y="33.87439"/>
  <use xlink:href="#glyph1-2" x="218.811497" y="33.87439"/>
  <use xlink:href="#glyph1-3" x="222.563238" y="33.87439"/>
  <use xlink:href="#glyph1-4" x="226.94027" y="33.87439"/>
  <use xlink:href="#glyph1-5" x="230.066722" y="33.87439"/>
  <use xlink:href="#glyph1-6" x="234.443754" y="33.87439"/>
  <use xlink:href="#glyph1-7" x="238.195496" y="33.87439"/>
  <use xlink:href="#glyph1-2" x="242.572528" y="33.87439"/>
  <use xlink:href="#glyph1-8" x="246.32427" y="33.87439"/>
  <use xlink:href="#glyph1-9" x="248.825431" y="33.87439"/>
  <use xlink:href="#glyph1-4" x="250.701302" y="33.87439"/>
  <use xlink:href="#glyph1-8" x="253.827753" y="33.87439"/>
  <use xlink:href="#glyph1-10" x="256.328914" y="33.87439"/>
  <use xlink:href="#glyph1-11" x="258.830075" y="33.87439"/>
  <use xlink:href="#glyph1-12" x="265.708269" y="33.87439"/>
  <use xlink:href="#glyph1-13" x="270.085301" y="33.87439"/>
  <use xlink:href="#glyph1-14" x="272.586462" y="33.87439"/>
  <use xlink:href="#glyph1-8" x="276.338204" y="33.87439"/>
  <use xlink:href="#glyph1-10" x="278.839365" y="33.87439"/>
  <use xlink:href="#glyph1-5" x="281.340526" y="33.87439"/>
  <use xlink:href="#glyph1-15" x="285.717558" y="33.87439"/>
</g>
<path style="fill-rule:nonzero;fill:rgb(100%,50.196081%,0%);fill-opacity:1;stroke-width:6;stroke-linecap:butt;stroke-linejoin:miter;stroke:rgb(100%,50.196081%,0%);stroke-opacity:1;stroke-miterlimit:4;" d="M 1132.167208 -36 C 1132.167208 -16.11875 1088.175141 0 1033.912844 0 C 979.6443 0 935.652233 -16.11875 935.652233 -36 C 935.652233 -55.88125 979.6443 -72 1033.912844 -72 C 1088.175141 -72 1132.167208 -55.88125 1132.167208 -36 Z M 1132.167208 -36 " transform="matrix(0.62529,0,0,0.625,2.566835,47.5)"/>
<g style="fill:rgb(0%,0%,0%);fill-opacity:1;">
  <use xlink:href="#glyph0-16" x="599.351563" y="28.874634"/>
  <use xlink:href="#glyph0-23" x="605.604465" y="28.874634"/>
  <use xlink:href="#glyph0-11" x="613.733239" y="28.874634"/>
  <use xlink:href="#glyph0-24" x="620.611432" y="28.874634"/>
  <use xlink:href="#glyph0-5" x="628.740206" y="28.874634"/>
  <use xlink:href="#glyph0-11" x="632.491948" y="28.874634"/>
  <use xlink:href="#glyph0-25" x="639.370141" y="28.874634"/>
  <use xlink:href="#glyph0-26" x="646.248334" y="28.874634"/>
  <use xlink:href="#glyph0-12" x="655.002399" y="28.874634"/>
  <use xlink:href="#glyph0-27" x="663.131172" y="28.874634"/>
  <use xlink:href="#glyph0-10" x="671.885236" y="28.874634"/>
  <use xlink:href="#glyph0-28" x="680.639301" y="28.874634"/>
  <use xlink:href="#glyph0-12" x="685.016333" y="28.874634"/>
  <use xlink:href="#glyph0-13" x="693.145106" y="28.874634"/>
</g>
<path style="fill:none;stroke-width:1;stroke-linecap:butt;stroke-linejoin:miter;stroke:rgb(0%,0%,0%);stroke-opacity:1;stroke-miterlimit:4;" d="M 501.547611 -36 C 448.341074 -36 378.061217 -36 314.097176 -36 " transform="matrix(0.62529,0,0,0.625,2.566835,47.5)"/>
<path style="fill-rule:nonzero;fill:rgb(0%,0%,0%);fill-opacity:1;stroke-width:1;stroke-linecap:butt;stroke-linejoin:miter;stroke:rgb(0%,0%,0%);stroke-opacity:1;stroke-miterlimit:4;" d="M 314.040952 -29 L 294.037743 -36 L 314.040952 -43 Z M 314.040952 -29 " transform="matrix(0.62529,0,0,0.625,2.566835,47.5)"/>
<g style="fill:rgb(0%,0%,0%);fill-opacity:1;">
  <use xlink:href="#glyph1-1" x="206.929688" y="20.74939"/>
  <use xlink:href="#glyph1-2" x="213.18259" y="20.74939"/>
  <use xlink:href="#glyph1-3" x="216.934332" y="20.74939"/>
  <use xlink:href="#glyph1-4" x="221.311364" y="20.74939"/>
  <use xlink:href="#glyph1-5" x="224.437816" y="20.74939"/>
  <use xlink:href="#glyph1-6" x="228.814848" y="20.74939"/>
  <use xlink:href="#glyph1-7" x="232.566589" y="20.74939"/>
  <use xlink:href="#glyph1-2" x="236.943622" y="20.74939"/>
  <use xlink:href="#glyph1-8" x="240.695363" y="20.74939"/>
  <use xlink:href="#glyph1-9" x="243.196524" y="20.74939"/>
  <use xlink:href="#glyph1-16" x="245.072395" y="20.74939"/>
  <use xlink:href="#glyph1-14" x="249.449427" y="20.74939"/>
  <use xlink:href="#glyph1-8" x="253.201169" y="20.74939"/>
  <use xlink:href="#glyph1-14" x="255.70233" y="20.74939"/>
  <use xlink:href="#glyph1-9" x="259.454072" y="20.74939"/>
  <use xlink:href="#glyph1-14" x="261.329943" y="20.74939"/>
  <use xlink:href="#glyph1-17" x="265.081685" y="20.74939"/>
  <use xlink:href="#glyph1-12" x="269.458717" y="20.74939"/>
  <use xlink:href="#glyph1-10" x="273.835749" y="20.74939"/>
  <use xlink:href="#glyph1-4" x="276.33691" y="20.74939"/>
  <use xlink:href="#glyph1-10" x="279.463361" y="20.74939"/>
  <use xlink:href="#glyph1-8" x="281.964523" y="20.74939"/>
  <use xlink:href="#glyph1-10" x="284.465684" y="20.74939"/>
  <use xlink:href="#glyph1-5" x="286.966845" y="20.74939"/>
  <use xlink:href="#glyph1-15" x="291.343877" y="20.74939"/>
</g>
<path style="fill:none;stroke-width:1;stroke-linecap:butt;stroke-linejoin:miter;stroke:rgb(0%,0%,0%);stroke-opacity:1;stroke-miterlimit:4;" d="M 665.227837 -21.6875 C 676.172753 -20.1625 687.292589 -18.85 697.887667 -18 C 791.812792 -10.43125 815.907851 -11.21875 909.889199 -18 C 914.468323 -18.33125 919.141152 -18.73125 923.851464 -19.18125 " transform="matrix(0.62529,0,0,0.625,2.566835,47.5)"/>
<path style="fill-rule:nonzero;fill:rgb(0%,0%,0%);fill-opacity:1;stroke-width:1;stroke-linecap:butt;stroke-linejoin:miter;stroke:rgb(0%,0%,0%);stroke-opacity:1;stroke-miterlimit:4;" d="M 923.339202 -26.16875 L 943.99211 -21.4 L 924.869741 -12.25 Z M 923.339202 -26.16875 " transform="matrix(0.62529,0,0,0.625,2.566835,47.5)"/>
<g style="fill:rgb(0%,0%,0%);fill-opacity:1;">
  <use xlink:href="#glyph1-18" x="453.019531" y="33.87439"/>
  <use xlink:href="#glyph1-5" x="457.396563" y="33.87439"/>
  <use xlink:href="#glyph1-4" x="461.773595" y="33.87439"/>
  <use xlink:href="#glyph1-8" x="464.900047" y="33.87439"/>
  <use xlink:href="#glyph1-19" x="467.401208" y="33.87439"/>
  <use xlink:href="#glyph1-20" x="471.77824" y="33.87439"/>
  <use xlink:href="#glyph1-2" x="474.904691" y="33.87439"/>
  <use xlink:href="#glyph1-4" x="478.656433" y="33.87439"/>
  <use xlink:href="#glyph1-9" x="481.782885" y="33.87439"/>
  <use xlink:href="#glyph1-4" x="483.658756" y="33.87439"/>
  <use xlink:href="#glyph1-8" x="486.785207" y="33.87439"/>
  <use xlink:href="#glyph1-10" x="489.286368" y="33.87439"/>
  <use xlink:href="#glyph1-11" x="491.787529" y="33.87439"/>
  <use xlink:href="#glyph1-12" x="498.665723" y="33.87439"/>
  <use xlink:href="#glyph1-13" x="503.042755" y="33.87439"/>
  <use xlink:href="#glyph1-14" x="505.543916" y="33.87439"/>
  <use xlink:href="#glyph1-8" x="509.295658" y="33.87439"/>
  <use xlink:href="#glyph1-10" x="511.796819" y="33.87439"/>
  <use xlink:href="#glyph1-5" x="514.29798" y="33.87439"/>
  <use xlink:href="#glyph1-15" x="518.675012" y="33.87439"/>
  <use xlink:href="#glyph1-9" x="523.052044" y="33.87439"/>
  <use xlink:href="#glyph1-21" x="524.927915" y="33.87439"/>
  <use xlink:href="#glyph1-22" x="528.054366" y="33.87439"/>
  <use xlink:href="#glyph1-23" x="533.056689" y="33.87439"/>
  <use xlink:href="#glyph1-24" x="538.684301" y="33.87439"/>
  <use xlink:href="#glyph1-25" x="543.686624" y="33.87439"/>
  <use xlink:href="#glyph1-26" x="546.187785" y="33.87439"/>
  <use xlink:href="#glyph1-24" x="549.314236" y="33.87439"/>
  <use xlink:href="#glyph1-27" x="554.316559" y="33.87439"/>
</g>
<path style="fill:none;stroke-width:1;stroke-linecap:butt;stroke-linejoin:miter;stroke:rgb(0%,0%,0%);stroke-opacity:1;stroke-miterlimit:4;" d="M 935.471067 -36 C 863.398293 -36 765.737403 -36 692.121596 -36 " transform="matrix(0.62529,0,0,0.625,2.566835,47.5)"/>
<path style="fill-rule:nonzero;fill:rgb(0%,0%,0%);fill-opacity:1;stroke-width:1;stroke-linecap:butt;stroke-linejoin:miter;stroke:rgb(0%,0%,0%);stroke-opacity:1;stroke-miterlimit:4;" d="M 692.040383 -29 L 672.037174 -36 L 692.040383 -43 Z M 692.040383 -29 " transform="matrix(0.62529,0,0,0.625,2.566835,47.5)"/>
<g style="fill:rgb(0%,0%,0%);fill-opacity:1;">
  <use xlink:href="#glyph1-18" x="446.140625" y="20.74939"/>
  <use xlink:href="#glyph1-5" x="450.517657" y="20.74939"/>
  <use xlink:href="#glyph1-4" x="454.894689" y="20.74939"/>
  <use xlink:href="#glyph1-8" x="458.021141" y="20.74939"/>
  <use xlink:href="#glyph1-19" x="460.522302" y="20.74939"/>
  <use xlink:href="#glyph1-20" x="464.899334" y="20.74939"/>
  <use xlink:href="#glyph1-2" x="468.025785" y="20.74939"/>
  <use xlink:href="#glyph1-4" x="471.777527" y="20.74939"/>
  <use xlink:href="#glyph1-9" x="474.903978" y="20.74939"/>
  <use xlink:href="#glyph1-16" x="476.779849" y="20.74939"/>
  <use xlink:href="#glyph1-14" x="481.156881" y="20.74939"/>
  <use xlink:href="#glyph1-8" x="484.908623" y="20.74939"/>
  <use xlink:href="#glyph1-14" x="487.409784" y="20.74939"/>
  <use xlink:href="#glyph1-9" x="491.161526" y="20.74939"/>
  <use xlink:href="#glyph1-14" x="493.037397" y="20.74939"/>
  <use xlink:href="#glyph1-17" x="496.789139" y="20.74939"/>
  <use xlink:href="#glyph1-12" x="501.166171" y="20.74939"/>
  <use xlink:href="#glyph1-10" x="505.543203" y="20.74939"/>
  <use xlink:href="#glyph1-4" x="508.044364" y="20.74939"/>
  <use xlink:href="#glyph1-10" x="511.170815" y="20.74939"/>
  <use xlink:href="#glyph1-8" x="513.671977" y="20.74939"/>
  <use xlink:href="#glyph1-10" x="516.173138" y="20.74939"/>
  <use xlink:href="#glyph1-10" x="518.674299" y="20.74939"/>
  <use xlink:href="#glyph1-5" x="521.17546" y="20.74939"/>
  <use xlink:href="#glyph1-15" x="525.552492" y="20.74939"/>
  <use xlink:href="#glyph1-9" x="529.929524" y="20.74939"/>
  <use xlink:href="#glyph1-21" x="531.805395" y="20.74939"/>
  <use xlink:href="#glyph1-22" x="534.931847" y="20.74939"/>
  <use xlink:href="#glyph1-23" x="539.934169" y="20.74939"/>
  <use xlink:href="#glyph1-24" x="545.561782" y="20.74939"/>
  <use xlink:href="#glyph1-25" x="550.564104" y="20.74939"/>
  <use xlink:href="#glyph1-26" x="553.065265" y="20.74939"/>
  <use xlink:href="#glyph1-24" x="556.191717" y="20.74939"/>
  <use xlink:href="#glyph1-27" x="561.194039" y="20.74939"/>
</g>
<path style="fill-rule:nonzero;fill:rgb(40.000001%,69.803923%,100%);fill-opacity:1;stroke-width:6;stroke-linecap:butt;stroke-linejoin:miter;stroke:rgb(40.000001%,69.803923%,100%);stroke-opacity:1;stroke-miterlimit:4;" d="M 1713.959484 -36 C 1713.959484 -16.11875 1635.589635 0 1538.90954 0 C 1442.235691 0 1363.859595 -16.11875 1363.859595 -36 C 1363.859595 -55.88125 1442.235691 -72 1538.90954 -72 C 1635.589635 -72 1713.959484 -55.88125 1713.959484 -36 Z M 1713.959484 -36 " transform="matrix(0.62529,0,0,0.625,2.566835,47.5)"/>
<g style="fill:rgb(0%,0%,0%);fill-opacity:1;">
  <use xlink:href="#glyph0-12" x="873.226563" y="28.874634"/>
  <use xlink:href="#glyph0-29" x="881.355336" y="28.874634"/>
  <use xlink:href="#glyph0-30" x="894.486432" y="28.874634"/>
  <use xlink:href="#glyph0-12" x="903.240497" y="28.874634"/>
  <use xlink:href="#glyph0-27" x="911.36927" y="28.874634"/>
  <use xlink:href="#glyph0-27" x="920.123334" y="28.874634"/>
  <use xlink:href="#glyph0-12" x="928.877399" y="28.874634"/>
  <use xlink:href="#glyph0-27" x="937.006172" y="28.874634"/>
  <use xlink:href="#glyph0-5" x="945.760236" y="28.874634"/>
  <use xlink:href="#glyph0-31" x="949.511978" y="28.874634"/>
  <use xlink:href="#glyph0-5" x="958.891333" y="28.874634"/>
  <use xlink:href="#glyph0-25" x="962.643074" y="28.874634"/>
  <use xlink:href="#glyph0-19" x="969.521268" y="28.874634"/>
  <use xlink:href="#glyph0-27" x="978.275332" y="28.874634"/>
  <use xlink:href="#glyph0-12" x="987.029396" y="28.874634"/>
  <use xlink:href="#glyph0-5" x="995.15817" y="28.874634"/>
  <use xlink:href="#glyph0-32" x="998.909911" y="28.874634"/>
  <use xlink:href="#glyph0-10" x="1004.537524" y="28.874634"/>
  <use xlink:href="#glyph0-15" x="1013.291588" y="28.874634"/>
  <use xlink:href="#glyph0-25" x="1022.045652" y="28.874634"/>
  <use xlink:href="#glyph0-16" x="1028.923845" y="28.874634"/>
  <use xlink:href="#glyph0-33" x="1035.176748" y="28.874634"/>
  <use xlink:href="#glyph0-19" x="1038.92849" y="28.874634"/>
  <use xlink:href="#glyph0-15" x="1047.682554" y="28.874634"/>
</g>
<path style="fill:none;stroke-width:1;stroke-linecap:butt;stroke-linejoin:miter;stroke:rgb(0%,0%,0%);stroke-opacity:1;stroke-miterlimit:4;" d="M 1123.639919 -21.23125 C 1134.459894 -19.9 1145.379822 -18.76875 1155.837464 -18 C 1222.787618 -13.08125 1296.428414 -14.83125 1361.098377 -18.7625 " transform="matrix(0.62529,0,0,0.625,2.566835,47.5)"/>
<path style="fill-rule:nonzero;fill:rgb(0%,0%,0%);fill-opacity:1;stroke-width:1;stroke-linecap:butt;stroke-linejoin:miter;stroke:rgb(0%,0%,0%);stroke-opacity:1;stroke-miterlimit:4;" d="M 1360.89847 -25.7625 L 1381.307741 -20.06875 L 1361.810546 -11.7875 Z M 1360.89847 -25.7625 " transform="matrix(0.62529,0,0,0.625,2.566835,47.5)"/>
<g style="fill:rgb(0%,0%,0%);fill-opacity:1;">
  <use xlink:href="#glyph1-4" x="736.871094" y="33.87439"/>
  <use xlink:href="#glyph1-8" x="739.997545" y="33.87439"/>
  <use xlink:href="#glyph1-10" x="742.498706" y="33.87439"/>
  <use xlink:href="#glyph1-11" x="744.999868" y="33.87439"/>
  <use xlink:href="#glyph1-12" x="751.878061" y="33.87439"/>
  <use xlink:href="#glyph1-13" x="756.255093" y="33.87439"/>
  <use xlink:href="#glyph1-14" x="758.756254" y="33.87439"/>
  <use xlink:href="#glyph1-8" x="762.507996" y="33.87439"/>
  <use xlink:href="#glyph1-10" x="765.009157" y="33.87439"/>
  <use xlink:href="#glyph1-5" x="767.510318" y="33.87439"/>
  <use xlink:href="#glyph1-15" x="771.88735" y="33.87439"/>
  <use xlink:href="#glyph1-9" x="776.264382" y="33.87439"/>
  <use xlink:href="#glyph1-21" x="778.140253" y="33.87439"/>
  <use xlink:href="#glyph1-4" x="781.266705" y="33.87439"/>
  <use xlink:href="#glyph1-28" x="784.393156" y="33.87439"/>
  <use xlink:href="#glyph1-14" x="788.770188" y="33.87439"/>
  <use xlink:href="#glyph1-20" x="792.52193" y="33.87439"/>
  <use xlink:href="#glyph1-2" x="795.648381" y="33.87439"/>
  <use xlink:href="#glyph1-16" x="799.400123" y="33.87439"/>
  <use xlink:href="#glyph1-9" x="803.777155" y="33.87439"/>
  <use xlink:href="#glyph1-29" x="805.653026" y="33.87439"/>
  <use xlink:href="#glyph1-30" x="811.905929" y="33.87439"/>
  <use xlink:href="#glyph1-31" x="818.158832" y="33.87439"/>
  <use xlink:href="#glyph1-27" x="825.662315" y="33.87439"/>
</g>
<path style="fill:none;stroke-width:1;stroke-linecap:butt;stroke-linejoin:miter;stroke:rgb(0%,0%,0%);stroke-opacity:1;stroke-miterlimit:4;" d="M 1363.45978 -36 C 1293.710926 -36 1215.278606 -36 1152.432796 -36 " transform="matrix(0.62529,0,0,0.625,2.566835,47.5)"/>
<path style="fill-rule:nonzero;fill:rgb(0%,0%,0%);fill-opacity:1;stroke-width:1;stroke-linecap:butt;stroke-linejoin:miter;stroke:rgb(0%,0%,0%);stroke-opacity:1;stroke-miterlimit:4;" d="M 1152.182912 -29 L 1132.179703 -36 L 1152.182912 -43 Z M 1152.182912 -29 " transform="matrix(0.62529,0,0,0.625,2.566835,47.5)"/>
<g style="fill:rgb(0%,0%,0%);fill-opacity:1;">
  <use xlink:href="#glyph1-16" x="731.242188" y="20.74939"/>
  <use xlink:href="#glyph1-14" x="735.61922" y="20.74939"/>
  <use xlink:href="#glyph1-8" x="739.370961" y="20.74939"/>
  <use xlink:href="#glyph1-14" x="741.872122" y="20.74939"/>
  <use xlink:href="#glyph1-9" x="745.623864" y="20.74939"/>
  <use xlink:href="#glyph1-14" x="747.499735" y="20.74939"/>
  <use xlink:href="#glyph1-17" x="751.251477" y="20.74939"/>
  <use xlink:href="#glyph1-12" x="755.628509" y="20.74939"/>
  <use xlink:href="#glyph1-10" x="760.005541" y="20.74939"/>
  <use xlink:href="#glyph1-4" x="762.506702" y="20.74939"/>
  <use xlink:href="#glyph1-10" x="765.633154" y="20.74939"/>
  <use xlink:href="#glyph1-8" x="768.134315" y="20.74939"/>
  <use xlink:href="#glyph1-10" x="770.635476" y="20.74939"/>
  <use xlink:href="#glyph1-5" x="773.136637" y="20.74939"/>
  <use xlink:href="#glyph1-15" x="777.513669" y="20.74939"/>
  <use xlink:href="#glyph1-9" x="781.890701" y="20.74939"/>
  <use xlink:href="#glyph1-21" x="783.766572" y="20.74939"/>
  <use xlink:href="#glyph1-4" x="786.893024" y="20.74939"/>
  <use xlink:href="#glyph1-28" x="790.019475" y="20.74939"/>
  <use xlink:href="#glyph1-14" x="794.396507" y="20.74939"/>
  <use xlink:href="#glyph1-20" x="798.148249" y="20.74939"/>
  <use xlink:href="#glyph1-2" x="801.2747" y="20.74939"/>
  <use xlink:href="#glyph1-16" x="805.026442" y="20.74939"/>
  <use xlink:href="#glyph1-9" x="809.403474" y="20.74939"/>
  <use xlink:href="#glyph1-29" x="811.279345" y="20.74939"/>
  <use xlink:href="#glyph1-30" x="817.532248" y="20.74939"/>
  <use xlink:href="#glyph1-31" x="823.785151" y="20.74939"/>
  <use xlink:href="#glyph1-27" x="831.288634" y="20.74939"/>
</g>
</g>
</svg>
