<?xml version="1.0" encoding="UTF-8"?>
<svg xmlns="http://www.w3.org/2000/svg" xmlns:xlink="http://www.w3.org/1999/xlink" width="354px" height="283px" viewBox="0 0 354 283" version="1.1">
<defs>
<g>
<symbol overflow="visible" id="glyph0-0">
<path style="stroke:none;" d="M 0.4375 1.546875 L 0.4375 -6.1875 L 4.8125 -6.1875 L 4.8125 1.546875 Z M 0.921875 1.0625 L 4.328125 1.0625 L 4.328125 -5.6875 L 0.921875 -5.6875 Z M 0.921875 1.0625 "/>
</symbol>
<symbol overflow="visible" id="glyph0-1">
<path style="stroke:none;" d="M -0.03125 -6.390625 L 5.375 -6.390625 L 5.375 -5.65625 L 3.109375 -5.65625 L 3.109375 0 L 2.234375 0 L 2.234375 -5.65625 L -0.03125 -5.65625 Z M -0.03125 -6.390625 "/>
</symbol>
<symbol overflow="visible" id="glyph0-2">
<path style="stroke:none;" d="M 4.453125 1.453125 L 4.453125 2.0625 L -0.078125 2.0625 L -0.078125 1.453125 Z M 4.453125 1.453125 "/>
</symbol>
<symbol overflow="visible" id="glyph0-3">
<path style="stroke:none;" d="M 2.671875 -4.234375 C 2.253906 -4.234375 1.921875 -4.066406 1.671875 -3.734375 C 1.429688 -3.410156 1.3125 -2.960938 1.3125 -2.390625 C 1.3125 -1.816406 1.429688 -1.363281 1.671875 -1.03125 C 1.921875 -0.707031 2.253906 -0.546875 2.671875 -0.546875 C 3.097656 -0.546875 3.429688 -0.707031 3.671875 -1.03125 C 3.921875 -1.363281 4.046875 -1.816406 4.046875 -2.390625 C 4.046875 -2.960938 3.921875 -3.410156 3.671875 -3.734375 C 3.429688 -4.066406 3.097656 -4.234375 2.671875 -4.234375 Z M 2.671875 -4.90625 C 3.359375 -4.90625 3.894531 -4.679688 4.28125 -4.234375 C 4.675781 -3.796875 4.875 -3.179688 4.875 -2.390625 C 4.875 -1.609375 4.675781 -0.992188 4.28125 -0.546875 C 3.894531 -0.0976562 3.359375 0.125 2.671875 0.125 C 1.992188 0.125 1.457031 -0.0976562 1.0625 -0.546875 C 0.675781 -0.992188 0.484375 -1.609375 0.484375 -2.390625 C 0.484375 -3.179688 0.675781 -3.796875 1.0625 -4.234375 C 1.457031 -4.679688 1.992188 -4.90625 2.671875 -4.90625 Z M 2.671875 -4.90625 "/>
</symbol>
<symbol overflow="visible" id="glyph0-4">
<path style="stroke:none;" d="M 3.875 -4.65625 L 3.875 -3.90625 C 3.65625 -4.019531 3.425781 -4.101562 3.1875 -4.15625 C 2.945312 -4.21875 2.695312 -4.25 2.4375 -4.25 C 2.050781 -4.25 1.757812 -4.1875 1.5625 -4.0625 C 1.363281 -3.945312 1.265625 -3.769531 1.265625 -3.53125 C 1.265625 -3.34375 1.332031 -3.195312 1.46875 -3.09375 C 1.613281 -2.988281 1.894531 -2.890625 2.3125 -2.796875 L 2.59375 -2.75 C 3.144531 -2.625 3.535156 -2.453125 3.765625 -2.234375 C 4.003906 -2.015625 4.125 -1.710938 4.125 -1.328125 C 4.125 -0.878906 3.945312 -0.523438 3.59375 -0.265625 C 3.25 -0.00390625 2.769531 0.125 2.15625 0.125 C 1.894531 0.125 1.625 0.0976562 1.34375 0.046875 C 1.070312 -0.00390625 0.78125 -0.078125 0.46875 -0.171875 L 0.46875 -0.984375 C 0.757812 -0.835938 1.046875 -0.722656 1.328125 -0.640625 C 1.609375 -0.566406 1.890625 -0.53125 2.171875 -0.53125 C 2.535156 -0.53125 2.816406 -0.59375 3.015625 -0.71875 C 3.222656 -0.851562 3.328125 -1.035156 3.328125 -1.265625 C 3.328125 -1.472656 3.253906 -1.632812 3.109375 -1.75 C 2.960938 -1.863281 2.644531 -1.972656 2.15625 -2.078125 L 1.890625 -2.15625 C 1.398438 -2.25 1.046875 -2.398438 0.828125 -2.609375 C 0.617188 -2.828125 0.515625 -3.125 0.515625 -3.5 C 0.515625 -3.945312 0.671875 -4.289062 0.984375 -4.53125 C 1.304688 -4.78125 1.757812 -4.90625 2.34375 -4.90625 C 2.632812 -4.90625 2.90625 -4.882812 3.15625 -4.84375 C 3.414062 -4.800781 3.65625 -4.738281 3.875 -4.65625 Z M 3.875 -4.65625 "/>
</symbol>
<symbol overflow="visible" id="glyph0-5">
<path style="stroke:none;" d="M 1.609375 -6.15625 L 1.609375 -4.796875 L 3.21875 -4.796875 L 3.21875 -4.1875 L 1.609375 -4.1875 L 1.609375 -1.578125 C 1.609375 -1.191406 1.660156 -0.941406 1.765625 -0.828125 C 1.867188 -0.710938 2.082031 -0.65625 2.40625 -0.65625 L 3.21875 -0.65625 L 3.21875 0 L 2.40625 0 C 1.800781 0 1.382812 -0.113281 1.15625 -0.34375 C 0.925781 -0.570312 0.8125 -0.984375 0.8125 -1.578125 L 0.8125 -4.1875 L 0.234375 -4.1875 L 0.234375 -4.796875 L 0.8125 -4.796875 L 0.8125 -6.15625 Z M 1.609375 -6.15625 "/>
</symbol>
<symbol overflow="visible" id="glyph0-6">
<path style="stroke:none;" d="M 0.828125 -4.796875 L 1.609375 -4.796875 L 1.609375 0 L 0.828125 0 Z M 0.828125 -6.65625 L 1.609375 -6.65625 L 1.609375 -5.65625 L 0.828125 -5.65625 Z M 0.828125 -6.65625 "/>
</symbol>
<symbol overflow="visible" id="glyph0-7">
<path style="stroke:none;" d="M 4.546875 -3.875 C 4.742188 -4.226562 4.976562 -4.488281 5.25 -4.65625 C 5.53125 -4.820312 5.851562 -4.90625 6.21875 -4.90625 C 6.71875 -4.90625 7.101562 -4.726562 7.375 -4.375 C 7.644531 -4.03125 7.78125 -3.535156 7.78125 -2.890625 L 7.78125 0 L 6.984375 0 L 6.984375 -2.875 C 6.984375 -3.332031 6.898438 -3.671875 6.734375 -3.890625 C 6.578125 -4.109375 6.332031 -4.21875 6 -4.21875 C 5.59375 -4.21875 5.269531 -4.082031 5.03125 -3.8125 C 4.800781 -3.539062 4.6875 -3.171875 4.6875 -2.703125 L 4.6875 0 L 3.890625 0 L 3.890625 -2.875 C 3.890625 -3.332031 3.804688 -3.671875 3.640625 -3.890625 C 3.484375 -4.109375 3.234375 -4.21875 2.890625 -4.21875 C 2.492188 -4.21875 2.175781 -4.082031 1.9375 -3.8125 C 1.695312 -3.539062 1.578125 -3.171875 1.578125 -2.703125 L 1.578125 0 L 0.796875 0 L 0.796875 -4.796875 L 1.578125 -4.796875 L 1.578125 -4.046875 C 1.765625 -4.335938 1.984375 -4.550781 2.234375 -4.6875 C 2.484375 -4.832031 2.78125 -4.90625 3.125 -4.90625 C 3.46875 -4.90625 3.757812 -4.816406 4 -4.640625 C 4.25 -4.460938 4.429688 -4.207031 4.546875 -3.875 Z M 4.546875 -3.875 "/>
</symbol>
<symbol overflow="visible" id="glyph0-8">
<path style="stroke:none;" d="M 4.921875 -2.59375 L 4.921875 -2.203125 L 1.296875 -2.203125 C 1.335938 -1.660156 1.503906 -1.25 1.796875 -0.96875 C 2.085938 -0.6875 2.492188 -0.546875 3.015625 -0.546875 C 3.316406 -0.546875 3.609375 -0.582031 3.890625 -0.65625 C 4.171875 -0.726562 4.453125 -0.835938 4.734375 -0.984375 L 4.734375 -0.25 C 4.453125 -0.125 4.160156 -0.03125 3.859375 0.03125 C 3.566406 0.09375 3.269531 0.125 2.96875 0.125 C 2.195312 0.125 1.585938 -0.0976562 1.140625 -0.546875 C 0.703125 -0.992188 0.484375 -1.59375 0.484375 -2.34375 C 0.484375 -3.132812 0.691406 -3.757812 1.109375 -4.21875 C 1.535156 -4.675781 2.109375 -4.90625 2.828125 -4.90625 C 3.472656 -4.90625 3.984375 -4.695312 4.359375 -4.28125 C 4.734375 -3.863281 4.921875 -3.300781 4.921875 -2.59375 Z M 4.125 -2.828125 C 4.125 -3.253906 4.003906 -3.59375 3.765625 -3.84375 C 3.535156 -4.101562 3.226562 -4.234375 2.84375 -4.234375 C 2.394531 -4.234375 2.039062 -4.109375 1.78125 -3.859375 C 1.519531 -3.617188 1.367188 -3.273438 1.328125 -2.828125 Z M 4.125 -2.828125 "/>
</symbol>
<symbol overflow="visible" id="glyph0-9">
<path style="stroke:none;" d="M 3 -2.40625 C 2.363281 -2.40625 1.921875 -2.332031 1.671875 -2.1875 C 1.429688 -2.039062 1.3125 -1.796875 1.3125 -1.453125 C 1.3125 -1.171875 1.398438 -0.945312 1.578125 -0.78125 C 1.765625 -0.613281 2.019531 -0.53125 2.34375 -0.53125 C 2.769531 -0.53125 3.113281 -0.6875 3.375 -1 C 3.644531 -1.3125 3.78125 -1.722656 3.78125 -2.234375 L 3.78125 -2.40625 Z M 4.5625 -2.734375 L 4.5625 0 L 3.78125 0 L 3.78125 -0.734375 C 3.601562 -0.441406 3.378906 -0.222656 3.109375 -0.078125 C 2.835938 0.0546875 2.507812 0.125 2.125 0.125 C 1.632812 0.125 1.242188 -0.0078125 0.953125 -0.28125 C 0.671875 -0.5625 0.53125 -0.929688 0.53125 -1.390625 C 0.53125 -1.929688 0.707031 -2.335938 1.0625 -2.609375 C 1.425781 -2.890625 1.960938 -3.03125 2.671875 -3.03125 L 3.78125 -3.03125 L 3.78125 -3.109375 C 3.78125 -3.460938 3.660156 -3.738281 3.421875 -3.9375 C 3.179688 -4.132812 2.847656 -4.234375 2.421875 -4.234375 C 2.148438 -4.234375 1.882812 -4.203125 1.625 -4.140625 C 1.363281 -4.078125 1.113281 -3.976562 0.875 -3.84375 L 0.875 -4.578125 C 1.164062 -4.691406 1.445312 -4.773438 1.71875 -4.828125 C 1.988281 -4.878906 2.25 -4.90625 2.5 -4.90625 C 3.195312 -4.90625 3.710938 -4.722656 4.046875 -4.359375 C 4.390625 -4.003906 4.5625 -3.460938 4.5625 -2.734375 Z M 4.5625 -2.734375 "/>
</symbol>
<symbol overflow="visible" id="glyph0-10">
<path style="stroke:none;" d="M 4.265625 -2.390625 C 4.265625 -2.972656 4.144531 -3.425781 3.90625 -3.75 C 3.664062 -4.082031 3.335938 -4.25 2.921875 -4.25 C 2.503906 -4.25 2.175781 -4.082031 1.9375 -3.75 C 1.695312 -3.425781 1.578125 -2.972656 1.578125 -2.390625 C 1.578125 -1.816406 1.695312 -1.363281 1.9375 -1.03125 C 2.175781 -0.695312 2.503906 -0.53125 2.921875 -0.53125 C 3.335938 -0.53125 3.664062 -0.695312 3.90625 -1.03125 C 4.144531 -1.363281 4.265625 -1.816406 4.265625 -2.390625 Z M 1.578125 -4.0625 C 1.742188 -4.351562 1.953125 -4.566406 2.203125 -4.703125 C 2.460938 -4.835938 2.765625 -4.90625 3.109375 -4.90625 C 3.691406 -4.90625 4.164062 -4.671875 4.53125 -4.203125 C 4.894531 -3.742188 5.078125 -3.140625 5.078125 -2.390625 C 5.078125 -1.640625 4.894531 -1.03125 4.53125 -0.5625 C 4.164062 -0.101562 3.691406 0.125 3.109375 0.125 C 2.765625 0.125 2.460938 0.0546875 2.203125 -0.078125 C 1.953125 -0.222656 1.742188 -0.4375 1.578125 -0.71875 L 1.578125 0 L 0.796875 0 L 0.796875 -6.65625 L 1.578125 -6.65625 Z M 1.578125 -4.0625 "/>
</symbol>
<symbol overflow="visible" id="glyph0-11">
<path style="stroke:none;" d="M 0.828125 -6.65625 L 1.609375 -6.65625 L 1.609375 0 L 0.828125 0 Z M 0.828125 -6.65625 "/>
</symbol>
<symbol overflow="visible" id="glyph0-12">
<path style="stroke:none;" d="M 1.71875 -5.671875 L 1.71875 -0.703125 L 2.765625 -0.703125 C 3.640625 -0.703125 4.28125 -0.898438 4.6875 -1.296875 C 5.101562 -1.703125 5.3125 -2.335938 5.3125 -3.203125 C 5.3125 -4.054688 5.101562 -4.679688 4.6875 -5.078125 C 4.28125 -5.472656 3.640625 -5.671875 2.765625 -5.671875 Z M 0.859375 -6.390625 L 2.625 -6.390625 C 3.863281 -6.390625 4.769531 -6.128906 5.34375 -5.609375 C 5.925781 -5.097656 6.21875 -4.296875 6.21875 -3.203125 C 6.21875 -2.097656 5.925781 -1.285156 5.34375 -0.765625 C 4.769531 -0.253906 3.863281 0 2.625 0 L 0.859375 0 Z M 0.859375 -6.390625 "/>
</symbol>
<symbol overflow="visible" id="glyph0-13">
<path style="stroke:none;" d="M 4.265625 -4.609375 L 4.265625 -3.875 C 4.046875 -4 3.820312 -4.085938 3.59375 -4.140625 C 3.375 -4.203125 3.148438 -4.234375 2.921875 -4.234375 C 2.410156 -4.234375 2.015625 -4.070312 1.734375 -3.75 C 1.453125 -3.425781 1.3125 -2.972656 1.3125 -2.390625 C 1.3125 -1.804688 1.453125 -1.351562 1.734375 -1.03125 C 2.015625 -0.707031 2.410156 -0.546875 2.921875 -0.546875 C 3.148438 -0.546875 3.375 -0.578125 3.59375 -0.640625 C 3.820312 -0.703125 4.046875 -0.789062 4.265625 -0.90625 L 4.265625 -0.1875 C 4.046875 -0.0820312 3.816406 -0.00390625 3.578125 0.046875 C 3.347656 0.0976562 3.101562 0.125 2.84375 0.125 C 2.113281 0.125 1.535156 -0.0976562 1.109375 -0.546875 C 0.691406 -1.003906 0.484375 -1.617188 0.484375 -2.390625 C 0.484375 -3.171875 0.695312 -3.785156 1.125 -4.234375 C 1.550781 -4.679688 2.140625 -4.90625 2.890625 -4.90625 C 3.128906 -4.90625 3.363281 -4.878906 3.59375 -4.828125 C 3.820312 -4.785156 4.046875 -4.710938 4.265625 -4.609375 Z M 4.265625 -4.609375 "/>
</symbol>
<symbol overflow="visible" id="glyph0-14">
<path style="stroke:none;" d=""/>
</symbol>
<symbol overflow="visible" id="glyph0-15">
<path style="stroke:none;" d="M 3.453125 -5.796875 C 2.828125 -5.796875 2.328125 -5.5625 1.953125 -5.09375 C 1.585938 -4.632812 1.40625 -4 1.40625 -3.1875 C 1.40625 -2.382812 1.585938 -1.75 1.953125 -1.28125 C 2.328125 -0.8125 2.828125 -0.578125 3.453125 -0.578125 C 4.078125 -0.578125 4.570312 -0.8125 4.9375 -1.28125 C 5.300781 -1.75 5.484375 -2.382812 5.484375 -3.1875 C 5.484375 -4 5.300781 -4.632812 4.9375 -5.09375 C 4.570312 -5.5625 4.078125 -5.796875 3.453125 -5.796875 Z M 3.453125 -6.5 C 4.347656 -6.5 5.0625 -6.195312 5.59375 -5.59375 C 6.125 -5 6.390625 -4.195312 6.390625 -3.1875 C 6.390625 -2.175781 6.125 -1.367188 5.59375 -0.765625 C 5.0625 -0.171875 4.347656 0.125 3.453125 0.125 C 2.554688 0.125 1.835938 -0.171875 1.296875 -0.765625 C 0.753906 -1.367188 0.484375 -2.175781 0.484375 -3.1875 C 0.484375 -4.195312 0.753906 -5 1.296875 -5.59375 C 1.835938 -6.195312 2.554688 -6.5 3.453125 -6.5 Z M 3.453125 -6.5 "/>
</symbol>
<symbol overflow="visible" id="glyph0-16">
<path style="stroke:none;" d="M 4.6875 -6.1875 L 4.6875 -5.34375 C 4.351562 -5.5 4.039062 -5.613281 3.75 -5.6875 C 3.457031 -5.757812 3.175781 -5.796875 2.90625 -5.796875 C 2.4375 -5.796875 2.070312 -5.703125 1.8125 -5.515625 C 1.5625 -5.335938 1.4375 -5.082031 1.4375 -4.75 C 1.4375 -4.46875 1.519531 -4.253906 1.6875 -4.109375 C 1.863281 -3.960938 2.1875 -3.847656 2.65625 -3.765625 L 3.1875 -3.65625 C 3.832031 -3.53125 4.304688 -3.3125 4.609375 -3 C 4.910156 -2.695312 5.0625 -2.285156 5.0625 -1.765625 C 5.0625 -1.140625 4.851562 -0.664062 4.4375 -0.34375 C 4.03125 -0.03125 3.425781 0.125 2.625 0.125 C 2.320312 0.125 2 0.0859375 1.65625 0.015625 C 1.320312 -0.046875 0.972656 -0.144531 0.609375 -0.28125 L 0.609375 -1.171875 C 0.953125 -0.972656 1.289062 -0.820312 1.625 -0.71875 C 1.96875 -0.625 2.300781 -0.578125 2.625 -0.578125 C 3.113281 -0.578125 3.492188 -0.671875 3.765625 -0.859375 C 4.035156 -1.054688 4.171875 -1.335938 4.171875 -1.703125 C 4.171875 -2.015625 4.070312 -2.257812 3.875 -2.4375 C 3.6875 -2.613281 3.375 -2.742188 2.9375 -2.828125 L 2.40625 -2.9375 C 1.757812 -3.0625 1.289062 -3.257812 1 -3.53125 C 0.71875 -3.8125 0.578125 -4.195312 0.578125 -4.6875 C 0.578125 -5.25 0.773438 -5.691406 1.171875 -6.015625 C 1.566406 -6.335938 2.113281 -6.5 2.8125 -6.5 C 3.113281 -6.5 3.421875 -6.472656 3.734375 -6.421875 C 4.046875 -6.367188 4.363281 -6.289062 4.6875 -6.1875 Z M 4.6875 -6.1875 "/>
</symbol>
<symbol overflow="visible" id="glyph0-17">
<path style="stroke:none;" d="M 0.859375 -6.390625 L 1.71875 -6.390625 L 1.71875 0 L 0.859375 0 Z M 0.859375 -6.390625 "/>
</symbol>
<symbol overflow="visible" id="glyph0-18">
<path style="stroke:none;" d="M 4.796875 -2.890625 L 4.796875 0 L 4.015625 0 L 4.015625 -2.875 C 4.015625 -3.320312 3.925781 -3.65625 3.75 -3.875 C 3.570312 -4.101562 3.304688 -4.21875 2.953125 -4.21875 C 2.523438 -4.21875 2.1875 -4.082031 1.9375 -3.8125 C 1.695312 -3.539062 1.578125 -3.171875 1.578125 -2.703125 L 1.578125 0 L 0.796875 0 L 0.796875 -4.796875 L 1.578125 -4.796875 L 1.578125 -4.046875 C 1.765625 -4.335938 1.984375 -4.550781 2.234375 -4.6875 C 2.492188 -4.832031 2.789062 -4.90625 3.125 -4.90625 C 3.675781 -4.90625 4.09375 -4.734375 4.375 -4.390625 C 4.65625 -4.054688 4.796875 -3.554688 4.796875 -2.890625 Z M 4.796875 -2.890625 "/>
</symbol>
<symbol overflow="visible" id="glyph0-19">
<path style="stroke:none;" d="M 3.96875 -4.0625 L 3.96875 -6.65625 L 4.765625 -6.65625 L 4.765625 0 L 3.96875 0 L 3.96875 -0.71875 C 3.800781 -0.4375 3.59375 -0.222656 3.34375 -0.078125 C 3.09375 0.0546875 2.789062 0.125 2.4375 0.125 C 1.863281 0.125 1.394531 -0.101562 1.03125 -0.5625 C 0.664062 -1.03125 0.484375 -1.640625 0.484375 -2.390625 C 0.484375 -3.140625 0.664062 -3.742188 1.03125 -4.203125 C 1.394531 -4.671875 1.863281 -4.90625 2.4375 -4.90625 C 2.789062 -4.90625 3.09375 -4.835938 3.34375 -4.703125 C 3.59375 -4.566406 3.800781 -4.351562 3.96875 -4.0625 Z M 1.296875 -2.390625 C 1.296875 -1.816406 1.414062 -1.363281 1.65625 -1.03125 C 1.894531 -0.695312 2.21875 -0.53125 2.625 -0.53125 C 3.039062 -0.53125 3.367188 -0.695312 3.609375 -1.03125 C 3.847656 -1.363281 3.96875 -1.816406 3.96875 -2.390625 C 3.96875 -2.972656 3.847656 -3.425781 3.609375 -3.75 C 3.367188 -4.082031 3.039062 -4.25 2.625 -4.25 C 2.21875 -4.25 1.894531 -4.082031 1.65625 -3.75 C 1.414062 -3.425781 1.296875 -2.972656 1.296875 -2.390625 Z M 1.296875 -2.390625 "/>
</symbol>
<symbol overflow="visible" id="glyph0-20">
<path style="stroke:none;" d="M 3.25 -6.65625 L 3.25 -6 L 2.5 -6 C 2.21875 -6 2.019531 -5.941406 1.90625 -5.828125 C 1.800781 -5.710938 1.75 -5.507812 1.75 -5.21875 L 1.75 -4.796875 L 3.03125 -4.796875 L 3.03125 -4.1875 L 1.75 -4.1875 L 1.75 0 L 0.953125 0 L 0.953125 -4.1875 L 0.203125 -4.1875 L 0.203125 -4.796875 L 0.953125 -4.796875 L 0.953125 -5.125 C 0.953125 -5.65625 1.078125 -6.039062 1.328125 -6.28125 C 1.578125 -6.53125 1.96875 -6.65625 2.5 -6.65625 Z M 3.25 -6.65625 "/>
</symbol>
<symbol overflow="visible" id="glyph0-21">
<path style="stroke:none;" d="M 1.03125 -1.09375 L 1.921875 -1.09375 L 1.921875 0 L 1.03125 0 Z M 1.03125 -4.53125 L 1.921875 -4.53125 L 1.921875 -3.453125 L 1.03125 -3.453125 Z M 1.03125 -4.53125 "/>
</symbol>
<symbol overflow="visible" id="glyph0-22">
<path style="stroke:none;" d=""/>
</symbol>
<symbol overflow="visible" id="glyph0-23">
<path style="stroke:none;" d="M 2.78125 -5.828125 C 2.332031 -5.828125 1.992188 -5.601562 1.765625 -5.15625 C 1.546875 -4.71875 1.4375 -4.0625 1.4375 -3.1875 C 1.4375 -2.3125 1.546875 -1.65625 1.765625 -1.21875 C 1.992188 -0.78125 2.332031 -0.5625 2.78125 -0.5625 C 3.226562 -0.5625 3.5625 -0.78125 3.78125 -1.21875 C 4.007812 -1.65625 4.125 -2.3125 4.125 -3.1875 C 4.125 -4.0625 4.007812 -4.71875 3.78125 -5.15625 C 3.5625 -5.601562 3.226562 -5.828125 2.78125 -5.828125 Z M 2.78125 -6.5 C 3.5 -6.5 4.046875 -6.21875 4.421875 -5.65625 C 4.796875 -5.09375 4.984375 -4.269531 4.984375 -3.1875 C 4.984375 -2.113281 4.796875 -1.289062 4.421875 -0.71875 C 4.046875 -0.15625 3.5 0.125 2.78125 0.125 C 2.0625 0.125 1.515625 -0.15625 1.140625 -0.71875 C 0.765625 -1.289062 0.578125 -2.113281 0.578125 -3.1875 C 0.578125 -4.269531 0.765625 -5.09375 1.140625 -5.65625 C 1.515625 -6.21875 2.0625 -6.5 2.78125 -6.5 Z M 2.78125 -6.5 "/>
</symbol>
<symbol overflow="visible" id="glyph0-24">
<path style="stroke:none;" d="M 3.59375 -4.0625 C 3.507812 -4.113281 3.414062 -4.148438 3.3125 -4.171875 C 3.207031 -4.191406 3.09375 -4.203125 2.96875 -4.203125 C 2.519531 -4.203125 2.175781 -4.054688 1.9375 -3.765625 C 1.695312 -3.484375 1.578125 -3.070312 1.578125 -2.53125 L 1.578125 0 L 0.796875 0 L 0.796875 -4.796875 L 1.578125 -4.796875 L 1.578125 -4.046875 C 1.742188 -4.335938 1.957031 -4.550781 2.21875 -4.6875 C 2.488281 -4.832031 2.816406 -4.90625 3.203125 -4.90625 C 3.253906 -4.90625 3.3125 -4.898438 3.375 -4.890625 C 3.4375 -4.890625 3.507812 -4.878906 3.59375 -4.859375 Z M 3.59375 -4.0625 "/>
</symbol>
<symbol overflow="visible" id="glyph0-25">
<path style="stroke:none;" d="M 2.8125 0.4375 C 2.59375 1.007812 2.375 1.382812 2.15625 1.5625 C 1.945312 1.738281 1.664062 1.828125 1.3125 1.828125 L 0.6875 1.828125 L 0.6875 1.171875 L 1.15625 1.171875 C 1.375 1.171875 1.539062 1.117188 1.65625 1.015625 C 1.78125 0.910156 1.914062 0.664062 2.0625 0.28125 L 2.203125 -0.078125 L 0.265625 -4.796875 L 1.09375 -4.796875 L 2.59375 -1.046875 L 4.078125 -4.796875 L 4.921875 -4.796875 Z M 2.8125 0.4375 "/>
</symbol>
<symbol overflow="visible" id="glyph0-26">
<path style="stroke:none;" d="M 2.125 -3.4375 C 1.863281 -3.207031 1.671875 -2.976562 1.546875 -2.75 C 1.429688 -2.519531 1.375 -2.28125 1.375 -2.03125 C 1.375 -1.613281 1.523438 -1.265625 1.828125 -0.984375 C 2.128906 -0.703125 2.507812 -0.5625 2.96875 -0.5625 C 3.238281 -0.5625 3.488281 -0.609375 3.71875 -0.703125 C 3.957031 -0.796875 4.179688 -0.929688 4.390625 -1.109375 Z M 2.734375 -3.921875 L 4.90625 -1.6875 C 5.070312 -1.945312 5.203125 -2.21875 5.296875 -2.5 C 5.390625 -2.789062 5.441406 -3.097656 5.453125 -3.421875 L 6.25 -3.421875 C 6.21875 -3.046875 6.128906 -2.675781 5.984375 -2.3125 C 5.835938 -1.945312 5.628906 -1.582031 5.359375 -1.21875 L 6.546875 0 L 5.484375 0 L 4.859375 -0.625 C 4.566406 -0.375 4.257812 -0.1875 3.9375 -0.0625 C 3.613281 0.0625 3.265625 0.125 2.890625 0.125 C 2.203125 0.125 1.640625 -0.0664062 1.203125 -0.453125 C 0.765625 -0.847656 0.546875 -1.351562 0.546875 -1.96875 C 0.546875 -2.332031 0.640625 -2.675781 0.828125 -3 C 1.023438 -3.320312 1.316406 -3.625 1.703125 -3.90625 C 1.554688 -4.082031 1.445312 -4.257812 1.375 -4.4375 C 1.3125 -4.625 1.28125 -4.800781 1.28125 -4.96875 C 1.28125 -5.425781 1.4375 -5.796875 1.75 -6.078125 C 2.0625 -6.359375 2.484375 -6.5 3.015625 -6.5 C 3.242188 -6.5 3.476562 -6.472656 3.71875 -6.421875 C 3.957031 -6.378906 4.195312 -6.304688 4.4375 -6.203125 L 4.4375 -5.421875 C 4.1875 -5.554688 3.945312 -5.65625 3.71875 -5.71875 C 3.5 -5.789062 3.289062 -5.828125 3.09375 -5.828125 C 2.800781 -5.828125 2.5625 -5.75 2.375 -5.59375 C 2.1875 -5.4375 2.09375 -5.234375 2.09375 -4.984375 C 2.09375 -4.835938 2.132812 -4.6875 2.21875 -4.53125 C 2.300781 -4.382812 2.472656 -4.179688 2.734375 -3.921875 Z M 2.734375 -3.921875 "/>
</symbol>
<symbol overflow="visible" id="glyph0-27">
<path style="stroke:none;" d="M 0.75 -6.65625 L 2.5625 -6.65625 L 2.5625 -6.046875 L 1.53125 -6.046875 L 1.53125 0.546875 L 2.5625 0.546875 L 2.5625 1.15625 L 0.75 1.15625 Z M 0.75 -6.65625 "/>
</symbol>
<symbol overflow="visible" id="glyph0-28">
<path style="stroke:none;" d="M 2.65625 -6.65625 L 2.65625 1.15625 L 0.84375 1.15625 L 0.84375 0.546875 L 1.875 0.546875 L 1.875 -6.046875 L 0.84375 -6.046875 L 0.84375 -6.65625 Z M 2.65625 -6.65625 "/>
</symbol>
<symbol overflow="visible" id="glyph0-29">
<path style="stroke:none;" d="M 1.578125 -0.71875 L 1.578125 1.828125 L 0.796875 1.828125 L 0.796875 -4.796875 L 1.578125 -4.796875 L 1.578125 -4.0625 C 1.742188 -4.351562 1.953125 -4.566406 2.203125 -4.703125 C 2.460938 -4.835938 2.765625 -4.90625 3.109375 -4.90625 C 3.691406 -4.90625 4.164062 -4.671875 4.53125 -4.203125 C 4.894531 -3.742188 5.078125 -3.140625 5.078125 -2.390625 C 5.078125 -1.640625 4.894531 -1.03125 4.53125 -0.5625 C 4.164062 -0.101562 3.691406 0.125 3.109375 0.125 C 2.765625 0.125 2.460938 0.0546875 2.203125 -0.078125 C 1.953125 -0.222656 1.742188 -0.4375 1.578125 -0.71875 Z M 4.265625 -2.390625 C 4.265625 -2.972656 4.144531 -3.425781 3.90625 -3.75 C 3.664062 -4.082031 3.335938 -4.25 2.921875 -4.25 C 2.503906 -4.25 2.175781 -4.082031 1.9375 -3.75 C 1.695312 -3.425781 1.578125 -2.972656 1.578125 -2.390625 C 1.578125 -1.816406 1.695312 -1.363281 1.9375 -1.03125 C 2.175781 -0.695312 2.503906 -0.53125 2.921875 -0.53125 C 3.335938 -0.53125 3.664062 -0.695312 3.90625 -1.03125 C 4.144531 -1.363281 4.265625 -1.816406 4.265625 -2.390625 Z M 4.265625 -2.390625 "/>
</symbol>
<symbol overflow="visible" id="glyph0-30">
<path style="stroke:none;" d="M 0.859375 -6.390625 L 2.140625 -6.390625 L 3.765625 -2.046875 L 5.40625 -6.390625 L 6.6875 -6.390625 L 6.6875 0 L 5.859375 0 L 5.859375 -5.609375 L 4.203125 -1.234375 L 3.34375 -1.234375 L 1.703125 -5.609375 L 1.703125 0 L 0.859375 0 Z M 0.859375 -6.390625 "/>
</symbol>
<symbol overflow="visible" id="glyph0-31">
<path style="stroke:none;" d="M 3.890625 -3 C 4.066406 -2.9375 4.242188 -2.800781 4.421875 -2.59375 C 4.597656 -2.382812 4.773438 -2.101562 4.953125 -1.75 L 5.828125 0 L 4.90625 0 L 4.078125 -1.640625 C 3.867188 -2.066406 3.664062 -2.347656 3.46875 -2.484375 C 3.269531 -2.628906 3 -2.703125 2.65625 -2.703125 L 1.71875 -2.703125 L 1.71875 0 L 0.859375 0 L 0.859375 -6.390625 L 2.8125 -6.390625 C 3.539062 -6.390625 4.082031 -6.234375 4.4375 -5.921875 C 4.800781 -5.617188 4.984375 -5.160156 4.984375 -4.546875 C 4.984375 -4.148438 4.890625 -3.816406 4.703125 -3.546875 C 4.515625 -3.285156 4.242188 -3.101562 3.890625 -3 Z M 1.71875 -5.671875 L 1.71875 -3.40625 L 2.8125 -3.40625 C 3.226562 -3.40625 3.539062 -3.5 3.75 -3.6875 C 3.957031 -3.882812 4.0625 -4.171875 4.0625 -4.546875 C 4.0625 -4.921875 3.957031 -5.203125 3.75 -5.390625 C 3.539062 -5.578125 3.226562 -5.671875 2.8125 -5.671875 Z M 1.71875 -5.671875 "/>
</symbol>
<symbol overflow="visible" id="glyph0-32">
<path style="stroke:none;" d="M 0.765625 -6.390625 L 1.625 -6.390625 L 1.625 -2.515625 C 1.625 -1.828125 1.75 -1.332031 2 -1.03125 C 2.25 -0.726562 2.648438 -0.578125 3.203125 -0.578125 C 3.753906 -0.578125 4.15625 -0.726562 4.40625 -1.03125 C 4.65625 -1.332031 4.78125 -1.828125 4.78125 -2.515625 L 4.78125 -6.390625 L 5.640625 -6.390625 L 5.640625 -2.40625 C 5.640625 -1.570312 5.429688 -0.941406 5.015625 -0.515625 C 4.609375 -0.0859375 4.003906 0.125 3.203125 0.125 C 2.398438 0.125 1.789062 -0.0859375 1.375 -0.515625 C 0.96875 -0.941406 0.765625 -1.570312 0.765625 -2.40625 Z M 0.765625 -6.390625 "/>
</symbol>
<symbol overflow="visible" id="glyph0-33">
<path style="stroke:none;" d="M 0.859375 -6.390625 L 2.015625 -6.390625 L 4.84375 -1.046875 L 4.84375 -6.390625 L 5.6875 -6.390625 L 5.6875 0 L 4.53125 0 L 1.703125 -5.34375 L 1.703125 0 L 0.859375 0 Z M 0.859375 -6.390625 "/>
</symbol>
<symbol overflow="visible" id="glyph0-34">
<path style="stroke:none;" d="M 0.796875 -6.65625 L 1.578125 -6.65625 L 1.578125 -2.71875 L 3.9375 -4.796875 L 4.9375 -4.796875 L 2.390625 -2.546875 L 5.046875 0 L 4.015625 0 L 1.578125 -2.34375 L 1.578125 0 L 0.796875 0 Z M 0.796875 -6.65625 "/>
</symbol>
<symbol overflow="visible" id="glyph0-35">
<path style="stroke:none;" d="M 2.71875 -6.65625 C 2.332031 -6 2.046875 -5.347656 1.859375 -4.703125 C 1.671875 -4.054688 1.578125 -3.40625 1.578125 -2.75 C 1.578125 -2.09375 1.671875 -1.441406 1.859375 -0.796875 C 2.046875 -0.148438 2.332031 0.5 2.71875 1.15625 L 2.03125 1.15625 C 1.601562 0.488281 1.28125 -0.164062 1.0625 -0.8125 C 0.851562 -1.46875 0.75 -2.113281 0.75 -2.75 C 0.75 -3.382812 0.851562 -4.023438 1.0625 -4.671875 C 1.28125 -5.316406 1.601562 -5.976562 2.03125 -6.65625 Z M 2.71875 -6.65625 "/>
</symbol>
<symbol overflow="visible" id="glyph0-36">
<path style="stroke:none;" d="M 3.96875 -2.453125 C 3.96875 -3.023438 3.847656 -3.46875 3.609375 -3.78125 C 3.378906 -4.09375 3.050781 -4.25 2.625 -4.25 C 2.207031 -4.25 1.878906 -4.09375 1.640625 -3.78125 C 1.410156 -3.46875 1.296875 -3.023438 1.296875 -2.453125 C 1.296875 -1.878906 1.410156 -1.4375 1.640625 -1.125 C 1.878906 -0.8125 2.207031 -0.65625 2.625 -0.65625 C 3.050781 -0.65625 3.378906 -0.8125 3.609375 -1.125 C 3.847656 -1.4375 3.96875 -1.878906 3.96875 -2.453125 Z M 4.765625 -0.59375 C 4.765625 0.21875 4.582031 0.820312 4.21875 1.21875 C 3.851562 1.625 3.300781 1.828125 2.5625 1.828125 C 2.28125 1.828125 2.015625 1.804688 1.765625 1.765625 C 1.523438 1.722656 1.289062 1.660156 1.0625 1.578125 L 1.0625 0.796875 C 1.289062 0.929688 1.515625 1.023438 1.734375 1.078125 C 1.960938 1.140625 2.195312 1.171875 2.4375 1.171875 C 2.945312 1.171875 3.328125 1.035156 3.578125 0.765625 C 3.835938 0.492188 3.96875 0.0859375 3.96875 -0.453125 L 3.96875 -0.84375 C 3.8125 -0.5625 3.601562 -0.347656 3.34375 -0.203125 C 3.09375 -0.0664062 2.789062 0 2.4375 0 C 1.851562 0 1.378906 -0.222656 1.015625 -0.671875 C 0.660156 -1.117188 0.484375 -1.710938 0.484375 -2.453125 C 0.484375 -3.191406 0.660156 -3.785156 1.015625 -4.234375 C 1.378906 -4.679688 1.851562 -4.90625 2.4375 -4.90625 C 2.789062 -4.90625 3.09375 -4.832031 3.34375 -4.6875 C 3.601562 -4.550781 3.8125 -4.34375 3.96875 -4.0625 L 3.96875 -4.796875 L 4.765625 -4.796875 Z M 4.765625 -0.59375 "/>
</symbol>
<symbol overflow="visible" id="glyph0-37">
<path style="stroke:none;" d="M 1.71875 -5.671875 L 1.71875 -3.28125 L 2.8125 -3.28125 C 3.207031 -3.28125 3.515625 -3.382812 3.734375 -3.59375 C 3.953125 -3.800781 4.0625 -4.097656 4.0625 -4.484375 C 4.0625 -4.867188 3.953125 -5.160156 3.734375 -5.359375 C 3.515625 -5.566406 3.207031 -5.671875 2.8125 -5.671875 Z M 0.859375 -6.390625 L 2.8125 -6.390625 C 3.519531 -6.390625 4.054688 -6.226562 4.421875 -5.90625 C 4.796875 -5.582031 4.984375 -5.109375 4.984375 -4.484375 C 4.984375 -3.847656 4.796875 -3.367188 4.421875 -3.046875 C 4.054688 -2.722656 3.519531 -2.5625 2.8125 -2.5625 L 1.71875 -2.5625 L 1.71875 0 L 0.859375 0 Z M 0.859375 -6.390625 "/>
</symbol>
<symbol overflow="visible" id="glyph0-38">
<path style="stroke:none;" d="M 0.703125 -6.65625 L 1.390625 -6.65625 C 1.816406 -5.976562 2.132812 -5.316406 2.34375 -4.671875 C 2.550781 -4.023438 2.65625 -3.382812 2.65625 -2.75 C 2.65625 -2.113281 2.550781 -1.46875 2.34375 -0.8125 C 2.132812 -0.164062 1.816406 0.488281 1.390625 1.15625 L 0.703125 1.15625 C 1.078125 0.5 1.359375 -0.148438 1.546875 -0.796875 C 1.734375 -1.441406 1.828125 -2.09375 1.828125 -2.75 C 1.828125 -3.40625 1.734375 -4.054688 1.546875 -4.703125 C 1.359375 -5.347656 1.078125 -6 0.703125 -6.65625 Z M 0.703125 -6.65625 "/>
</symbol>
<symbol overflow="visible" id="glyph0-39">
<path style="stroke:none;" d="M 2.984375 -5.53125 L 1.8125 -2.359375 L 4.171875 -2.359375 Z M 2.5 -6.390625 L 3.484375 -6.390625 L 5.90625 0 L 5.015625 0 L 4.4375 -1.640625 L 1.5625 -1.640625 L 0.984375 0 L 0.0625 0 Z M 2.5 -6.390625 "/>
</symbol>
<symbol overflow="visible" id="glyph0-40">
<path style="stroke:none;" d="M 4.796875 -2.890625 L 4.796875 0 L 4.015625 0 L 4.015625 -2.875 C 4.015625 -3.320312 3.925781 -3.65625 3.75 -3.875 C 3.570312 -4.101562 3.304688 -4.21875 2.953125 -4.21875 C 2.523438 -4.21875 2.1875 -4.082031 1.9375 -3.8125 C 1.695312 -3.539062 1.578125 -3.171875 1.578125 -2.703125 L 1.578125 0 L 0.796875 0 L 0.796875 -6.65625 L 1.578125 -6.65625 L 1.578125 -4.046875 C 1.765625 -4.335938 1.984375 -4.550781 2.234375 -4.6875 C 2.492188 -4.832031 2.789062 -4.90625 3.125 -4.90625 C 3.675781 -4.90625 4.09375 -4.734375 4.375 -4.390625 C 4.65625 -4.054688 4.796875 -3.554688 4.796875 -2.890625 Z M 4.796875 -2.890625 "/>
</symbol>
<symbol overflow="visible" id="glyph0-41">
<path style="stroke:none;" d="M 1.671875 -0.734375 L 4.6875 -0.734375 L 4.6875 0 L 0.640625 0 L 0.640625 -0.734375 C 0.960938 -1.066406 1.40625 -1.519531 1.96875 -2.09375 C 2.539062 -2.664062 2.898438 -3.035156 3.046875 -3.203125 C 3.316406 -3.515625 3.507812 -3.773438 3.625 -3.984375 C 3.738281 -4.203125 3.796875 -4.414062 3.796875 -4.625 C 3.796875 -4.96875 3.675781 -5.242188 3.4375 -5.453125 C 3.195312 -5.671875 2.882812 -5.78125 2.5 -5.78125 C 2.226562 -5.78125 1.941406 -5.734375 1.640625 -5.640625 C 1.347656 -5.546875 1.03125 -5.398438 0.6875 -5.203125 L 0.6875 -6.078125 C 1.03125 -6.222656 1.351562 -6.328125 1.65625 -6.390625 C 1.957031 -6.460938 2.234375 -6.5 2.484375 -6.5 C 3.148438 -6.5 3.675781 -6.332031 4.0625 -6 C 4.457031 -5.675781 4.65625 -5.238281 4.65625 -4.6875 C 4.65625 -4.414062 4.601562 -4.160156 4.5 -3.921875 C 4.40625 -3.691406 4.226562 -3.421875 3.96875 -3.109375 C 3.894531 -3.023438 3.664062 -2.785156 3.28125 -2.390625 C 2.90625 -1.992188 2.367188 -1.441406 1.671875 -0.734375 Z M 1.671875 -0.734375 "/>
</symbol>
<symbol overflow="visible" id="glyph0-42">
<path style="stroke:none;" d="M 1.078125 -0.734375 L 2.5 -0.734375 L 2.5 -5.609375 L 0.96875 -5.296875 L 0.96875 -6.078125 L 2.484375 -6.390625 L 3.34375 -6.390625 L 3.34375 -0.734375 L 4.765625 -0.734375 L 4.765625 0 L 1.078125 0 Z M 1.078125 -0.734375 "/>
</symbol>
<symbol overflow="visible" id="glyph0-43">
<path style="stroke:none;" d="M 0.9375 -1.09375 L 1.84375 -1.09375 L 1.84375 0 L 0.9375 0 Z M 0.9375 -1.09375 "/>
</symbol>
<symbol overflow="visible" id="glyph0-44">
<path style="stroke:none;" d="M 0.265625 -4.796875 L 1.09375 -4.796875 L 2.59375 -0.765625 L 4.078125 -4.796875 L 4.921875 -4.796875 L 3.125 0 L 2.0625 0 Z M 0.265625 -4.796875 "/>
</symbol>
<symbol overflow="visible" id="glyph0-45">
<path style="stroke:none;" d="M 0.921875 -3.984375 L 6.40625 -3.984375 L 6.40625 -3.265625 L 0.921875 -3.265625 Z M 0.921875 -2.234375 L 6.40625 -2.234375 L 6.40625 -1.5 L 0.921875 -1.5 Z M 0.921875 -2.234375 "/>
</symbol>
<symbol overflow="visible" id="glyph0-46">
<path style="stroke:none;" d="M 1.03125 -4.53125 L 1.921875 -4.53125 L 1.921875 -3.453125 L 1.03125 -3.453125 Z M 1.03125 -1.09375 L 1.921875 -1.09375 L 1.921875 -0.34375 L 1.21875 1.015625 L 0.671875 1.015625 L 1.03125 -0.34375 Z M 1.03125 -1.09375 "/>
</symbol>
</g>
</defs>
<g id="surface1">
<path style=" stroke:none;fill-rule:nonzero;fill:rgb(100%,100%,100%);fill-opacity:1;" d="M 0.125 283 L 0.125 0 L 353.875 0 L 353.875 283 Z M 0.125 283 "/>
<path style="fill-rule:nonzero;fill:rgb(67.843139%,84.705883%,90.196079%);fill-opacity:1;stroke-width:1;stroke-linecap:butt;stroke-linejoin:miter;stroke:rgb(0%,0%,0%);stroke-opacity:1;stroke-miterlimit:4;" d="M 8 -418.502208 L 8 -439.50254 L 308 -439.50254 L 308 -418.502208 Z M 8 -418.502208 " transform="matrix(0.625,0,0,0.626106,2.625,280.495575)"/>
<g style="fill:rgb(0%,0%,0%);fill-opacity:1;">
  <use xlink:href="#glyph0-1" x="9.5" y="14.214448"/>
  <use xlink:href="#glyph0-2" x="15.125" y="14.214448"/>
  <use xlink:href="#glyph0-3" x="19.5" y="14.214448"/>
  <use xlink:href="#glyph0-4" x="25.125" y="14.214448"/>
  <use xlink:href="#glyph0-2" x="29.5" y="14.214448"/>
  <use xlink:href="#glyph0-5" x="33.875" y="14.214448"/>
  <use xlink:href="#glyph0-6" x="37" y="14.214448"/>
  <use xlink:href="#glyph0-7" x="39.5" y="14.214448"/>
  <use xlink:href="#glyph0-8" x="48.25" y="14.214448"/>
  <use xlink:href="#glyph0-1" x="53.875" y="14.214448"/>
  <use xlink:href="#glyph0-9" x="57.625" y="14.214448"/>
  <use xlink:href="#glyph0-10" x="63.25" y="14.214448"/>
  <use xlink:href="#glyph0-11" x="68.875" y="14.214448"/>
  <use xlink:href="#glyph0-8" x="71.375" y="14.214448"/>
  <use xlink:href="#glyph0-12" x="77" y="14.214448"/>
  <use xlink:href="#glyph0-8" x="83.875" y="14.214448"/>
  <use xlink:href="#glyph0-4" x="89.5" y="14.214448"/>
  <use xlink:href="#glyph0-13" x="93.875" y="14.214448"/>
  <use xlink:href="#glyph0-14" x="98.875" y="14.214448"/>
  <use xlink:href="#glyph0-3" x="101.375" y="14.214448"/>
  <use xlink:href="#glyph0-4" x="107" y="14.214448"/>
  <use xlink:href="#glyph0-2" x="111.375" y="14.214448"/>
  <use xlink:href="#glyph0-15" x="115.75" y="14.214448"/>
  <use xlink:href="#glyph0-16" x="122.625" y="14.214448"/>
  <use xlink:href="#glyph0-2" x="128.25" y="14.214448"/>
  <use xlink:href="#glyph0-1" x="132.625" y="14.214448"/>
  <use xlink:href="#glyph0-6" x="137.625" y="14.214448"/>
  <use xlink:href="#glyph0-7" x="140.125" y="14.214448"/>
  <use xlink:href="#glyph0-8" x="148.875" y="14.214448"/>
  <use xlink:href="#glyph0-5" x="154.5" y="14.214448"/>
  <use xlink:href="#glyph0-9" x="157.625" y="14.214448"/>
  <use xlink:href="#glyph0-10" x="163.25" y="14.214448"/>
  <use xlink:href="#glyph0-11" x="168.875" y="14.214448"/>
  <use xlink:href="#glyph0-8" x="171.375" y="14.214448"/>
  <use xlink:href="#glyph0-12" x="177" y="14.214448"/>
  <use xlink:href="#glyph0-8" x="183.875" y="14.214448"/>
  <use xlink:href="#glyph0-4" x="189.5" y="14.214448"/>
  <use xlink:href="#glyph0-13" x="193.875" y="14.214448"/>
</g>
<path style="fill:none;stroke-width:1;stroke-linecap:butt;stroke-linejoin:miter;stroke:rgb(0%,0%,0%);stroke-opacity:1;stroke-miterlimit:4;" d="M 8 -397.501877 L 8 -418.502208 L 308 -418.502208 L 308 -397.501877 Z M 8 -397.501877 " transform="matrix(0.625,0,0,0.626106,2.625,280.495575)"/>
<g style="fill:rgb(0%,0%,0%);fill-opacity:1;">
  <use xlink:href="#glyph0-17" x="76.6875" y="27.35898"/>
  <use xlink:href="#glyph0-18" x="79.1875" y="27.35898"/>
  <use xlink:href="#glyph0-6" x="84.8125" y="27.35898"/>
  <use xlink:href="#glyph0-5" x="87.3125" y="27.35898"/>
  <use xlink:href="#glyph0-6" x="90.4375" y="27.35898"/>
  <use xlink:href="#glyph0-9" x="92.9375" y="27.35898"/>
  <use xlink:href="#glyph0-11" x="98.5625" y="27.35898"/>
  <use xlink:href="#glyph0-14" x="101.0625" y="27.35898"/>
  <use xlink:href="#glyph0-19" x="103.5625" y="27.35898"/>
  <use xlink:href="#glyph0-9" x="109.1875" y="27.35898"/>
  <use xlink:href="#glyph0-5" x="114.8125" y="27.35898"/>
  <use xlink:href="#glyph0-9" x="117.9375" y="27.35898"/>
</g>
<path style="fill:none;stroke-width:1;stroke-linecap:butt;stroke-linejoin:miter;stroke:rgb(0%,0%,0%);stroke-opacity:1;stroke-miterlimit:4;" d="M 8 -376.501546 L 8 -397.501877 L 308 -397.501877 L 308 -376.501546 Z M 8 -376.501546 " transform="matrix(0.625,0,0,0.626106,2.625,280.495575)"/>
<g style="fill:rgb(0%,0%,0%);fill-opacity:1;">
  <use xlink:href="#glyph0-3" x="77.625" y="40.507417"/>
  <use xlink:href="#glyph0-20" x="83.25" y="40.507417"/>
  <use xlink:href="#glyph0-20" x="86.375" y="40.507417"/>
  <use xlink:href="#glyph0-4" x="89.5" y="40.507417"/>
  <use xlink:href="#glyph0-8" x="93.875" y="40.507417"/>
  <use xlink:href="#glyph0-5" x="99.5" y="40.507417"/>
  <use xlink:href="#glyph0-14" x="102.625" y="40.507417"/>
  <use xlink:href="#glyph0-21" x="105.125" y="40.507417"/>
  <use xlink:href="#glyph0-14" x="108.25" y="40.507417"/>
  <use xlink:href="#glyph0-22" x="110.75" y="40.507417"/>
  <use xlink:href="#glyph0-22" x="113.25" y="40.507417"/>
  <use xlink:href="#glyph0-22" x="115.75" y="40.507417"/>
  <use xlink:href="#glyph0-23" x="118.25" y="40.507417"/>
</g>
<path style="fill:none;stroke-width:1;stroke-linecap:butt;stroke-linejoin:miter;stroke:rgb(0%,0%,0%);stroke-opacity:1;stroke-miterlimit:4;" d="M 8 -355.501215 L 8 -376.501546 L 308 -376.501546 L 308 -355.501215 Z M 8 -355.501215 " transform="matrix(0.625,0,0,0.626106,2.625,280.495575)"/>
<g style="fill:rgb(0%,0%,0%);fill-opacity:1;">
  <use xlink:href="#glyph0-20" x="33.25" y="53.655855"/>
  <use xlink:href="#glyph0-6" x="36.375" y="53.655855"/>
  <use xlink:href="#glyph0-24" x="38.875" y="53.655855"/>
  <use xlink:href="#glyph0-4" x="42.625" y="53.655855"/>
  <use xlink:href="#glyph0-5" x="47" y="53.655855"/>
  <use xlink:href="#glyph0-14" x="50.125" y="53.655855"/>
  <use xlink:href="#glyph0-8" x="52.625" y="53.655855"/>
  <use xlink:href="#glyph0-18" x="58.25" y="53.655855"/>
  <use xlink:href="#glyph0-5" x="63.875" y="53.655855"/>
  <use xlink:href="#glyph0-24" x="67" y="53.655855"/>
  <use xlink:href="#glyph0-25" x="70.75" y="53.655855"/>
  <use xlink:href="#glyph0-14" x="75.75" y="53.655855"/>
  <use xlink:href="#glyph0-21" x="78.25" y="53.655855"/>
  <use xlink:href="#glyph0-14" x="81.375" y="53.655855"/>
  <use xlink:href="#glyph0-26" x="83.875" y="53.655855"/>
  <use xlink:href="#glyph0-14" x="90.75" y="53.655855"/>
  <use xlink:href="#glyph0-15" x="93.25" y="53.655855"/>
  <use xlink:href="#glyph0-16" x="100.125" y="53.655855"/>
  <use xlink:href="#glyph0-2" x="105.75" y="53.655855"/>
  <use xlink:href="#glyph0-1" x="110.125" y="53.655855"/>
  <use xlink:href="#glyph0-6" x="115.125" y="53.655855"/>
  <use xlink:href="#glyph0-7" x="117.625" y="53.655855"/>
  <use xlink:href="#glyph0-8" x="126.375" y="53.655855"/>
  <use xlink:href="#glyph0-5" x="132" y="53.655855"/>
  <use xlink:href="#glyph0-9" x="135.125" y="53.655855"/>
  <use xlink:href="#glyph0-10" x="140.75" y="53.655855"/>
  <use xlink:href="#glyph0-11" x="146.375" y="53.655855"/>
  <use xlink:href="#glyph0-8" x="148.875" y="53.655855"/>
  <use xlink:href="#glyph0-14" x="154.5" y="53.655855"/>
  <use xlink:href="#glyph0-27" x="157" y="53.655855"/>
  <use xlink:href="#glyph0-23" x="160.125" y="53.655855"/>
  <use xlink:href="#glyph0-28" x="165.75" y="53.655855"/>
</g>
<path style="fill:none;stroke-width:1;stroke-linecap:butt;stroke-linejoin:miter;stroke:rgb(0%,0%,0%);stroke-opacity:1;stroke-miterlimit:4;" d="M 8 -334.500883 L 8 -355.501215 L 308 -355.501215 L 308 -334.500883 Z M 8 -334.500883 " transform="matrix(0.625,0,0,0.626106,2.625,280.495575)"/>
<g style="fill:rgb(0%,0%,0%);fill-opacity:1;">
  <use xlink:href="#glyph0-24" x="24.5" y="66.804292"/>
  <use xlink:href="#glyph0-8" x="27.625" y="66.804292"/>
  <use xlink:href="#glyph0-11" x="33.25" y="66.804292"/>
  <use xlink:href="#glyph0-3" x="35.75" y="66.804292"/>
  <use xlink:href="#glyph0-9" x="41.375" y="66.804292"/>
  <use xlink:href="#glyph0-19" x="47" y="66.804292"/>
  <use xlink:href="#glyph0-14" x="52.625" y="66.804292"/>
  <use xlink:href="#glyph0-29" x="55.125" y="66.804292"/>
  <use xlink:href="#glyph0-3" x="60.75" y="66.804292"/>
  <use xlink:href="#glyph0-6" x="66.375" y="66.804292"/>
  <use xlink:href="#glyph0-18" x="68.875" y="66.804292"/>
  <use xlink:href="#glyph0-5" x="74.5" y="66.804292"/>
  <use xlink:href="#glyph0-8" x="77.625" y="66.804292"/>
  <use xlink:href="#glyph0-24" x="83.25" y="66.804292"/>
  <use xlink:href="#glyph0-14" x="87" y="66.804292"/>
  <use xlink:href="#glyph0-21" x="89.5" y="66.804292"/>
  <use xlink:href="#glyph0-14" x="92.625" y="66.804292"/>
  <use xlink:href="#glyph0-26" x="95.125" y="66.804292"/>
  <use xlink:href="#glyph0-14" x="102" y="66.804292"/>
  <use xlink:href="#glyph0-15" x="104.5" y="66.804292"/>
  <use xlink:href="#glyph0-16" x="111.375" y="66.804292"/>
  <use xlink:href="#glyph0-2" x="117" y="66.804292"/>
  <use xlink:href="#glyph0-1" x="121.375" y="66.804292"/>
  <use xlink:href="#glyph0-6" x="126.375" y="66.804292"/>
  <use xlink:href="#glyph0-7" x="128.875" y="66.804292"/>
  <use xlink:href="#glyph0-8" x="137.625" y="66.804292"/>
  <use xlink:href="#glyph0-5" x="143.25" y="66.804292"/>
  <use xlink:href="#glyph0-9" x="146.375" y="66.804292"/>
  <use xlink:href="#glyph0-10" x="152" y="66.804292"/>
  <use xlink:href="#glyph0-11" x="157.625" y="66.804292"/>
  <use xlink:href="#glyph0-8" x="160.125" y="66.804292"/>
  <use xlink:href="#glyph0-14" x="165.75" y="66.804292"/>
  <use xlink:href="#glyph0-27" x="168.25" y="66.804292"/>
  <use xlink:href="#glyph0-23" x="171.375" y="66.804292"/>
  <use xlink:href="#glyph0-28" x="177" y="66.804292"/>
</g>
<path style="fill-rule:nonzero;fill:rgb(67.843139%,84.705883%,90.196079%);fill-opacity:1;stroke-width:1;stroke-linecap:butt;stroke-linejoin:miter;stroke:rgb(0%,0%,0%);stroke-opacity:1;stroke-miterlimit:4;" d="M 11 -209.497129 L 11 -230.49746 L 306 -230.49746 L 306 -209.497129 Z M 11 -209.497129 " transform="matrix(0.625,0,0,0.626106,2.625,280.495575)"/>
<g style="fill:rgb(0%,0%,0%);fill-opacity:1;">
  <use xlink:href="#glyph0-1" x="22.3125" y="145.069917"/>
  <use xlink:href="#glyph0-2" x="27.9375" y="145.069917"/>
  <use xlink:href="#glyph0-3" x="32.3125" y="145.069917"/>
  <use xlink:href="#glyph0-4" x="37.9375" y="145.069917"/>
  <use xlink:href="#glyph0-2" x="42.3125" y="145.069917"/>
  <use xlink:href="#glyph0-9" x="46.6875" y="145.069917"/>
  <use xlink:href="#glyph0-29" x="52.3125" y="145.069917"/>
  <use xlink:href="#glyph0-29" x="57.9375" y="145.069917"/>
  <use xlink:href="#glyph0-30" x="63.5625" y="145.069917"/>
  <use xlink:href="#glyph0-3" x="71.0625" y="145.069917"/>
  <use xlink:href="#glyph0-19" x="76.6875" y="145.069917"/>
  <use xlink:href="#glyph0-8" x="82.3125" y="145.069917"/>
  <use xlink:href="#glyph0-12" x="87.9375" y="145.069917"/>
  <use xlink:href="#glyph0-8" x="94.8125" y="145.069917"/>
  <use xlink:href="#glyph0-4" x="100.4375" y="145.069917"/>
  <use xlink:href="#glyph0-13" x="104.8125" y="145.069917"/>
  <use xlink:href="#glyph0-14" x="109.8125" y="145.069917"/>
  <use xlink:href="#glyph0-3" x="112.3125" y="145.069917"/>
  <use xlink:href="#glyph0-4" x="117.9375" y="145.069917"/>
  <use xlink:href="#glyph0-2" x="122.3125" y="145.069917"/>
  <use xlink:href="#glyph0-15" x="126.6875" y="145.069917"/>
  <use xlink:href="#glyph0-16" x="133.5625" y="145.069917"/>
  <use xlink:href="#glyph0-2" x="139.1875" y="145.069917"/>
  <use xlink:href="#glyph0-31" x="143.5625" y="145.069917"/>
  <use xlink:href="#glyph0-32" x="149.8125" y="145.069917"/>
  <use xlink:href="#glyph0-33" x="156.0625" y="145.069917"/>
  <use xlink:href="#glyph0-12" x="162.3125" y="145.069917"/>
  <use xlink:href="#glyph0-8" x="169.1875" y="145.069917"/>
  <use xlink:href="#glyph0-4" x="174.8125" y="145.069917"/>
  <use xlink:href="#glyph0-13" x="179.1875" y="145.069917"/>
</g>
<path style="fill:none;stroke-width:1;stroke-linecap:butt;stroke-linejoin:miter;stroke:rgb(0%,0%,0%);stroke-opacity:1;stroke-miterlimit:4;" d="M 11 -188.503037 L 11 -209.497129 L 306 -209.497129 L 306 -188.503037 Z M 11 -188.503037 " transform="matrix(0.625,0,0,0.626106,2.625,280.495575)"/>
<g style="fill:rgb(0%,0%,0%);fill-opacity:1;">
  <use xlink:href="#glyph0-17" x="77" y="158.218355"/>
  <use xlink:href="#glyph0-18" x="79.5" y="158.218355"/>
  <use xlink:href="#glyph0-6" x="85.125" y="158.218355"/>
  <use xlink:href="#glyph0-5" x="87.625" y="158.218355"/>
  <use xlink:href="#glyph0-6" x="90.75" y="158.218355"/>
  <use xlink:href="#glyph0-9" x="93.25" y="158.218355"/>
  <use xlink:href="#glyph0-11" x="98.875" y="158.218355"/>
  <use xlink:href="#glyph0-14" x="101.375" y="158.218355"/>
  <use xlink:href="#glyph0-19" x="103.875" y="158.218355"/>
  <use xlink:href="#glyph0-9" x="109.5" y="158.218355"/>
  <use xlink:href="#glyph0-5" x="115.125" y="158.218355"/>
  <use xlink:href="#glyph0-9" x="118.25" y="158.218355"/>
</g>
<path style="fill:none;stroke-width:1;stroke-linecap:butt;stroke-linejoin:miter;stroke:rgb(0%,0%,0%);stroke-opacity:1;stroke-miterlimit:4;" d="M 11 -167.502705 L 11 -188.503037 L 306 -188.503037 L 306 -167.502705 Z M 11 -167.502705 " transform="matrix(0.625,0,0,0.626106,2.625,280.495575)"/>
<g style="fill:rgb(0%,0%,0%);fill-opacity:1;">
  <use xlink:href="#glyph0-6" x="52.625" y="171.366792"/>
  <use xlink:href="#glyph0-18" x="55.125" y="171.366792"/>
  <use xlink:href="#glyph0-6" x="60.75" y="171.366792"/>
  <use xlink:href="#glyph0-5" x="63.25" y="171.366792"/>
  <use xlink:href="#glyph0-14" x="66.375" y="171.366792"/>
  <use xlink:href="#glyph0-5" x="68.875" y="171.366792"/>
  <use xlink:href="#glyph0-9" x="72" y="171.366792"/>
  <use xlink:href="#glyph0-4" x="77.625" y="171.366792"/>
  <use xlink:href="#glyph0-34" x="82" y="171.366792"/>
  <use xlink:href="#glyph0-14" x="87" y="171.366792"/>
  <use xlink:href="#glyph0-21" x="89.5" y="171.366792"/>
  <use xlink:href="#glyph0-14" x="92.625" y="171.366792"/>
  <use xlink:href="#glyph0-2" x="95.125" y="171.366792"/>
  <use xlink:href="#glyph0-15" x="99.5" y="171.366792"/>
  <use xlink:href="#glyph0-16" x="106.375" y="171.366792"/>
  <use xlink:href="#glyph0-2" x="112" y="171.366792"/>
  <use xlink:href="#glyph0-17" x="116.375" y="171.366792"/>
  <use xlink:href="#glyph0-18" x="118.875" y="171.366792"/>
  <use xlink:href="#glyph0-6" x="124.5" y="171.366792"/>
  <use xlink:href="#glyph0-2" x="127" y="171.366792"/>
  <use xlink:href="#glyph0-1" x="131.375" y="171.366792"/>
  <use xlink:href="#glyph0-9" x="135.125" y="171.366792"/>
  <use xlink:href="#glyph0-4" x="140.75" y="171.366792"/>
  <use xlink:href="#glyph0-34" x="145.125" y="171.366792"/>
</g>
<path style="fill:none;stroke-width:1;stroke-linecap:butt;stroke-linejoin:miter;stroke:rgb(0%,0%,0%);stroke-opacity:1;stroke-miterlimit:4;" d="M 11 -146.502374 L 11 -167.502705 L 306 -167.502705 L 306 -146.502374 Z M 11 -146.502374 " transform="matrix(0.625,0,0,0.626106,2.625,280.495575)"/>
<g style="fill:rgb(0%,0%,0%);fill-opacity:1;">
  <use xlink:href="#glyph0-5" x="24.5" y="184.51523"/>
  <use xlink:href="#glyph0-6" x="27.625" y="184.51523"/>
  <use xlink:href="#glyph0-7" x="30.125" y="184.51523"/>
  <use xlink:href="#glyph0-8" x="38.875" y="184.51523"/>
  <use xlink:href="#glyph0-14" x="44.5" y="184.51523"/>
  <use xlink:href="#glyph0-5" x="47" y="184.51523"/>
  <use xlink:href="#glyph0-9" x="50.125" y="184.51523"/>
  <use xlink:href="#glyph0-10" x="55.75" y="184.51523"/>
  <use xlink:href="#glyph0-11" x="61.375" y="184.51523"/>
  <use xlink:href="#glyph0-8" x="63.875" y="184.51523"/>
  <use xlink:href="#glyph0-14" x="69.5" y="184.51523"/>
  <use xlink:href="#glyph0-21" x="72" y="184.51523"/>
  <use xlink:href="#glyph0-14" x="75.125" y="184.51523"/>
  <use xlink:href="#glyph0-26" x="77.625" y="184.51523"/>
  <use xlink:href="#glyph0-3" x="84.5" y="184.51523"/>
  <use xlink:href="#glyph0-4" x="90.125" y="184.51523"/>
  <use xlink:href="#glyph0-2" x="94.5" y="184.51523"/>
  <use xlink:href="#glyph0-15" x="98.875" y="184.51523"/>
  <use xlink:href="#glyph0-16" x="105.75" y="184.51523"/>
  <use xlink:href="#glyph0-2" x="111.375" y="184.51523"/>
  <use xlink:href="#glyph0-1" x="115.75" y="184.51523"/>
  <use xlink:href="#glyph0-6" x="120.75" y="184.51523"/>
  <use xlink:href="#glyph0-7" x="123.25" y="184.51523"/>
  <use xlink:href="#glyph0-8" x="132" y="184.51523"/>
  <use xlink:href="#glyph0-5" x="137.625" y="184.51523"/>
  <use xlink:href="#glyph0-9" x="140.75" y="184.51523"/>
  <use xlink:href="#glyph0-10" x="146.375" y="184.51523"/>
  <use xlink:href="#glyph0-11" x="152" y="184.51523"/>
  <use xlink:href="#glyph0-8" x="154.5" y="184.51523"/>
  <use xlink:href="#glyph0-12" x="160.125" y="184.51523"/>
  <use xlink:href="#glyph0-8" x="167" y="184.51523"/>
  <use xlink:href="#glyph0-4" x="172.625" y="184.51523"/>
  <use xlink:href="#glyph0-13" x="177" y="184.51523"/>
</g>
<path style="fill:none;stroke-width:1;stroke-linecap:butt;stroke-linejoin:miter;stroke:rgb(0%,0%,0%);stroke-opacity:1;stroke-miterlimit:4;" d="M 11 -125.502043 L 11 -146.502374 L 306 -146.502374 L 306 -125.502043 Z M 11 -125.502043 " transform="matrix(0.625,0,0,0.626106,2.625,280.495575)"/>
<g style="fill:rgb(0%,0%,0%);fill-opacity:1;">
  <use xlink:href="#glyph0-35" x="11.375" y="197.663667"/>
  <use xlink:href="#glyph0-1" x="14.5" y="197.663667"/>
  <use xlink:href="#glyph0-2" x="20.125" y="197.663667"/>
  <use xlink:href="#glyph0-3" x="24.5" y="197.663667"/>
  <use xlink:href="#glyph0-4" x="30.125" y="197.663667"/>
  <use xlink:href="#glyph0-2" x="34.5" y="197.663667"/>
  <use xlink:href="#glyph0-13" x="38.875" y="197.663667"/>
  <use xlink:href="#glyph0-20" x="43.875" y="197.663667"/>
  <use xlink:href="#glyph0-36" x="47" y="197.663667"/>
  <use xlink:href="#glyph0-12" x="52.625" y="197.663667"/>
  <use xlink:href="#glyph0-9" x="59.5" y="197.663667"/>
  <use xlink:href="#glyph0-5" x="65.125" y="197.663667"/>
  <use xlink:href="#glyph0-9" x="68.25" y="197.663667"/>
  <use xlink:href="#glyph0-37" x="73.875" y="197.663667"/>
  <use xlink:href="#glyph0-5" x="78.875" y="197.663667"/>
  <use xlink:href="#glyph0-24" x="82" y="197.663667"/>
  <use xlink:href="#glyph0-38" x="85.75" y="197.663667"/>
  <use xlink:href="#glyph0-14" x="88.875" y="197.663667"/>
  <use xlink:href="#glyph0-22" x="91.375" y="197.663667"/>
  <use xlink:href="#glyph0-22" x="93.875" y="197.663667"/>
  <use xlink:href="#glyph0-26" x="96.375" y="197.663667"/>
  <use xlink:href="#glyph0-3" x="103.25" y="197.663667"/>
  <use xlink:href="#glyph0-4" x="108.875" y="197.663667"/>
  <use xlink:href="#glyph0-2" x="113.25" y="197.663667"/>
  <use xlink:href="#glyph0-13" x="117.625" y="197.663667"/>
  <use xlink:href="#glyph0-20" x="122.625" y="197.663667"/>
  <use xlink:href="#glyph0-36" x="125.75" y="197.663667"/>
  <use xlink:href="#glyph0-12" x="131.375" y="197.663667"/>
  <use xlink:href="#glyph0-9" x="138.25" y="197.663667"/>
  <use xlink:href="#glyph0-5" x="143.875" y="197.663667"/>
  <use xlink:href="#glyph0-9" x="147" y="197.663667"/>
  <use xlink:href="#glyph0-39" x="152.625" y="197.663667"/>
  <use xlink:href="#glyph0-29" x="158.875" y="197.663667"/>
  <use xlink:href="#glyph0-29" x="164.5" y="197.663667"/>
  <use xlink:href="#glyph0-30" x="170.125" y="197.663667"/>
  <use xlink:href="#glyph0-3" x="177.625" y="197.663667"/>
  <use xlink:href="#glyph0-19" x="183.25" y="197.663667"/>
  <use xlink:href="#glyph0-8" x="188.875" y="197.663667"/>
</g>
<path style="fill:none;stroke-width:1;stroke-linecap:butt;stroke-linejoin:miter;stroke:rgb(0%,0%,0%);stroke-opacity:1;stroke-miterlimit:4;" d="M 158 -330.757509 C 158 -304.528931 158 -273.059629 158 -245.63941 " transform="matrix(0.625,0,0,0.626106,2.625,280.495575)"/>
<path style="fill-rule:nonzero;fill:rgb(0%,0%,0%);fill-opacity:1;stroke-width:1;stroke-linecap:butt;stroke-linejoin:miter;stroke:rgb(0%,0%,0%);stroke-opacity:1;stroke-miterlimit:4;" d="M 161.5 -245.33994 L 158 -235.338891 L 154.5 -245.33994 Z M 161.5 -245.33994 " transform="matrix(0.625,0,0,0.626106,2.625,280.495575)"/>
<g style="fill:rgb(0%,0%,0%);fill-opacity:1;">
  <use xlink:href="#glyph0-24" x="105.125" y="91.538667"/>
  <use xlink:href="#glyph0-8" x="108.25" y="91.538667"/>
  <use xlink:href="#glyph0-20" x="113.875" y="91.538667"/>
  <use xlink:href="#glyph0-8" x="117" y="91.538667"/>
  <use xlink:href="#glyph0-24" x="122.625" y="91.538667"/>
  <use xlink:href="#glyph0-8" x="125.75" y="91.538667"/>
  <use xlink:href="#glyph0-18" x="131.375" y="91.538667"/>
  <use xlink:href="#glyph0-13" x="137" y="91.538667"/>
  <use xlink:href="#glyph0-8" x="142" y="91.538667"/>
  <use xlink:href="#glyph0-14" x="147.625" y="91.538667"/>
  <use xlink:href="#glyph0-3" x="150.125" y="91.538667"/>
  <use xlink:href="#glyph0-18" x="155.75" y="91.538667"/>
  <use xlink:href="#glyph0-14" x="161.375" y="91.538667"/>
  <use xlink:href="#glyph0-5" x="163.875" y="91.538667"/>
  <use xlink:href="#glyph0-6" x="167" y="91.538667"/>
  <use xlink:href="#glyph0-7" x="169.5" y="91.538667"/>
  <use xlink:href="#glyph0-8" x="178.25" y="91.538667"/>
  <use xlink:href="#glyph0-24" x="183.875" y="91.538667"/>
  <use xlink:href="#glyph0-14" x="187.625" y="91.538667"/>
  <use xlink:href="#glyph0-5" x="190.125" y="91.538667"/>
  <use xlink:href="#glyph0-9" x="193.25" y="91.538667"/>
  <use xlink:href="#glyph0-10" x="198.875" y="91.538667"/>
  <use xlink:href="#glyph0-11" x="204.5" y="91.538667"/>
  <use xlink:href="#glyph0-8" x="207" y="91.538667"/>
  <use xlink:href="#glyph0-4" x="212.625" y="91.538667"/>
</g>
<g style="fill:rgb(0%,0%,0%);fill-opacity:1;">
  <use xlink:href="#glyph0-5" x="112.3125" y="100.929292"/>
  <use xlink:href="#glyph0-40" x="115.4375" y="100.929292"/>
  <use xlink:href="#glyph0-8" x="121.0625" y="100.929292"/>
  <use xlink:href="#glyph0-24" x="126.6875" y="100.929292"/>
  <use xlink:href="#glyph0-8" x="129.8125" y="100.929292"/>
  <use xlink:href="#glyph0-14" x="135.4375" y="100.929292"/>
  <use xlink:href="#glyph0-9" x="137.9375" y="100.929292"/>
  <use xlink:href="#glyph0-24" x="143.5625" y="100.929292"/>
  <use xlink:href="#glyph0-8" x="146.6875" y="100.929292"/>
  <use xlink:href="#glyph0-14" x="152.3125" y="100.929292"/>
  <use xlink:href="#glyph0-41" x="154.8125" y="100.929292"/>
  <use xlink:href="#glyph0-14" x="160.4375" y="100.929292"/>
  <use xlink:href="#glyph0-24" x="162.9375" y="100.929292"/>
  <use xlink:href="#glyph0-8" x="166.0625" y="100.929292"/>
  <use xlink:href="#glyph0-20" x="171.6875" y="100.929292"/>
  <use xlink:href="#glyph0-8" x="174.8125" y="100.929292"/>
  <use xlink:href="#glyph0-24" x="180.4375" y="100.929292"/>
  <use xlink:href="#glyph0-8" x="183.5625" y="100.929292"/>
  <use xlink:href="#glyph0-18" x="189.1875" y="100.929292"/>
  <use xlink:href="#glyph0-13" x="194.8125" y="100.929292"/>
  <use xlink:href="#glyph0-8" x="199.8125" y="100.929292"/>
  <use xlink:href="#glyph0-4" x="205.4375" y="100.929292"/>
</g>
<g style="fill:rgb(0%,0%,0%);fill-opacity:1;">
  <use xlink:href="#glyph0-42" x="103.25" y="110.319917"/>
  <use xlink:href="#glyph0-43" x="108.875" y="110.319917"/>
  <use xlink:href="#glyph0-14" x="111.375" y="110.319917"/>
  <use xlink:href="#glyph0-5" x="113.875" y="110.319917"/>
  <use xlink:href="#glyph0-6" x="117" y="110.319917"/>
  <use xlink:href="#glyph0-7" x="119.5" y="110.319917"/>
  <use xlink:href="#glyph0-8" x="128.25" y="110.319917"/>
  <use xlink:href="#glyph0-14" x="133.875" y="110.319917"/>
  <use xlink:href="#glyph0-5" x="136.375" y="110.319917"/>
  <use xlink:href="#glyph0-9" x="139.5" y="110.319917"/>
  <use xlink:href="#glyph0-10" x="145.125" y="110.319917"/>
  <use xlink:href="#glyph0-11" x="150.75" y="110.319917"/>
  <use xlink:href="#glyph0-8" x="153.25" y="110.319917"/>
  <use xlink:href="#glyph0-14" x="158.875" y="110.319917"/>
  <use xlink:href="#glyph0-20" x="161.375" y="110.319917"/>
  <use xlink:href="#glyph0-3" x="164.5" y="110.319917"/>
  <use xlink:href="#glyph0-24" x="170.125" y="110.319917"/>
  <use xlink:href="#glyph0-14" x="173.875" y="110.319917"/>
  <use xlink:href="#glyph0-20" x="176.375" y="110.319917"/>
  <use xlink:href="#glyph0-6" x="179.5" y="110.319917"/>
  <use xlink:href="#glyph0-24" x="182" y="110.319917"/>
  <use xlink:href="#glyph0-4" x="185.75" y="110.319917"/>
  <use xlink:href="#glyph0-5" x="190.125" y="110.319917"/>
  <use xlink:href="#glyph0-14" x="193.25" y="110.319917"/>
  <use xlink:href="#glyph0-8" x="195.75" y="110.319917"/>
  <use xlink:href="#glyph0-18" x="201.375" y="110.319917"/>
  <use xlink:href="#glyph0-5" x="207" y="110.319917"/>
  <use xlink:href="#glyph0-24" x="210.125" y="110.319917"/>
  <use xlink:href="#glyph0-25" x="213.875" y="110.319917"/>
</g>
<g style="fill:rgb(0%,0%,0%);fill-opacity:1;">
  <use xlink:href="#glyph0-41" x="100.4375" y="119.710542"/>
  <use xlink:href="#glyph0-43" x="106.0625" y="119.710542"/>
  <use xlink:href="#glyph0-14" x="108.5625" y="119.710542"/>
  <use xlink:href="#glyph0-24" x="111.0625" y="119.710542"/>
  <use xlink:href="#glyph0-8" x="114.1875" y="119.710542"/>
  <use xlink:href="#glyph0-29" x="119.8125" y="119.710542"/>
  <use xlink:href="#glyph0-8" x="125.4375" y="119.710542"/>
  <use xlink:href="#glyph0-9" x="131.0625" y="119.710542"/>
  <use xlink:href="#glyph0-5" x="136.6875" y="119.710542"/>
  <use xlink:href="#glyph0-8" x="139.8125" y="119.710542"/>
  <use xlink:href="#glyph0-19" x="145.4375" y="119.710542"/>
  <use xlink:href="#glyph0-14" x="151.0625" y="119.710542"/>
  <use xlink:href="#glyph0-29" x="153.5625" y="119.710542"/>
  <use xlink:href="#glyph0-8" x="159.1875" y="119.710542"/>
  <use xlink:href="#glyph0-24" x="164.8125" y="119.710542"/>
  <use xlink:href="#glyph0-6" x="168.5625" y="119.710542"/>
  <use xlink:href="#glyph0-3" x="171.0625" y="119.710542"/>
  <use xlink:href="#glyph0-19" x="176.6875" y="119.710542"/>
  <use xlink:href="#glyph0-6" x="182.3125" y="119.710542"/>
  <use xlink:href="#glyph0-13" x="184.8125" y="119.710542"/>
  <use xlink:href="#glyph0-14" x="189.8125" y="119.710542"/>
  <use xlink:href="#glyph0-8" x="192.3125" y="119.710542"/>
  <use xlink:href="#glyph0-44" x="197.9375" y="119.710542"/>
  <use xlink:href="#glyph0-8" x="202.9375" y="119.710542"/>
  <use xlink:href="#glyph0-18" x="208.5625" y="119.710542"/>
  <use xlink:href="#glyph0-5" x="214.1875" y="119.710542"/>
  <use xlink:href="#glyph0-4" x="217.3125" y="119.710542"/>
</g>
<path style="fill-rule:nonzero;fill:rgb(67.843139%,84.705883%,90.196079%);fill-opacity:1;stroke-width:1;stroke-linecap:butt;stroke-linejoin:miter;stroke:rgb(0%,0%,0%);stroke-opacity:1;stroke-miterlimit:4;" d="M 51 -45.49989 L 51 -66.500221 L 266 -66.500221 L 266 -45.49989 Z M 51 -45.49989 " transform="matrix(0.625,0,0,0.626106,2.625,280.495575)"/>
<g style="fill:rgb(0%,0%,0%);fill-opacity:1;">
  <use xlink:href="#glyph0-13" x="40.125" y="247.749605"/>
  <use xlink:href="#glyph0-3" x="45.125" y="247.749605"/>
  <use xlink:href="#glyph0-18" x="50.75" y="247.749605"/>
  <use xlink:href="#glyph0-4" x="56.375" y="247.749605"/>
  <use xlink:href="#glyph0-5" x="60.75" y="247.749605"/>
  <use xlink:href="#glyph0-14" x="63.875" y="247.749605"/>
  <use xlink:href="#glyph0-39" x="66.375" y="247.749605"/>
  <use xlink:href="#glyph0-29" x="72.625" y="247.749605"/>
  <use xlink:href="#glyph0-29" x="78.25" y="247.749605"/>
  <use xlink:href="#glyph0-30" x="83.875" y="247.749605"/>
  <use xlink:href="#glyph0-3" x="91.375" y="247.749605"/>
  <use xlink:href="#glyph0-19" x="97" y="247.749605"/>
  <use xlink:href="#glyph0-8" x="102.625" y="247.749605"/>
  <use xlink:href="#glyph0-1" x="108.25" y="247.749605"/>
  <use xlink:href="#glyph0-25" x="112" y="247.749605"/>
  <use xlink:href="#glyph0-29" x="117" y="247.749605"/>
  <use xlink:href="#glyph0-8" x="122.625" y="247.749605"/>
  <use xlink:href="#glyph0-15" x="128.25" y="247.749605"/>
  <use xlink:href="#glyph0-16" x="135.125" y="247.749605"/>
  <use xlink:href="#glyph0-2" x="140.75" y="247.749605"/>
  <use xlink:href="#glyph0-31" x="145.125" y="247.749605"/>
  <use xlink:href="#glyph0-32" x="151.375" y="247.749605"/>
  <use xlink:href="#glyph0-33" x="157.625" y="247.749605"/>
</g>
<path style="fill:none;stroke-width:1;stroke-linecap:butt;stroke-linejoin:miter;stroke:rgb(0%,0%,0%);stroke-opacity:1;stroke-miterlimit:4;" d="M 51 -24.499558 L 51 -45.49989 L 266 -45.49989 L 266 -24.499558 Z M 51 -24.499558 " transform="matrix(0.625,0,0,0.626106,2.625,280.495575)"/>
<g style="fill:rgb(0%,0%,0%);fill-opacity:1;">
  <use xlink:href="#glyph0-17" x="77" y="260.898042"/>
  <use xlink:href="#glyph0-18" x="79.5" y="260.898042"/>
  <use xlink:href="#glyph0-6" x="85.125" y="260.898042"/>
  <use xlink:href="#glyph0-5" x="87.625" y="260.898042"/>
  <use xlink:href="#glyph0-6" x="90.75" y="260.898042"/>
  <use xlink:href="#glyph0-9" x="93.25" y="260.898042"/>
  <use xlink:href="#glyph0-11" x="98.875" y="260.898042"/>
  <use xlink:href="#glyph0-14" x="101.375" y="260.898042"/>
  <use xlink:href="#glyph0-19" x="103.875" y="260.898042"/>
  <use xlink:href="#glyph0-9" x="109.5" y="260.898042"/>
  <use xlink:href="#glyph0-5" x="115.125" y="260.898042"/>
  <use xlink:href="#glyph0-9" x="118.25" y="260.898042"/>
</g>
<path style="fill:none;stroke-width:1;stroke-linecap:butt;stroke-linejoin:miter;stroke:rgb(0%,0%,0%);stroke-opacity:1;stroke-miterlimit:4;" d="M 51 -3.499227 L 51 -24.499558 L 266 -24.499558 L 266 -3.499227 Z M 51 -3.499227 " transform="matrix(0.625,0,0,0.626106,2.625,280.495575)"/>
<g style="fill:rgb(0%,0%,0%);fill-opacity:1;">
  <use xlink:href="#glyph0-15" x="36.375" y="274.04648"/>
  <use xlink:href="#glyph0-16" x="43.25" y="274.04648"/>
  <use xlink:href="#glyph0-2" x="48.875" y="274.04648"/>
  <use xlink:href="#glyph0-31" x="53.25" y="274.04648"/>
  <use xlink:href="#glyph0-32" x="59.5" y="274.04648"/>
  <use xlink:href="#glyph0-33" x="65.75" y="274.04648"/>
  <use xlink:href="#glyph0-14" x="72" y="274.04648"/>
  <use xlink:href="#glyph0-45" x="74.5" y="274.04648"/>
  <use xlink:href="#glyph0-14" x="82" y="274.04648"/>
  <use xlink:href="#glyph0-26" x="84.5" y="274.04648"/>
  <use xlink:href="#glyph0-3" x="91.375" y="274.04648"/>
  <use xlink:href="#glyph0-4" x="97" y="274.04648"/>
  <use xlink:href="#glyph0-2" x="101.375" y="274.04648"/>
  <use xlink:href="#glyph0-15" x="105.75" y="274.04648"/>
  <use xlink:href="#glyph0-16" x="112.625" y="274.04648"/>
  <use xlink:href="#glyph0-2" x="118.25" y="274.04648"/>
  <use xlink:href="#glyph0-31" x="122.625" y="274.04648"/>
  <use xlink:href="#glyph0-32" x="128.875" y="274.04648"/>
  <use xlink:href="#glyph0-33" x="135.125" y="274.04648"/>
  <use xlink:href="#glyph0-12" x="141.375" y="274.04648"/>
  <use xlink:href="#glyph0-8" x="148.25" y="274.04648"/>
  <use xlink:href="#glyph0-4" x="153.875" y="274.04648"/>
  <use xlink:href="#glyph0-13" x="158.25" y="274.04648"/>
  <use xlink:href="#glyph0-46" x="163.25" y="274.04648"/>
</g>
<path style="fill:none;stroke-width:1;stroke-linecap:butt;stroke-linejoin:miter;stroke:rgb(0%,0%,0%);stroke-opacity:1;stroke-miterlimit:4;" d="M 158 -121.771146 C 158 -108.288759 158 -94.051458 158 -81.149293 " transform="matrix(0.625,0,0,0.626106,2.625,280.495575)"/>
<path style="fill-rule:nonzero;fill:rgb(0%,0%,0%);fill-opacity:1;stroke-width:1;stroke-linecap:butt;stroke-linejoin:miter;stroke:rgb(0%,0%,0%);stroke-opacity:1;stroke-miterlimit:4;" d="M 161.5 -81.130576 L 158 -71.129527 L 154.5 -81.130576 Z M 161.5 -81.130576 " transform="matrix(0.625,0,0,0.626106,2.625,280.495575)"/>
<g style="fill:rgb(0%,0%,0%);fill-opacity:1;">
  <use xlink:href="#glyph0-15" x="100.75" y="222.394136"/>
  <use xlink:href="#glyph0-16" x="107.625" y="222.394136"/>
  <use xlink:href="#glyph0-2" x="113.25" y="222.394136"/>
  <use xlink:href="#glyph0-31" x="117.625" y="222.394136"/>
  <use xlink:href="#glyph0-32" x="123.875" y="222.394136"/>
  <use xlink:href="#glyph0-33" x="130.125" y="222.394136"/>
  <use xlink:href="#glyph0-14" x="136.375" y="222.394136"/>
  <use xlink:href="#glyph0-6" x="138.875" y="222.394136"/>
  <use xlink:href="#glyph0-4" x="141.375" y="222.394136"/>
  <use xlink:href="#glyph0-14" x="145.75" y="222.394136"/>
  <use xlink:href="#glyph0-9" x="148.25" y="222.394136"/>
  <use xlink:href="#glyph0-14" x="153.875" y="222.394136"/>
  <use xlink:href="#glyph0-24" x="156.375" y="222.394136"/>
  <use xlink:href="#glyph0-8" x="159.5" y="222.394136"/>
  <use xlink:href="#glyph0-20" x="165.125" y="222.394136"/>
  <use xlink:href="#glyph0-8" x="168.25" y="222.394136"/>
  <use xlink:href="#glyph0-24" x="173.875" y="222.394136"/>
  <use xlink:href="#glyph0-8" x="177" y="222.394136"/>
  <use xlink:href="#glyph0-18" x="182.625" y="222.394136"/>
  <use xlink:href="#glyph0-13" x="188.25" y="222.394136"/>
  <use xlink:href="#glyph0-8" x="193.25" y="222.394136"/>
  <use xlink:href="#glyph0-14" x="198.875" y="222.394136"/>
  <use xlink:href="#glyph0-3" x="201.375" y="222.394136"/>
  <use xlink:href="#glyph0-18" x="207" y="222.394136"/>
  <use xlink:href="#glyph0-14" x="212.625" y="222.394136"/>
  <use xlink:href="#glyph0-5" x="215.125" y="222.394136"/>
  <use xlink:href="#glyph0-40" x="218.25" y="222.394136"/>
  <use xlink:href="#glyph0-8" x="223.875" y="222.394136"/>
  <use xlink:href="#glyph0-14" x="229.5" y="222.394136"/>
  <use xlink:href="#glyph0-29" x="232" y="222.394136"/>
  <use xlink:href="#glyph0-3" x="237.625" y="222.394136"/>
  <use xlink:href="#glyph0-6" x="243.25" y="222.394136"/>
  <use xlink:href="#glyph0-18" x="245.75" y="222.394136"/>
  <use xlink:href="#glyph0-5" x="251.375" y="222.394136"/>
  <use xlink:href="#glyph0-8" x="254.5" y="222.394136"/>
  <use xlink:href="#glyph0-24" x="260.125" y="222.394136"/>
  <use xlink:href="#glyph0-14" x="263.875" y="222.394136"/>
  <use xlink:href="#glyph0-3" x="266.375" y="222.394136"/>
  <use xlink:href="#glyph0-18" x="272" y="222.394136"/>
  <use xlink:href="#glyph0-14" x="277.625" y="222.394136"/>
  <use xlink:href="#glyph0-3" x="280.125" y="222.394136"/>
  <use xlink:href="#glyph0-4" x="285.75" y="222.394136"/>
  <use xlink:href="#glyph0-2" x="290.125" y="222.394136"/>
  <use xlink:href="#glyph0-15" x="294.5" y="222.394136"/>
  <use xlink:href="#glyph0-16" x="301.375" y="222.394136"/>
  <use xlink:href="#glyph0-2" x="307" y="222.394136"/>
  <use xlink:href="#glyph0-31" x="311.375" y="222.394136"/>
  <use xlink:href="#glyph0-32" x="317.625" y="222.394136"/>
  <use xlink:href="#glyph0-33" x="323.875" y="222.394136"/>
  <use xlink:href="#glyph0-12" x="330.125" y="222.394136"/>
  <use xlink:href="#glyph0-8" x="337" y="222.394136"/>
  <use xlink:href="#glyph0-4" x="342.625" y="222.394136"/>
  <use xlink:href="#glyph0-13" x="347" y="222.394136"/>
</g>
</g>
</svg>
