<?xml version="1.0" encoding="UTF-8"?>
<svg xmlns="http://www.w3.org/2000/svg" xmlns:xlink="http://www.w3.org/1999/xlink" width="541px" height="230px" viewBox="0 0 541 230" version="1.1">
<defs>
<g>
<symbol overflow="visible" id="glyph0-0">
<path style="stroke:none;" d=""/>
</symbol>
<symbol overflow="visible" id="glyph0-1">
<path style="stroke:none;" d="M 0.15625 0 L 2.015625 0 L 2.015625 -0.125 C 1.578125 -0.15625 1.4375 -0.265625 1.4375 -0.59375 L 1.4375 -3.046875 C 1.859375 -3.4375 2.046875 -3.546875 2.34375 -3.546875 C 2.765625 -3.546875 2.96875 -3.265625 2.96875 -2.6875 L 2.96875 -0.859375 C 2.953125 -0.296875 2.859375 -0.15625 2.421875 -0.125 L 2.421875 0 L 4.25 0 L 4.25 -0.125 C 3.8125 -0.171875 3.71875 -0.28125 3.703125 -0.703125 L 3.703125 -2.71875 C 3.703125 -3.53125 3.328125 -4.03125 2.671875 -4.03125 C 2.28125 -4.03125 2 -3.875 1.40625 -3.3125 L 1.40625 -4 L 1.34375 -4.03125 C 0.890625 -3.859375 0.59375 -3.765625 0.140625 -3.625 L 0.140625 -3.484375 C 0.203125 -3.515625 0.28125 -3.515625 0.375 -3.515625 C 0.625 -3.515625 0.703125 -3.390625 0.703125 -2.953125 L 0.703125 -0.78125 C 0.6875 -0.265625 0.59375 -0.15625 0.15625 -0.125 Z M 0.15625 0 "/>
</symbol>
<symbol overflow="visible" id="glyph0-2">
<path style="stroke:none;" d="M 3.875 -0.578125 C 3.71875 -0.453125 3.609375 -0.40625 3.484375 -0.40625 C 3.28125 -0.40625 3.21875 -0.53125 3.21875 -0.921875 L 3.21875 -2.625 C 3.21875 -3.078125 3.171875 -3.328125 3.046875 -3.546875 C 2.859375 -3.859375 2.46875 -4.03125 1.953125 -4.03125 C 1.140625 -4.03125 0.484375 -3.59375 0.484375 -3.046875 C 0.484375 -2.84375 0.65625 -2.671875 0.859375 -2.671875 C 1.078125 -2.671875 1.265625 -2.84375 1.265625 -3.03125 C 1.265625 -3.078125 1.25 -3.109375 1.25 -3.171875 C 1.21875 -3.25 1.21875 -3.328125 1.21875 -3.390625 C 1.21875 -3.625 1.5 -3.8125 1.84375 -3.8125 C 2.28125 -3.8125 2.515625 -3.5625 2.515625 -3.09375 L 2.515625 -2.5625 C 1.171875 -2.015625 1.015625 -1.9375 0.640625 -1.609375 C 0.453125 -1.4375 0.328125 -1.140625 0.328125 -0.84375 C 0.328125 -0.296875 0.703125 0.09375 1.25 0.09375 C 1.625 0.09375 1.984375 -0.09375 2.515625 -0.546875 C 2.5625 -0.09375 2.71875 0.09375 3.078125 0.09375 C 3.375 0.09375 3.5625 -0.015625 3.875 -0.34375 Z M 2.515625 -1.078125 C 2.515625 -0.8125 2.46875 -0.71875 2.28125 -0.609375 C 2.0625 -0.484375 1.828125 -0.421875 1.640625 -0.421875 C 1.34375 -0.421875 1.09375 -0.71875 1.09375 -1.09375 L 1.09375 -1.125 C 1.109375 -1.65625 1.484375 -1.984375 2.515625 -2.34375 Z M 2.515625 -1.078125 "/>
</symbol>
<symbol overflow="visible" id="glyph0-3">
<path style="stroke:none;" d="M 0.140625 0 L 2.078125 0 L 2.078125 -0.125 C 1.640625 -0.140625 1.5 -0.234375 1.484375 -0.59375 L 1.484375 -3.046875 C 1.484375 -3.078125 1.5625 -3.15625 1.625 -3.21875 C 1.84375 -3.421875 2.21875 -3.5625 2.515625 -3.5625 C 2.90625 -3.5625 3.09375 -3.265625 3.09375 -2.65625 L 3.09375 -0.75 C 3.078125 -0.25 3 -0.15625 2.5 -0.125 L 2.5 0 L 4.46875 0 L 4.46875 -0.125 C 3.96875 -0.125 3.84375 -0.265625 3.828125 -0.828125 L 3.828125 -3.03125 C 4.09375 -3.40625 4.375 -3.5625 4.78125 -3.5625 C 5.28125 -3.5625 5.4375 -3.328125 5.4375 -2.609375 L 5.4375 -0.765625 C 5.421875 -0.25 5.375 -0.1875 4.859375 -0.125 L 4.859375 0 L 6.78125 0 L 6.78125 -0.125 L 6.546875 -0.15625 C 6.28125 -0.1875 6.171875 -0.328125 6.171875 -0.671875 L 6.171875 -2.46875 C 6.171875 -3.5 5.84375 -4.03125 5.15625 -4.03125 C 4.65625 -4.03125 4.203125 -3.796875 3.734375 -3.296875 C 3.578125 -3.78125 3.28125 -4.03125 2.8125 -4.03125 C 2.421875 -4.03125 2.171875 -3.90625 1.453125 -3.34375 L 1.453125 -4 L 1.390625 -4.03125 C 0.921875 -3.859375 0.625 -3.765625 0.171875 -3.625 L 0.171875 -3.484375 C 0.265625 -3.515625 0.34375 -3.515625 0.453125 -3.515625 C 0.671875 -3.515625 0.75 -3.375 0.75 -2.953125 L 0.75 -0.75 C 0.734375 -0.25 0.625 -0.125 0.140625 -0.125 Z M 0.140625 0 "/>
</symbol>
<symbol overflow="visible" id="glyph0-4">
<path style="stroke:none;" d="M 3.5625 -1.4375 C 3.15625 -0.765625 2.78125 -0.515625 2.21875 -0.515625 C 1.71875 -0.515625 1.34375 -0.765625 1.078125 -1.265625 C 0.921875 -1.59375 0.859375 -1.875 0.84375 -2.421875 L 3.546875 -2.421875 C 3.46875 -3 3.390625 -3.25 3.171875 -3.53125 C 2.90625 -3.84375 2.5 -4.03125 2.046875 -4.03125 C 1.609375 -4.03125 1.203125 -3.875 0.859375 -3.5625 C 0.453125 -3.21875 0.21875 -2.59375 0.21875 -1.875 C 0.21875 -0.671875 0.84375 0.09375 1.859375 0.09375 C 2.6875 0.09375 3.34375 -0.421875 3.703125 -1.375 Z M 0.859375 -2.703125 C 0.96875 -3.390625 1.265625 -3.703125 1.796875 -3.703125 C 2.328125 -3.703125 2.53125 -3.46875 2.65625 -2.703125 Z M 0.859375 -2.703125 "/>
</symbol>
<symbol overflow="visible" id="glyph0-5">
<path style="stroke:none;" d="M 1.1875 -4.015625 C 0.921875 -4.015625 0.703125 -3.796875 0.703125 -3.515625 C 0.703125 -3.265625 0.921875 -3.046875 1.1875 -3.046875 C 1.453125 -3.046875 1.6875 -3.25 1.6875 -3.515625 C 1.6875 -3.78125 1.453125 -4.015625 1.1875 -4.015625 Z M 1.1875 -0.875 C 0.921875 -0.875 0.703125 -0.65625 0.703125 -0.375 C 0.703125 -0.125 0.921875 0.09375 1.1875 0.09375 C 1.453125 0.09375 1.6875 -0.109375 1.6875 -0.375 C 1.6875 -0.640625 1.453125 -0.875 1.1875 -0.875 Z M 1.1875 -0.875 "/>
</symbol>
<symbol overflow="visible" id="glyph0-6">
<path style="stroke:none;" d="M 1.09375 -0.875 C 0.828125 -0.875 0.609375 -0.65625 0.609375 -0.375 C 0.609375 -0.125 0.828125 0.09375 1.078125 0.09375 C 1.359375 0.09375 1.578125 -0.109375 1.578125 -0.375 C 1.578125 -0.640625 1.359375 -0.875 1.09375 -0.875 Z M 1.09375 -0.875 "/>
</symbol>
<symbol overflow="visible" id="glyph0-7">
<path style="stroke:none;" d="M 4.109375 -3.390625 L 4.109375 -3.734375 L 3.4375 -3.734375 C 3.25 -3.734375 3.125 -3.765625 2.953125 -3.828125 L 2.765625 -3.890625 C 2.53125 -3.984375 2.296875 -4.03125 2.0625 -4.03125 C 1.25 -4.03125 0.609375 -3.40625 0.609375 -2.59375 C 0.609375 -2.046875 0.828125 -1.71875 1.421875 -1.421875 L 1.1875 -1.21875 C 1 -1.046875 0.90625 -0.9375 0.875 -0.90625 C 0.6875 -0.71875 0.640625 -0.625 0.640625 -0.46875 C 0.640625 -0.28125 0.734375 -0.1875 1.109375 -0.015625 C 0.46875 0.453125 0.25 0.734375 0.25 1.0625 C 0.25 1.515625 0.921875 1.90625 1.765625 1.90625 C 2.421875 1.90625 3.09375 1.6875 3.546875 1.3125 C 3.890625 1.046875 4.03125 0.765625 4.03125 0.421875 C 4.03125 -0.109375 3.625 -0.46875 2.96875 -0.5 L 1.84375 -0.5625 C 1.375 -0.578125 1.15625 -0.65625 1.15625 -0.796875 C 1.15625 -0.96875 1.453125 -1.28125 1.6875 -1.34375 C 2 -1.328125 2.171875 -1.296875 2.1875 -1.296875 C 2.515625 -1.296875 2.859375 -1.4375 3.125 -1.671875 C 3.421875 -1.921875 3.546875 -2.21875 3.546875 -2.65625 C 3.546875 -2.90625 3.515625 -3.109375 3.390625 -3.390625 Z M 1.28125 0.015625 C 1.578125 0.078125 2.265625 0.125 2.71875 0.125 C 3.5 0.125 3.78125 0.25 3.78125 0.5625 C 3.78125 1.0625 3.125 1.40625 2.140625 1.40625 C 1.359375 1.40625 0.859375 1.15625 0.859375 0.765625 C 0.859375 0.5625 0.9375 0.4375 1.28125 0.015625 Z M 1.328125 -2.953125 C 1.328125 -3.46875 1.578125 -3.78125 1.984375 -3.78125 C 2.25 -3.78125 2.46875 -3.625 2.609375 -3.375 C 2.78125 -3.0625 2.875 -2.671875 2.875 -2.3125 C 2.875 -1.828125 2.640625 -1.515625 2.234375 -1.515625 C 1.6875 -1.515625 1.328125 -2.09375 1.328125 -2.9375 Z M 1.328125 -2.953125 "/>
</symbol>
<symbol overflow="visible" id="glyph0-8">
<path style="stroke:none;" d="M 4.359375 1.15625 L 4.359375 0.71875 L 0.015625 0.71875 L 0.015625 1.15625 Z M 4.359375 1.15625 "/>
</symbol>
<symbol overflow="visible" id="glyph0-9">
<path style="stroke:none;" d="M 2.75 -2.75 L 2.71875 -3.953125 L 2.625 -3.953125 C 2.578125 -3.875 2.53125 -3.84375 2.484375 -3.84375 C 2.4375 -3.84375 2.34375 -3.875 2.25 -3.90625 C 2.046875 -3.984375 1.84375 -4.03125 1.640625 -4.03125 C 0.9375 -4.03125 0.453125 -3.5625 0.453125 -2.9375 C 0.453125 -2.453125 0.71875 -2.09375 1.46875 -1.6875 L 1.984375 -1.390625 C 2.28125 -1.21875 2.4375 -1 2.4375 -0.734375 C 2.4375 -0.34375 2.15625 -0.109375 1.703125 -0.109375 C 1.109375 -0.109375 0.796875 -0.4375 0.59375 -1.328125 L 0.453125 -1.328125 L 0.453125 0.03125 L 0.5625 0.03125 C 0.625 -0.046875 0.671875 -0.0625 0.765625 -0.0625 C 0.859375 -0.0625 0.96875 -0.046875 1.171875 0 C 1.40625 0.046875 1.640625 0.09375 1.8125 0.09375 C 2.5 0.09375 3.046875 -0.421875 3.046875 -1.03125 C 3.046875 -1.46875 2.828125 -1.765625 2.3125 -2.078125 L 1.359375 -2.640625 C 1.125 -2.78125 0.984375 -3 0.984375 -3.234375 C 0.984375 -3.59375 1.265625 -3.828125 1.65625 -3.828125 C 2.15625 -3.828125 2.421875 -3.53125 2.625 -2.75 Z M 2.75 -2.75 "/>
</symbol>
<symbol overflow="visible" id="glyph0-10">
<path style="stroke:none;" d="M 2.1875 -4.03125 C 1.046875 -4.03125 0.25 -3.1875 0.25 -1.984375 C 0.25 -0.78125 1.0625 0.09375 2.171875 0.09375 C 3.265625 0.09375 4.109375 -0.828125 4.109375 -2.046875 C 4.109375 -3.203125 3.3125 -4.03125 2.1875 -4.03125 Z M 2.078125 -3.78125 C 2.8125 -3.78125 3.328125 -2.9375 3.328125 -1.734375 C 3.328125 -0.75 2.9375 -0.15625 2.28125 -0.15625 C 1.9375 -0.15625 1.609375 -0.375 1.421875 -0.71875 C 1.1875 -1.171875 1.046875 -1.78125 1.046875 -2.40625 C 1.046875 -3.234375 1.4375 -3.78125 2.078125 -3.78125 Z M 2.078125 -3.78125 "/>
</symbol>
<symbol overflow="visible" id="glyph0-11">
<path style="stroke:none;" d="M 4.15625 -3.9375 L 2.96875 -3.9375 L 2.96875 -3.8125 C 3.25 -3.8125 3.390625 -3.734375 3.390625 -3.59375 C 3.390625 -3.546875 3.390625 -3.5 3.359375 -3.4375 L 2.515625 -1.03125 L 1.5 -3.234375 C 1.453125 -3.359375 1.421875 -3.484375 1.421875 -3.5625 C 1.421875 -3.734375 1.546875 -3.78125 1.921875 -3.8125 L 1.921875 -3.9375 L 0.125 -3.9375 L 0.125 -3.8125 C 0.34375 -3.78125 0.5 -3.6875 0.5625 -3.53125 L 1.5625 -1.375 C 1.671875 -1.140625 1.6875 -1.140625 1.71875 -1.046875 C 1.96875 -0.609375 2.109375 -0.28125 2.109375 -0.15625 C 2.109375 -0.015625 1.90625 0.515625 1.765625 0.78125 C 1.625 1 1.4375 1.171875 1.328125 1.171875 C 1.265625 1.171875 1.1875 1.15625 1.09375 1.109375 C 0.9375 1.046875 0.78125 1.015625 0.640625 1.015625 C 0.421875 1.015625 0.265625 1.1875 0.265625 1.40625 C 0.265625 1.6875 0.53125 1.90625 0.90625 1.90625 C 1.5 1.90625 1.90625 1.421875 2.390625 0.15625 L 3.734375 -3.40625 C 3.84375 -3.6875 3.953125 -3.78125 4.15625 -3.8125 Z M 4.15625 -3.9375 "/>
</symbol>
<symbol overflow="visible" id="glyph0-12">
<path style="stroke:none;" d="M 2.234375 -3.9375 L 1.34375 -3.9375 L 1.34375 -4.953125 C 1.34375 -5.046875 1.328125 -5.0625 1.28125 -5.0625 C 0.78125 -4.328125 0.515625 -4.03125 0.265625 -3.890625 C 0.171875 -3.828125 0.109375 -3.765625 0.109375 -3.71875 C 0.109375 -3.6875 0.125 -3.671875 0.15625 -3.65625 L 0.609375 -3.65625 L 0.609375 -1.03125 C 0.609375 -0.28125 0.875 0.09375 1.390625 0.09375 C 1.8125 0.09375 2.15625 -0.125 2.4375 -0.578125 L 2.328125 -0.671875 C 2.140625 -0.453125 2 -0.375 1.796875 -0.375 C 1.484375 -0.375 1.34375 -0.609375 1.34375 -1.15625 L 1.34375 -3.65625 L 2.234375 -3.65625 Z M 2.234375 -3.9375 "/>
</symbol>
<symbol overflow="visible" id="glyph0-13">
<path style="stroke:none;" d="M 3.484375 -1.359375 C 3.0625 -0.75 2.75 -0.546875 2.25 -0.546875 C 1.4375 -0.546875 0.890625 -1.25 0.890625 -2.25 C 0.890625 -3.15625 1.375 -3.765625 2.078125 -3.765625 C 2.390625 -3.765625 2.515625 -3.6875 2.59375 -3.34375 L 2.65625 -3.15625 C 2.71875 -2.90625 2.875 -2.75 3.078125 -2.75 C 3.296875 -2.75 3.484375 -2.921875 3.484375 -3.125 C 3.484375 -3.609375 2.875 -4.03125 2.140625 -4.03125 C 1.703125 -4.03125 1.265625 -3.84375 0.90625 -3.53125 C 0.46875 -3.15625 0.21875 -2.5625 0.21875 -1.859375 C 0.21875 -0.71875 0.90625 0.09375 1.875 0.09375 C 2.28125 0.09375 2.625 -0.046875 2.9375 -0.328125 C 3.171875 -0.53125 3.34375 -0.765625 3.609375 -1.28125 Z M 3.484375 -1.359375 "/>
</symbol>
<symbol overflow="visible" id="glyph0-14">
<path style="stroke:none;" d="M 0.046875 1.90625 L 2.15625 1.90625 L 2.15625 1.734375 C 1.5 1.734375 1.40625 1.640625 1.390625 1.078125 L 1.390625 -0.28125 C 1.703125 0 1.90625 0.09375 2.28125 0.09375 C 3.3125 0.09375 4.109375 -0.890625 4.109375 -2.15625 C 4.109375 -3.25 3.5 -4.03125 2.65625 -4.03125 C 2.15625 -4.03125 1.78125 -3.8125 1.390625 -3.328125 L 1.390625 -4 L 1.34375 -4.03125 C 0.859375 -3.84375 0.5625 -3.734375 0.078125 -3.578125 L 0.078125 -3.4375 C 0.15625 -3.453125 0.203125 -3.453125 0.296875 -3.453125 C 0.59375 -3.453125 0.65625 -3.359375 0.65625 -2.953125 L 0.65625 1.140625 C 0.65625 1.609375 0.5625 1.703125 0.046875 1.75 Z M 1.390625 -2.921875 C 1.390625 -3.1875 1.875 -3.5 2.28125 -3.5 C 2.9375 -3.5 3.359375 -2.828125 3.359375 -1.8125 C 3.359375 -0.84375 2.9375 -0.1875 2.296875 -0.1875 C 1.890625 -0.1875 1.390625 -0.5 1.390625 -0.765625 Z M 1.390625 -2.921875 "/>
</symbol>
<symbol overflow="visible" id="glyph0-15">
<path style="stroke:none;" d="M 7.546875 -5.796875 L 5.8125 -5.796875 L 3.875 -1.375 L 1.859375 -5.796875 L 0.125 -5.796875 L 0.125 -5.625 C 0.84375 -5.59375 0.9375 -5.5 0.953125 -4.84375 L 0.953125 -1.28125 C 0.9375 -0.359375 0.828125 -0.203125 0.109375 -0.171875 L 0.109375 0 L 2.15625 0 L 2.15625 -0.171875 C 1.484375 -0.203125 1.359375 -0.390625 1.34375 -1.28125 L 1.34375 -4.8125 L 3.53125 0 L 3.65625 0 L 5.890625 -5.015625 L 5.890625 -1.046875 C 5.890625 -0.3125 5.796875 -0.203125 5.09375 -0.171875 L 5.09375 0 L 7.546875 0 L 7.546875 -0.171875 C 6.921875 -0.203125 6.8125 -0.328125 6.796875 -0.953125 L 6.796875 -4.84375 C 6.8125 -5.46875 6.90625 -5.578125 7.546875 -5.625 Z M 7.546875 -5.796875 "/>
</symbol>
<symbol overflow="visible" id="glyph0-16">
<path style="stroke:none;" d="M 6.171875 -0.171875 C 5.78125 -0.1875 5.703125 -0.28125 5.390625 -0.921875 L 3.21875 -5.890625 L 3.03125 -5.890625 L 1.21875 -1.59375 C 0.65625 -0.328125 0.546875 -0.1875 0.125 -0.171875 L 0.125 0 L 1.859375 0 L 1.859375 -0.171875 C 1.4375 -0.171875 1.265625 -0.265625 1.265625 -0.53125 C 1.265625 -0.625 1.296875 -0.75 1.34375 -0.859375 L 1.734375 -1.890625 L 4.03125 -1.890625 L 4.390625 -1.046875 C 4.5 -0.8125 4.5625 -0.59375 4.5625 -0.46875 C 4.5625 -0.25 4.40625 -0.171875 3.953125 -0.171875 L 3.953125 0 L 6.171875 0 Z M 1.890625 -2.25 L 2.890625 -4.65625 L 3.90625 -2.25 Z M 1.890625 -2.25 "/>
</symbol>
<symbol overflow="visible" id="glyph0-17">
<path style="stroke:none;" d="M 0.140625 -5.625 C 0.78125 -5.5625 0.859375 -5.484375 0.875 -4.84375 L 0.875 -1.046875 C 0.859375 -0.3125 0.8125 -0.234375 0.140625 -0.171875 L 0.140625 0 L 2.59375 0 L 2.59375 -0.171875 C 1.90625 -0.1875 1.78125 -0.3125 1.765625 -0.953125 L 1.765625 -2.546875 C 2 -2.53125 2.140625 -2.515625 2.375 -2.515625 C 3.0625 -2.515625 3.53125 -2.609375 3.90625 -2.8125 C 4.421875 -3.09375 4.75 -3.625 4.75 -4.203125 C 4.75 -4.578125 4.625 -4.90625 4.390625 -5.15625 C 4.03125 -5.546875 3.265625 -5.796875 2.453125 -5.796875 L 0.140625 -5.796875 Z M 1.765625 -5.171875 C 1.765625 -5.40625 1.828125 -5.46875 2.0625 -5.46875 C 3.25 -5.46875 3.78125 -5.0625 3.78125 -4.15625 C 3.78125 -3.3125 3.265625 -2.875 2.265625 -2.875 C 2.09375 -2.875 1.96875 -2.875 1.765625 -2.890625 Z M 1.765625 -5.171875 "/>
</symbol>
<symbol overflow="visible" id="glyph0-18">
<path style="stroke:none;" d=""/>
</symbol>
<symbol overflow="visible" id="glyph0-19">
<path style="stroke:none;" d="M 0.140625 0 L 2.21875 0 L 2.21875 -0.125 C 1.640625 -0.171875 1.578125 -0.25 1.5625 -0.890625 L 1.5625 -4 L 1.53125 -4.03125 L 0.171875 -3.546875 L 0.171875 -3.40625 L 0.25 -3.421875 C 0.34375 -3.4375 0.453125 -3.453125 0.546875 -3.453125 C 0.75 -3.453125 0.828125 -3.3125 0.828125 -2.921875 L 0.828125 -0.890625 C 0.8125 -0.25 0.734375 -0.15625 0.140625 -0.125 Z M 1.125 -5.96875 C 0.890625 -5.96875 0.6875 -5.78125 0.6875 -5.53125 C 0.6875 -5.28125 0.875 -5.078125 1.125 -5.078125 C 1.375 -5.078125 1.578125 -5.28125 1.578125 -5.53125 C 1.578125 -5.78125 1.375 -5.96875 1.125 -5.96875 Z M 1.125 -5.96875 "/>
</symbol>
<symbol overflow="visible" id="glyph0-20">
<path style="stroke:none;" d="M 1.03125 0 L 3.453125 0 L 3.453125 -0.125 C 2.78125 -0.125 2.625 -0.234375 2.609375 -0.640625 L 2.609375 -5.890625 L 2.546875 -5.921875 L 0.96875 -5.125 L 0.96875 -5 C 1.3125 -5.125 1.515625 -5.1875 1.59375 -5.1875 C 1.78125 -5.1875 1.859375 -5.0625 1.859375 -4.78125 L 1.859375 -0.8125 C 1.84375 -0.265625 1.703125 -0.140625 1.03125 -0.125 Z M 1.03125 0 "/>
</symbol>
<symbol overflow="visible" id="glyph0-21">
<path style="stroke:none;" d="M 3.90625 -5.984375 C 2.90625 -5.890625 2.390625 -5.734375 1.765625 -5.28125 C 0.8125 -4.609375 0.296875 -3.609375 0.296875 -2.4375 C 0.296875 -1.6875 0.53125 -0.90625 0.90625 -0.46875 C 1.25 -0.09375 1.71875 0.125 2.25 0.125 C 3.34375 0.125 4.09375 -0.703125 4.09375 -1.921875 C 4.09375 -3.046875 3.46875 -3.75 2.4375 -3.75 C 2.0625 -3.75 1.875 -3.6875 1.328125 -3.34375 C 1.5625 -4.671875 2.546875 -5.625 3.921875 -5.84375 Z M 2.125 -3.34375 C 2.875 -3.34375 3.3125 -2.71875 3.3125 -1.625 C 3.3125 -0.65625 2.96875 -0.125 2.359375 -0.125 C 1.578125 -0.125 1.109375 -0.9375 1.109375 -2.296875 C 1.109375 -2.75 1.1875 -3 1.359375 -3.125 C 1.546875 -3.265625 1.8125 -3.34375 2.125 -3.34375 Z M 2.125 -3.34375 "/>
</symbol>
<symbol overflow="visible" id="glyph0-22">
<path style="stroke:none;" d="M 2.609375 -5.578125 L 2.609375 -5.796875 L 0.765625 -5.796875 L 0.765625 1.359375 L 2.609375 1.359375 L 2.609375 1.140625 L 1.859375 1.140625 C 1.5625 1.140625 1.4375 1 1.4375 0.6875 L 1.4375 -5.1875 C 1.4375 -5.46875 1.546875 -5.5625 1.828125 -5.578125 Z M 2.609375 -5.578125 "/>
</symbol>
<symbol overflow="visible" id="glyph0-23">
<path style="stroke:none;" d="M 4.15625 -1.203125 L 4.046875 -1.25 C 3.71875 -0.734375 3.625 -0.671875 3.21875 -0.671875 L 1.125 -0.671875 L 2.59375 -2.203125 C 3.375 -3.015625 3.703125 -3.6875 3.703125 -4.359375 C 3.703125 -5.234375 3 -5.921875 2.09375 -5.921875 C 1.609375 -5.921875 1.15625 -5.71875 0.828125 -5.375 C 0.546875 -5.078125 0.421875 -4.796875 0.265625 -4.171875 L 0.453125 -4.125 C 0.8125 -4.984375 1.109375 -5.265625 1.71875 -5.265625 C 2.46875 -5.265625 2.953125 -4.765625 2.953125 -4.03125 C 2.953125 -3.34375 2.5625 -2.53125 1.8125 -1.765625 L 0.265625 -0.109375 L 0.265625 0 L 3.671875 0 Z M 4.15625 -1.203125 "/>
</symbol>
<symbol overflow="visible" id="glyph0-24">
<path style="stroke:none;" d="M 0.296875 1.140625 L 0.296875 1.359375 L 2.140625 1.359375 L 2.140625 -5.796875 L 0.296875 -5.796875 L 0.296875 -5.578125 L 1.046875 -5.578125 C 1.34375 -5.5625 1.46875 -5.4375 1.484375 -5.125 L 1.484375 0.765625 C 1.46875 1.046875 1.375 1.140625 1.078125 1.140625 Z M 0.296875 1.140625 "/>
</symbol>
<symbol overflow="visible" id="glyph0-25">
<path style="stroke:none;" d="M 0.1875 0 L 2.25 0 L 2.25 -0.125 C 1.703125 -0.15625 1.59375 -0.25 1.59375 -0.734375 L 1.59375 -5.953125 L 1.5625 -5.96875 C 1.109375 -5.84375 0.78125 -5.734375 0.171875 -5.59375 L 0.171875 -5.453125 L 0.21875 -5.453125 C 0.3125 -5.453125 0.421875 -5.46875 0.484375 -5.46875 C 0.765625 -5.46875 0.859375 -5.34375 0.859375 -4.9375 L 0.859375 -0.765625 C 0.84375 -0.28125 0.71875 -0.171875 0.1875 -0.125 Z M 0.1875 0 "/>
</symbol>
<symbol overflow="visible" id="glyph0-26">
<path style="stroke:none;" d="M 0.046875 0 L 2.140625 0 L 2.140625 -0.125 C 1.5625 -0.15625 1.421875 -0.265625 1.40625 -0.78125 L 1.40625 -2.75 C 1.40625 -3.03125 1.765625 -3.46875 2.015625 -3.46875 C 2.0625 -3.46875 2.140625 -3.4375 2.234375 -3.34375 C 2.375 -3.21875 2.46875 -3.171875 2.59375 -3.171875 C 2.796875 -3.171875 2.9375 -3.3125 2.9375 -3.5625 C 2.9375 -3.84375 2.75 -4.03125 2.453125 -4.03125 C 2.078125 -4.03125 1.84375 -3.828125 1.40625 -3.203125 L 1.40625 -4 L 1.359375 -4.03125 C 0.859375 -3.828125 0.546875 -3.703125 0.0625 -3.546875 L 0.0625 -3.40625 C 0.1875 -3.4375 0.265625 -3.453125 0.375 -3.453125 C 0.59375 -3.453125 0.671875 -3.3125 0.671875 -2.921875 L 0.671875 -0.734375 C 0.640625 -0.28125 0.59375 -0.234375 0.046875 -0.125 Z M 0.046875 0 "/>
</symbol>
<symbol overflow="visible" id="glyph0-27">
<path style="stroke:none;" d="M 1.34375 -2.890625 C 1.859375 -2.890625 2.0625 -2.875 2.25 -2.796875 C 2.8125 -2.59375 3.140625 -2.09375 3.140625 -1.5 C 3.140625 -0.75 2.65625 -0.1875 2 -0.1875 C 1.765625 -0.1875 1.578125 -0.25 1.265625 -0.46875 C 1 -0.625 0.859375 -0.6875 0.703125 -0.6875 C 0.5 -0.6875 0.375 -0.5625 0.375 -0.375 C 0.375 -0.0625 0.75 0.125 1.359375 0.125 C 2.03125 0.125 2.71875 -0.109375 3.140625 -0.46875 C 3.546875 -0.828125 3.765625 -1.328125 3.765625 -1.921875 C 3.765625 -2.375 3.625 -2.78125 3.390625 -3.046875 C 3.203125 -3.234375 3.03125 -3.34375 2.65625 -3.515625 C 3.25 -3.921875 3.46875 -4.25 3.46875 -4.71875 C 3.46875 -5.4375 2.921875 -5.921875 2.109375 -5.921875 C 1.671875 -5.921875 1.28125 -5.765625 0.96875 -5.484375 C 0.703125 -5.234375 0.578125 -5.015625 0.390625 -4.5 L 0.53125 -4.46875 C 0.875 -5.109375 1.265625 -5.390625 1.8125 -5.390625 C 2.390625 -5.390625 2.78125 -5.015625 2.78125 -4.453125 C 2.78125 -4.140625 2.65625 -3.828125 2.4375 -3.609375 C 2.171875 -3.34375 1.921875 -3.21875 1.328125 -3 Z M 1.34375 -2.890625 "/>
</symbol>
<symbol overflow="visible" id="glyph0-28">
<path style="stroke:none;" d="M 0.515625 0.1875 C 1.5 0.078125 1.984375 -0.09375 2.578125 -0.515625 C 3.484375 -1.1875 4.015625 -2.265625 4.015625 -3.453125 C 4.015625 -4.890625 3.21875 -5.921875 2.078125 -5.921875 C 1.046875 -5.921875 0.265625 -5.03125 0.265625 -3.84375 C 0.265625 -2.78125 0.890625 -2.078125 1.84375 -2.078125 C 2.3125 -2.078125 2.6875 -2.21875 3.15625 -2.578125 C 2.796875 -1.140625 1.8125 -0.203125 0.484375 0.015625 Z M 3.171875 -3.109375 C 3.171875 -2.9375 3.125 -2.859375 3.03125 -2.78125 C 2.796875 -2.578125 2.46875 -2.453125 2.15625 -2.453125 C 1.484375 -2.453125 1.0625 -3.109375 1.0625 -4.140625 C 1.0625 -4.640625 1.203125 -5.171875 1.390625 -5.40625 C 1.546875 -5.578125 1.765625 -5.671875 2.015625 -5.671875 C 2.78125 -5.671875 3.171875 -4.921875 3.171875 -3.453125 Z M 3.171875 -3.109375 "/>
</symbol>
<symbol overflow="visible" id="glyph0-29">
<path style="stroke:none;" d="M 2.53125 -3.25 C 3.40625 -3.71875 3.703125 -4.078125 3.703125 -4.671875 C 3.703125 -5.40625 3.09375 -5.921875 2.203125 -5.921875 C 1.25 -5.921875 0.546875 -5.328125 0.546875 -4.53125 C 0.546875 -3.96875 0.703125 -3.703125 1.625 -2.90625 C 0.671875 -2.171875 0.484375 -1.921875 0.484375 -1.328125 C 0.484375 -0.46875 1.171875 0.125 2.171875 0.125 C 3.21875 0.125 3.890625 -0.453125 3.890625 -1.359375 C 3.890625 -2.03125 3.59375 -2.453125 2.53125 -3.25 Z M 2.375 -2.34375 C 3.015625 -1.890625 3.234375 -1.578125 3.234375 -1.078125 C 3.234375 -0.515625 2.828125 -0.125 2.265625 -0.125 C 1.59375 -0.125 1.15625 -0.625 1.15625 -1.375 C 1.15625 -1.953125 1.34375 -2.3125 1.859375 -2.734375 Z M 2.28125 -3.40625 C 1.5 -3.90625 1.1875 -4.3125 1.1875 -4.796875 C 1.1875 -5.3125 1.578125 -5.671875 2.140625 -5.671875 C 2.734375 -5.671875 3.109375 -5.28125 3.109375 -4.6875 C 3.109375 -4.140625 2.875 -3.796875 2.28125 -3.40625 Z M 2.28125 -3.40625 "/>
</symbol>
<symbol overflow="visible" id="glyph0-30">
<path style="stroke:none;" d="M 4.296875 -0.5 C 4.1875 -0.5 4.125 -0.5 4.09375 -0.5 C 3.78125 -0.5 3.703125 -0.59375 3.703125 -1 L 3.703125 -5.953125 L 3.671875 -5.96875 C 3.25 -5.84375 2.953125 -5.734375 2.375 -5.59375 L 2.375 -5.453125 C 2.453125 -5.453125 2.5 -5.453125 2.578125 -5.453125 C 2.890625 -5.453125 2.96875 -5.375 2.96875 -5.015625 L 2.96875 -3.65625 C 2.640625 -3.921875 2.40625 -4.03125 2.0625 -4.03125 C 1.046875 -4.03125 0.234375 -3.03125 0.234375 -1.796875 C 0.234375 -0.671875 0.890625 0.09375 1.859375 0.09375 C 2.34375 0.09375 2.671875 -0.09375 2.96875 -0.5 L 2.96875 0.0625 L 3.015625 0.09375 L 4.296875 -0.375 Z M 2.96875 -0.890625 C 2.96875 -0.828125 2.90625 -0.71875 2.828125 -0.625 C 2.671875 -0.453125 2.453125 -0.375 2.203125 -0.375 C 1.46875 -0.375 0.984375 -1.0625 0.984375 -2.15625 C 0.984375 -3.125 1.421875 -3.78125 2.078125 -3.78125 C 2.5625 -3.78125 2.96875 -3.375 2.96875 -2.90625 Z M 2.96875 -0.890625 "/>
</symbol>
<symbol overflow="visible" id="glyph0-31">
<path style="stroke:none;" d="M 2.703125 -3.9375 L 1.625 -3.9375 L 1.625 -4.953125 C 1.625 -5.46875 1.796875 -5.734375 2.125 -5.734375 C 2.3125 -5.734375 2.4375 -5.640625 2.59375 -5.390625 C 2.734375 -5.15625 2.828125 -5.078125 2.984375 -5.078125 C 3.1875 -5.078125 3.34375 -5.234375 3.34375 -5.4375 C 3.34375 -5.75 2.96875 -5.96875 2.4375 -5.96875 C 1.890625 -5.96875 1.4375 -5.734375 1.203125 -5.34375 C 0.984375 -4.953125 0.90625 -4.640625 0.90625 -3.9375 L 0.1875 -3.9375 L 0.1875 -3.65625 L 0.90625 -3.65625 L 0.90625 -0.90625 C 0.890625 -0.25 0.796875 -0.15625 0.171875 -0.125 L 0.171875 0 L 2.453125 0 L 2.453125 -0.125 C 1.734375 -0.15625 1.640625 -0.25 1.640625 -0.90625 L 1.640625 -3.65625 L 2.703125 -3.65625 Z M 2.703125 -3.9375 "/>
</symbol>
<symbol overflow="visible" id="glyph0-32">
<path style="stroke:none;" d="M 4.265625 -0.125 C 3.78125 -0.203125 3.75 -0.265625 3.734375 -0.890625 L 3.734375 -2.640625 C 3.734375 -3.546875 3.375 -4.03125 2.65625 -4.03125 C 2.140625 -4.03125 1.78125 -3.8125 1.375 -3.296875 L 1.375 -5.953125 L 1.328125 -5.96875 C 1.03125 -5.875 0.8125 -5.796875 0.328125 -5.65625 L 0.09375 -5.59375 L 0.09375 -5.453125 C 0.125 -5.453125 0.140625 -5.453125 0.1875 -5.453125 C 0.5625 -5.453125 0.640625 -5.390625 0.640625 -5.015625 L 0.640625 -0.890625 C 0.625 -0.265625 0.578125 -0.1875 0.078125 -0.125 L 0.078125 0 L 1.96875 0 L 1.96875 -0.125 C 1.46875 -0.171875 1.390625 -0.265625 1.375 -0.890625 L 1.375 -3 C 1.734375 -3.40625 2 -3.546875 2.359375 -3.546875 C 2.78125 -3.546875 3 -3.234375 3 -2.625 L 3 -0.890625 C 2.984375 -0.265625 2.90625 -0.171875 2.40625 -0.125 L 2.40625 0 L 4.265625 0 Z M 4.265625 -0.125 "/>
</symbol>
<symbol overflow="visible" id="glyph0-33">
<path style="stroke:none;" d=""/>
</symbol>
<symbol overflow="visible" id="glyph0-34">
<path style="stroke:none;" d="M 0.9375 1.234375 C 1.546875 0.9375 1.921875 0.40625 1.921875 -0.109375 C 1.921875 -0.5625 1.609375 -0.890625 1.21875 -0.890625 C 0.90625 -0.890625 0.703125 -0.703125 0.703125 -0.40625 C 0.703125 -0.109375 0.890625 0.046875 1.21875 0.046875 C 1.28125 0.046875 1.34375 0.046875 1.390625 0.03125 C 1.4375 0.015625 1.4375 0.015625 1.453125 0.015625 C 1.515625 0.015625 1.578125 0.0625 1.578125 0.140625 C 1.578125 0.421875 1.328125 0.75 0.859375 1.0625 Z M 1.1875 -4.015625 C 0.921875 -4.015625 0.703125 -3.796875 0.703125 -3.515625 C 0.703125 -3.265625 0.921875 -3.046875 1.1875 -3.046875 C 1.453125 -3.046875 1.6875 -3.265625 1.6875 -3.515625 C 1.6875 -3.78125 1.453125 -4.015625 1.1875 -4.015625 Z M 1.1875 -4.015625 "/>
</symbol>
<symbol overflow="visible" id="glyph0-35">
<path style="stroke:none;" d="M 1.34375 -5.953125 L 1.296875 -5.96875 C 0.9375 -5.859375 0.703125 -5.78125 0.28125 -5.65625 L 0.03125 -5.59375 L 0.03125 -5.453125 C 0.078125 -5.453125 0.109375 -5.453125 0.171875 -5.453125 C 0.53125 -5.453125 0.609375 -5.375 0.609375 -5.015625 L 0.609375 -0.46875 C 0.609375 -0.203125 1.34375 0.09375 2.046875 0.09375 C 3.203125 0.09375 4.09375 -0.875 4.09375 -2.125 C 4.09375 -3.21875 3.4375 -4.03125 2.5625 -4.03125 C 2.015625 -4.03125 1.515625 -3.71875 1.34375 -3.28125 Z M 1.34375 -2.8125 C 1.34375 -3.15625 1.75 -3.46875 2.203125 -3.46875 C 2.453125 -3.46875 2.671875 -3.390625 2.859375 -3.21875 C 3.125 -2.953125 3.328125 -2.359375 3.328125 -1.71875 C 3.328125 -0.75 2.90625 -0.1875 2.1875 -0.1875 C 1.734375 -0.1875 1.34375 -0.390625 1.34375 -0.609375 Z M 1.34375 -2.8125 "/>
</symbol>
<symbol overflow="visible" id="glyph0-36">
<path style="stroke:none;" d="M 4.1875 -0.4375 L 4.140625 -0.4375 C 3.71875 -0.453125 3.65625 -0.53125 3.65625 -0.9375 L 3.65625 -3.9375 L 2.265625 -3.9375 L 2.265625 -3.78125 C 2.8125 -3.765625 2.90625 -3.671875 2.90625 -3.234375 L 2.90625 -1.1875 C 2.90625 -0.9375 2.875 -0.8125 2.75 -0.71875 C 2.515625 -0.53125 2.234375 -0.421875 1.984375 -0.421875 C 1.640625 -0.421875 1.359375 -0.71875 1.359375 -1.078125 L 1.359375 -3.9375 L 0.078125 -3.9375 L 0.078125 -3.8125 C 0.484375 -3.796875 0.609375 -3.671875 0.625 -3.25 L 0.625 -1.046875 C 0.625 -0.359375 1.046875 0.09375 1.6875 0.09375 C 2 0.09375 2.34375 -0.046875 2.578125 -0.28125 L 2.953125 -0.671875 L 2.953125 0.0625 L 3 0.078125 C 3.4375 -0.09375 3.75 -0.1875 4.1875 -0.3125 Z M 4.1875 -0.4375 "/>
</symbol>
<symbol overflow="visible" id="glyph0-37">
<path style="stroke:none;" d="M 2.4375 0 L 4.1875 0 L 4.1875 -0.125 C 3.921875 -0.125 3.75 -0.265625 3.46875 -0.65625 L 2.359375 -2.375 L 3.078125 -3.421875 C 3.25 -3.65625 3.5 -3.78125 3.78125 -3.8125 L 3.78125 -3.9375 L 2.40625 -3.9375 L 2.40625 -3.8125 C 2.671875 -3.78125 2.75 -3.734375 2.75 -3.609375 C 2.75 -3.515625 2.65625 -3.3125 2.4375 -3.046875 C 2.390625 -3 2.28125 -2.828125 2.171875 -2.65625 L 2.09375 -2.765625 C 1.96875 -2.96875 1.890625 -3.078125 1.875 -3.109375 C 1.703125 -3.390625 1.640625 -3.53125 1.640625 -3.609375 C 1.640625 -3.75 1.765625 -3.796875 2.015625 -3.8125 L 2.015625 -3.9375 L 0.203125 -3.9375 L 0.203125 -3.8125 L 0.28125 -3.8125 C 0.546875 -3.8125 0.6875 -3.6875 0.96875 -3.28125 L 1.78125 -2.015625 L 0.78125 -0.578125 C 0.53125 -0.21875 0.4375 -0.15625 0.15625 -0.125 L 0.15625 0 L 1.421875 0 L 1.421875 -0.125 C 1.15625 -0.125 1.0625 -0.171875 1.0625 -0.28125 C 1.0625 -0.34375 1.125 -0.46875 1.25 -0.640625 L 1.9375 -1.71875 L 2.734375 -0.5 C 2.765625 -0.453125 2.78125 -0.40625 2.78125 -0.34375 C 2.78125 -0.1875 2.71875 -0.15625 2.4375 -0.125 Z M 2.4375 0 "/>
</symbol>
</g>
</defs>
<g id="surface1">
<path style=" stroke:none;fill-rule:nonzero;fill:rgb(100%,100%,100%);fill-opacity:1;" d="M 0 229.921875 L 0 0.078125 L 541 0.078125 L 541 229.921875 Z M 0 229.921875 "/>
<path style="fill:none;stroke-width:1;stroke-linecap:butt;stroke-linejoin:miter;stroke:rgb(88.627452%,49.019608%,83.92157%);stroke-opacity:1;stroke-miterlimit:4;" d="M 346.000372 -323.999842 C 346.000372 -304.117307 281.527771 -287.999882 202.002397 -287.999882 C 122.470775 -287.999882 57.998174 -304.117307 57.998174 -323.999842 C 57.998174 -343.882378 122.470775 -359.999803 202.002397 -359.999803 C 281.527771 -359.999803 346.000372 -343.882378 346.000372 -323.999842 Z M 346.000372 -323.999842 " transform="matrix(0.625144,0,0,0.624567,2.500578,227.421998)"/>
<g style="fill:rgb(0%,0%,0%);fill-opacity:1;">
  <use xlink:href="#glyph0-1" x="112.214844" y="22.687262"/>
  <use xlink:href="#glyph0-2" x="116.590855" y="22.687262"/>
  <use xlink:href="#glyph0-3" x="120.341721" y="22.687262"/>
  <use xlink:href="#glyph0-4" x="127.21831" y="22.687262"/>
  <use xlink:href="#glyph0-5" x="130.969176" y="22.687262"/>
  <use xlink:href="#glyph0-4" x="133.469754" y="22.687262"/>
  <use xlink:href="#glyph0-6" x="137.220621" y="22.687262"/>
  <use xlink:href="#glyph0-7" x="139.096054" y="22.687262"/>
  <use xlink:href="#glyph0-6" x="143.472065" y="22.687262"/>
</g>
<g style="fill:rgb(0%,0%,0%);fill-opacity:1;">
  <use xlink:href="#glyph0-8" x="63.140625" y="32.058356"/>
  <use xlink:href="#glyph0-9" x="67.516636" y="32.058356"/>
  <use xlink:href="#glyph0-10" x="70.642358" y="32.058356"/>
  <use xlink:href="#glyph0-3" x="75.018369" y="32.058356"/>
  <use xlink:href="#glyph0-4" x="81.894958" y="32.058356"/>
  <use xlink:href="#glyph0-9" x="85.645824" y="32.058356"/>
  <use xlink:href="#glyph0-11" x="88.771546" y="32.058356"/>
  <use xlink:href="#glyph0-9" x="93.147557" y="32.058356"/>
  <use xlink:href="#glyph0-12" x="96.273279" y="32.058356"/>
  <use xlink:href="#glyph0-4" x="98.773857" y="32.058356"/>
  <use xlink:href="#glyph0-3" x="102.524724" y="32.058356"/>
  <use xlink:href="#glyph0-8" x="109.401312" y="32.058356"/>
  <use xlink:href="#glyph0-9" x="113.777323" y="32.058356"/>
  <use xlink:href="#glyph0-10" x="116.903045" y="32.058356"/>
  <use xlink:href="#glyph0-3" x="121.279056" y="32.058356"/>
  <use xlink:href="#glyph0-4" x="128.155645" y="32.058356"/>
  <use xlink:href="#glyph0-13" x="131.906512" y="32.058356"/>
  <use xlink:href="#glyph0-10" x="135.657378" y="32.058356"/>
  <use xlink:href="#glyph0-3" x="140.033389" y="32.058356"/>
  <use xlink:href="#glyph0-14" x="146.909978" y="32.058356"/>
  <use xlink:href="#glyph0-10" x="151.285989" y="32.058356"/>
  <use xlink:href="#glyph0-1" x="155.662" y="32.058356"/>
  <use xlink:href="#glyph0-4" x="160.038011" y="32.058356"/>
  <use xlink:href="#glyph0-1" x="163.788877" y="32.058356"/>
  <use xlink:href="#glyph0-12" x="168.164888" y="32.058356"/>
  <use xlink:href="#glyph0-8" x="170.665466" y="32.058356"/>
  <use xlink:href="#glyph0-15" x="175.041477" y="32.058356"/>
  <use xlink:href="#glyph0-16" x="183.168354" y="32.058356"/>
  <use xlink:href="#glyph0-17" x="189.419799" y="32.058356"/>
</g>
<path style="fill:none;stroke-width:2;stroke-linecap:butt;stroke-linejoin:miter;stroke:rgb(0%,0%,0%);stroke-opacity:1;stroke-dasharray:1,5;stroke-miterlimit:4;" d="M 346.150338 -323.999842 C 467.547285 -323.999842 625.560772 -323.999842 651.829702 -323.999842 " transform="matrix(0.625144,0,0,0.624567,2.500578,227.421998)"/>
<path style="fill:none;stroke-width:1;stroke-linecap:butt;stroke-linejoin:miter;stroke:rgb(88.627452%,49.019608%,83.92157%);stroke-opacity:1;stroke-miterlimit:4;" d="M 346.000372 -251.999921 C 346.000372 -232.117386 281.527771 -215.999961 202.002397 -215.999961 C 122.470775 -215.999961 57.998174 -232.117386 57.998174 -251.999921 C 57.998174 -271.882457 122.470775 -287.999882 202.002397 -287.999882 C 281.527771 -287.999882 346.000372 -271.882457 346.000372 -251.999921 Z M 346.000372 -251.999921 " transform="matrix(0.625144,0,0,0.624567,2.500578,227.421998)"/>
<g style="fill:rgb(0%,0%,0%);fill-opacity:1;">
  <use xlink:href="#glyph0-12" x="114.402344" y="67.656012"/>
  <use xlink:href="#glyph0-11" x="116.902921" y="67.656012"/>
  <use xlink:href="#glyph0-14" x="121.278932" y="67.656012"/>
  <use xlink:href="#glyph0-4" x="125.654943" y="67.656012"/>
  <use xlink:href="#glyph0-18" x="129.40581" y="67.656012"/>
  <use xlink:href="#glyph0-4" x="131.281243" y="67.656012"/>
  <use xlink:href="#glyph0-6" x="135.03211" y="67.656012"/>
  <use xlink:href="#glyph0-7" x="136.907543" y="67.656012"/>
  <use xlink:href="#glyph0-6" x="141.283554" y="67.656012"/>
</g>
<g style="fill:rgb(0%,0%,0%);fill-opacity:1;">
  <use xlink:href="#glyph0-9" x="107.523437" y="77.027106"/>
  <use xlink:href="#glyph0-19" x="110.64916" y="77.027106"/>
  <use xlink:href="#glyph0-1" x="113.149737" y="77.027106"/>
  <use xlink:href="#glyph0-12" x="117.525748" y="77.027106"/>
  <use xlink:href="#glyph0-20" x="120.026326" y="77.027106"/>
  <use xlink:href="#glyph0-21" x="124.402337" y="77.027106"/>
  <use xlink:href="#glyph0-18" x="128.778348" y="77.027106"/>
  <use xlink:href="#glyph0-22" x="130.653781" y="77.027106"/>
  <use xlink:href="#glyph0-20" x="133.779503" y="77.027106"/>
  <use xlink:href="#glyph0-23" x="138.155514" y="77.027106"/>
  <use xlink:href="#glyph0-23" x="142.531525" y="77.027106"/>
  <use xlink:href="#glyph0-24" x="146.907536" y="77.027106"/>
</g>
<path style="fill:none;stroke-width:1;stroke-linecap:butt;stroke-linejoin:miter;stroke:rgb(88.627452%,49.019608%,83.92157%);stroke-opacity:1;stroke-miterlimit:4;" d="M 511.599606 -287.999882 L 439.597494 -287.999882 L 439.597494 -215.999961 L 511.599606 -215.999961 Z M 511.599606 -287.999882 " transform="matrix(0.625144,0,0,0.624567,2.500578,227.421998)"/>
<g style="fill:rgb(0%,0%,0%);fill-opacity:1;">
  <use xlink:href="#glyph0-9" x="289.191406" y="72.343512"/>
  <use xlink:href="#glyph0-19" x="292.317128" y="72.343512"/>
  <use xlink:href="#glyph0-1" x="294.817706" y="72.343512"/>
  <use xlink:href="#glyph0-12" x="299.193717" y="72.343512"/>
  <use xlink:href="#glyph0-20" x="301.694295" y="72.343512"/>
  <use xlink:href="#glyph0-21" x="306.070306" y="72.343512"/>
</g>
<path style="fill:none;stroke-width:2;stroke-linecap:butt;stroke-linejoin:miter;stroke:rgb(0%,0%,0%);stroke-opacity:1;stroke-dasharray:1,5;stroke-miterlimit:4;" d="M 346.012869 -251.999921 C 378.461621 -251.999921 410.372997 -251.999921 434.398695 -251.999921 " transform="matrix(0.625144,0,0,0.624567,2.500578,227.421998)"/>
<path style="fill-rule:nonzero;fill:rgb(0%,0%,0%);fill-opacity:1;stroke-width:2;stroke-linecap:butt;stroke-linejoin:miter;stroke:rgb(0%,0%,0%);stroke-opacity:1;stroke-miterlimit:4;" d="M 434.411192 -253.751135 L 439.410037 -251.999921 L 434.411192 -250.248707 Z M 434.411192 -253.751135 " transform="matrix(0.625144,0,0,0.624567,2.500578,227.421998)"/>
<g style="fill:rgb(0%,0%,0%);fill-opacity:1;">
  <use xlink:href="#glyph0-9" x="230.496094" y="77.027106"/>
  <use xlink:href="#glyph0-14" x="233.621816" y="77.027106"/>
  <use xlink:href="#glyph0-25" x="237.997827" y="77.027106"/>
  <use xlink:href="#glyph0-19" x="240.498405" y="77.027106"/>
  <use xlink:href="#glyph0-12" x="242.998982" y="77.027106"/>
  <use xlink:href="#glyph0-18" x="245.49956" y="77.027106"/>
  <use xlink:href="#glyph0-12" x="247.374993" y="77.027106"/>
  <use xlink:href="#glyph0-11" x="249.875571" y="77.027106"/>
  <use xlink:href="#glyph0-14" x="254.251582" y="77.027106"/>
  <use xlink:href="#glyph0-4" x="258.627593" y="77.027106"/>
</g>
<path style="fill:none;stroke-width:2;stroke-linecap:butt;stroke-linejoin:miter;stroke:rgb(0%,0%,0%);stroke-opacity:1;stroke-dasharray:1,5;stroke-miterlimit:4;" d="M 308.259094 -227.570483 C 476.501466 -188.899921 788.948017 -117.068867 824.977191 -108.788125 " transform="matrix(0.625144,0,0,0.624567,2.500578,227.421998)"/>
<path style="fill:none;stroke-width:1;stroke-linecap:butt;stroke-linejoin:miter;stroke:rgb(88.627452%,49.019608%,83.92157%);stroke-opacity:1;stroke-miterlimit:4;" d="M 346.000372 -180 C 346.000372 -160.117464 281.527771 -144.000039 202.002397 -144.000039 C 122.470775 -144.000039 57.998174 -160.117464 57.998174 -180 C 57.998174 -199.882536 122.470775 -215.999961 202.002397 -215.999961 C 281.527771 -215.999961 346.000372 -199.882536 346.000372 -180 Z M 346.000372 -180 " transform="matrix(0.625144,0,0,0.624567,2.500578,227.421998)"/>
<g style="fill:rgb(0%,0%,0%);fill-opacity:1;">
  <use xlink:href="#glyph0-14" x="96.898438" y="112.624762"/>
  <use xlink:href="#glyph0-12" x="101.274448" y="112.624762"/>
  <use xlink:href="#glyph0-26" x="103.775026" y="112.624762"/>
  <use xlink:href="#glyph0-18" x="106.900748" y="112.624762"/>
  <use xlink:href="#glyph0-10" x="108.776182" y="112.624762"/>
  <use xlink:href="#glyph0-1" x="113.152193" y="112.624762"/>
  <use xlink:href="#glyph0-18" x="117.528203" y="112.624762"/>
  <use xlink:href="#glyph0-12" x="119.403637" y="112.624762"/>
  <use xlink:href="#glyph0-11" x="121.904214" y="112.624762"/>
  <use xlink:href="#glyph0-14" x="126.280225" y="112.624762"/>
  <use xlink:href="#glyph0-4" x="130.656236" y="112.624762"/>
  <use xlink:href="#glyph0-9" x="134.407103" y="112.624762"/>
  <use xlink:href="#glyph0-26" x="137.532825" y="112.624762"/>
  <use xlink:href="#glyph0-13" x="140.658547" y="112.624762"/>
  <use xlink:href="#glyph0-5" x="144.409414" y="112.624762"/>
  <use xlink:href="#glyph0-18" x="146.909991" y="112.624762"/>
  <use xlink:href="#glyph0-4" x="148.785425" y="112.624762"/>
  <use xlink:href="#glyph0-6" x="152.536291" y="112.624762"/>
  <use xlink:href="#glyph0-7" x="154.411725" y="112.624762"/>
  <use xlink:href="#glyph0-6" x="158.787735" y="112.624762"/>
</g>
<g style="fill:rgb(0%,0%,0%);fill-opacity:1;">
  <use xlink:href="#glyph0-20" x="95.960938" y="121.995856"/>
  <use xlink:href="#glyph0-27" x="100.336948" y="121.995856"/>
  <use xlink:href="#glyph0-28" x="104.712959" y="121.995856"/>
  <use xlink:href="#glyph0-29" x="109.08897" y="121.995856"/>
  <use xlink:href="#glyph0-27" x="113.464981" y="121.995856"/>
  <use xlink:href="#glyph0-23" x="117.840992" y="121.995856"/>
  <use xlink:href="#glyph0-29" x="122.217003" y="121.995856"/>
  <use xlink:href="#glyph0-29" x="126.593014" y="121.995856"/>
  <use xlink:href="#glyph0-29" x="130.969025" y="121.995856"/>
  <use xlink:href="#glyph0-27" x="135.345036" y="121.995856"/>
  <use xlink:href="#glyph0-28" x="139.721047" y="121.995856"/>
  <use xlink:href="#glyph0-21" x="144.097058" y="121.995856"/>
  <use xlink:href="#glyph0-21" x="148.473069" y="121.995856"/>
  <use xlink:href="#glyph0-29" x="152.84908" y="121.995856"/>
  <use xlink:href="#glyph0-29" x="157.225091" y="121.995856"/>
</g>
<path style="fill:none;stroke-width:1;stroke-linecap:butt;stroke-linejoin:miter;stroke:rgb(88.627452%,49.019608%,83.92157%);stroke-opacity:1;stroke-miterlimit:4;" d="M 310.002441 -36.000158 C 310.002441 -16.117622 261.644865 -0.000197281 202.002397 -0.000197281 C 142.353681 -0.000197281 94.002354 -16.117622 94.002354 -36.000158 C 94.002354 -55.882693 142.353681 -72.000118 202.002397 -72.000118 C 261.644865 -72.000118 310.002441 -55.882693 310.002441 -36.000158 Z M 310.002441 -36.000158 " transform="matrix(0.625144,0,0,0.624567,2.500578,227.421998)"/>
<g style="fill:rgb(0%,0%,0%);fill-opacity:1;">
  <use xlink:href="#glyph0-12" x="78.457031" y="207.249762"/>
  <use xlink:href="#glyph0-11" x="80.957609" y="207.249762"/>
  <use xlink:href="#glyph0-14" x="85.33362" y="207.249762"/>
  <use xlink:href="#glyph0-4" x="89.709631" y="207.249762"/>
  <use xlink:href="#glyph0-30" x="93.460497" y="207.249762"/>
  <use xlink:href="#glyph0-4" x="97.836508" y="207.249762"/>
  <use xlink:href="#glyph0-31" x="101.587375" y="207.249762"/>
  <use xlink:href="#glyph0-18" x="104.713097" y="207.249762"/>
  <use xlink:href="#glyph0-9" x="106.58853" y="207.249762"/>
  <use xlink:href="#glyph0-19" x="109.714252" y="207.249762"/>
  <use xlink:href="#glyph0-7" x="111.589686" y="207.249762"/>
  <use xlink:href="#glyph0-1" x="115.965697" y="207.249762"/>
  <use xlink:href="#glyph0-4" x="120.341708" y="207.249762"/>
  <use xlink:href="#glyph0-30" x="124.092574" y="207.249762"/>
  <use xlink:href="#glyph0-18" x="128.468585" y="207.249762"/>
  <use xlink:href="#glyph0-9" x="130.344018" y="207.249762"/>
  <use xlink:href="#glyph0-32" x="133.469741" y="207.249762"/>
  <use xlink:href="#glyph0-10" x="137.845752" y="207.249762"/>
  <use xlink:href="#glyph0-26" x="142.221763" y="207.249762"/>
  <use xlink:href="#glyph0-12" x="145.347485" y="207.249762"/>
  <use xlink:href="#glyph0-18" x="147.848062" y="207.249762"/>
  <use xlink:href="#glyph0-33" x="149.723496" y="207.249762"/>
  <use xlink:href="#glyph0-33" x="151.598929" y="207.249762"/>
  <use xlink:href="#glyph0-33" x="153.474362" y="207.249762"/>
  <use xlink:href="#glyph0-9" x="155.349795" y="207.249762"/>
  <use xlink:href="#glyph0-19" x="158.475518" y="207.249762"/>
  <use xlink:href="#glyph0-1" x="160.976095" y="207.249762"/>
  <use xlink:href="#glyph0-12" x="165.352106" y="207.249762"/>
  <use xlink:href="#glyph0-20" x="167.852684" y="207.249762"/>
  <use xlink:href="#glyph0-21" x="172.228695" y="207.249762"/>
  <use xlink:href="#glyph0-34" x="176.604706" y="207.249762"/>
</g>
<path style="fill:none;stroke-width:2;stroke-linecap:butt;stroke-linejoin:miter;stroke:rgb(0%,0%,0%);stroke-opacity:1;stroke-dasharray:1,5;stroke-miterlimit:4;" d="M 202.002397 -143.662305 C 202.002397 -123.460799 202.002397 -98.249568 202.002397 -77.297541 " transform="matrix(0.625144,0,0,0.624567,2.500578,227.421998)"/>
<path style="fill-rule:nonzero;fill:rgb(0%,0%,0%);fill-opacity:1;stroke-width:2;stroke-linecap:butt;stroke-linejoin:miter;stroke:rgb(0%,0%,0%);stroke-opacity:1;stroke-miterlimit:4;" d="M 203.751993 -77.07864 L 202.002397 -72.081425 L 200.252802 -77.07864 Z M 203.751993 -77.07864 " transform="matrix(0.625144,0,0,0.624567,2.500578,227.421998)"/>
<g style="fill:rgb(0%,0%,0%);fill-opacity:1;">
  <use xlink:href="#glyph0-7" x="30.632812" y="146.67945"/>
  <use xlink:href="#glyph0-4" x="35.008823" y="146.67945"/>
  <use xlink:href="#glyph0-12" x="38.75969" y="146.67945"/>
  <use xlink:href="#glyph0-18" x="41.260268" y="146.67945"/>
  <use xlink:href="#glyph0-35" x="43.135701" y="146.67945"/>
  <use xlink:href="#glyph0-36" x="47.511712" y="146.67945"/>
  <use xlink:href="#glyph0-19" x="51.887723" y="146.67945"/>
  <use xlink:href="#glyph0-25" x="54.388301" y="146.67945"/>
  <use xlink:href="#glyph0-30" x="56.888878" y="146.67945"/>
  <use xlink:href="#glyph0-18" x="61.264889" y="146.67945"/>
  <use xlink:href="#glyph0-19" x="63.140323" y="146.67945"/>
  <use xlink:href="#glyph0-1" x="65.6409" y="146.67945"/>
  <use xlink:href="#glyph0-18" x="70.016911" y="146.67945"/>
  <use xlink:href="#glyph0-12" x="71.892344" y="146.67945"/>
  <use xlink:href="#glyph0-11" x="74.392922" y="146.67945"/>
  <use xlink:href="#glyph0-14" x="78.768933" y="146.67945"/>
  <use xlink:href="#glyph0-4" x="83.144944" y="146.67945"/>
  <use xlink:href="#glyph0-18" x="86.895811" y="146.67945"/>
  <use xlink:href="#glyph0-4" x="88.771244" y="146.67945"/>
  <use xlink:href="#glyph0-6" x="92.52211" y="146.67945"/>
  <use xlink:href="#glyph0-7" x="94.397544" y="146.67945"/>
  <use xlink:href="#glyph0-6" x="98.773555" y="146.67945"/>
</g>
<g style="fill:rgb(0%,0%,0%);fill-opacity:1;">
  <use xlink:href="#glyph0-12" x="19.378906" y="156.046637"/>
  <use xlink:href="#glyph0-11" x="21.879484" y="156.046637"/>
  <use xlink:href="#glyph0-14" x="26.255495" y="156.046637"/>
  <use xlink:href="#glyph0-4" x="30.631506" y="156.046637"/>
  <use xlink:href="#glyph0-30" x="34.382372" y="156.046637"/>
  <use xlink:href="#glyph0-4" x="38.758383" y="156.046637"/>
  <use xlink:href="#glyph0-31" x="42.50925" y="156.046637"/>
  <use xlink:href="#glyph0-18" x="45.634972" y="156.046637"/>
  <use xlink:href="#glyph0-9" x="47.510405" y="156.046637"/>
  <use xlink:href="#glyph0-19" x="50.636127" y="156.046637"/>
  <use xlink:href="#glyph0-7" x="52.511561" y="156.046637"/>
  <use xlink:href="#glyph0-1" x="56.887572" y="156.046637"/>
  <use xlink:href="#glyph0-4" x="61.263583" y="156.046637"/>
  <use xlink:href="#glyph0-30" x="65.014449" y="156.046637"/>
  <use xlink:href="#glyph0-18" x="69.39046" y="156.046637"/>
  <use xlink:href="#glyph0-9" x="71.265893" y="156.046637"/>
  <use xlink:href="#glyph0-32" x="74.391616" y="156.046637"/>
  <use xlink:href="#glyph0-10" x="78.767627" y="156.046637"/>
  <use xlink:href="#glyph0-26" x="83.143638" y="156.046637"/>
  <use xlink:href="#glyph0-12" x="86.26936" y="156.046637"/>
  <use xlink:href="#glyph0-18" x="88.769937" y="156.046637"/>
  <use xlink:href="#glyph0-9" x="90.645371" y="156.046637"/>
  <use xlink:href="#glyph0-19" x="93.771093" y="156.046637"/>
  <use xlink:href="#glyph0-1" x="96.27167" y="156.046637"/>
  <use xlink:href="#glyph0-12" x="100.647681" y="156.046637"/>
  <use xlink:href="#glyph0-20" x="103.148259" y="156.046637"/>
  <use xlink:href="#glyph0-21" x="107.52427" y="156.046637"/>
</g>
<path style="fill:none;stroke-width:1;stroke-linecap:butt;stroke-linejoin:miter;stroke:rgb(88.627452%,49.019608%,83.92157%);stroke-opacity:1;stroke-miterlimit:4;" d="M 857.400949 -287.999882 L 799.401851 -287.999882 L 799.401851 -215.999961 L 857.400949 -215.999961 Z M 857.400949 -287.999882 " transform="matrix(0.625144,0,0,0.624567,2.500578,227.421998)"/>
<g style="fill:rgb(0%,0%,0%);fill-opacity:1;">
  <use xlink:href="#glyph0-22" x="510.679687" y="72.343512"/>
  <use xlink:href="#glyph0-20" x="513.80541" y="72.343512"/>
  <use xlink:href="#glyph0-23" x="518.181421" y="72.343512"/>
  <use xlink:href="#glyph0-23" x="522.557432" y="72.343512"/>
  <use xlink:href="#glyph0-24" x="526.933443" y="72.343512"/>
</g>
<path style="fill:none;stroke-width:1;stroke-linecap:butt;stroke-linejoin:miter;stroke:rgb(88.627452%,49.019608%,83.92157%);stroke-opacity:1;stroke-miterlimit:4;" d="M 792.597173 -287.999882 L 518.597989 -287.999882 L 518.597989 -215.999961 L 792.597173 -215.999961 Z M 792.597173 -287.999882 " transform="matrix(0.625144,0,0,0.624567,2.500578,227.421998)"/>
<g style="fill:rgb(0%,0%,0%);fill-opacity:1;">
  <use xlink:href="#glyph0-1" x="344.515625" y="72.343512"/>
  <use xlink:href="#glyph0-8" x="348.891636" y="72.343512"/>
  <use xlink:href="#glyph0-9" x="353.267647" y="72.343512"/>
  <use xlink:href="#glyph0-10" x="356.393369" y="72.343512"/>
  <use xlink:href="#glyph0-3" x="360.76938" y="72.343512"/>
  <use xlink:href="#glyph0-4" x="367.645969" y="72.343512"/>
  <use xlink:href="#glyph0-9" x="371.396835" y="72.343512"/>
  <use xlink:href="#glyph0-11" x="374.522557" y="72.343512"/>
  <use xlink:href="#glyph0-9" x="378.898568" y="72.343512"/>
  <use xlink:href="#glyph0-12" x="382.02429" y="72.343512"/>
  <use xlink:href="#glyph0-4" x="384.524868" y="72.343512"/>
  <use xlink:href="#glyph0-3" x="388.275735" y="72.343512"/>
  <use xlink:href="#glyph0-8" x="395.152323" y="72.343512"/>
  <use xlink:href="#glyph0-9" x="399.528334" y="72.343512"/>
  <use xlink:href="#glyph0-10" x="402.654056" y="72.343512"/>
  <use xlink:href="#glyph0-3" x="407.030067" y="72.343512"/>
  <use xlink:href="#glyph0-4" x="413.906656" y="72.343512"/>
  <use xlink:href="#glyph0-13" x="417.657523" y="72.343512"/>
  <use xlink:href="#glyph0-10" x="421.408389" y="72.343512"/>
  <use xlink:href="#glyph0-3" x="425.7844" y="72.343512"/>
  <use xlink:href="#glyph0-14" x="432.660989" y="72.343512"/>
  <use xlink:href="#glyph0-10" x="437.037" y="72.343512"/>
  <use xlink:href="#glyph0-1" x="441.413011" y="72.343512"/>
  <use xlink:href="#glyph0-4" x="445.789022" y="72.343512"/>
  <use xlink:href="#glyph0-1" x="449.539888" y="72.343512"/>
  <use xlink:href="#glyph0-12" x="453.915899" y="72.343512"/>
  <use xlink:href="#glyph0-8" x="456.416477" y="72.343512"/>
  <use xlink:href="#glyph0-15" x="460.792488" y="72.343512"/>
  <use xlink:href="#glyph0-16" x="468.919365" y="72.343512"/>
  <use xlink:href="#glyph0-17" x="475.17081" y="72.343512"/>
</g>
<path style="fill:none;stroke-width:2;stroke-linecap:butt;stroke-linejoin:miter;stroke:rgb(0%,0%,0%);stroke-opacity:1;stroke-dasharray:1,5;stroke-miterlimit:4;" d="M 828.4014 -111.558796 C 828.4014 -125.061909 828.4014 -174.15845 828.4014 -210.521162 " transform="matrix(0.625144,0,0,0.624567,2.500578,227.421998)"/>
<path style="fill-rule:nonzero;fill:rgb(0%,0%,0%);fill-opacity:1;stroke-width:2;stroke-linecap:butt;stroke-linejoin:miter;stroke:rgb(0%,0%,0%);stroke-opacity:1;stroke-miterlimit:4;" d="M 826.651804 -210.790098 L 828.4014 -215.787313 L 830.150995 -210.790098 Z M 826.651804 -210.790098 " transform="matrix(0.625144,0,0,0.624567,2.500578,227.421998)"/>
<g style="fill:rgb(0%,0%,0%);fill-opacity:1;">
  <use xlink:href="#glyph0-9" x="433.789062" y="124.468512"/>
  <use xlink:href="#glyph0-14" x="436.914785" y="124.468512"/>
  <use xlink:href="#glyph0-25" x="441.290796" y="124.468512"/>
  <use xlink:href="#glyph0-19" x="443.791373" y="124.468512"/>
  <use xlink:href="#glyph0-12" x="446.291951" y="124.468512"/>
  <use xlink:href="#glyph0-18" x="448.792529" y="124.468512"/>
  <use xlink:href="#glyph0-19" x="450.667962" y="124.468512"/>
  <use xlink:href="#glyph0-1" x="453.16854" y="124.468512"/>
  <use xlink:href="#glyph0-30" x="457.544551" y="124.468512"/>
  <use xlink:href="#glyph0-4" x="461.920562" y="124.468512"/>
  <use xlink:href="#glyph0-37" x="465.671428" y="124.468512"/>
  <use xlink:href="#glyph0-18" x="470.047439" y="124.468512"/>
  <use xlink:href="#glyph0-4" x="471.922872" y="124.468512"/>
  <use xlink:href="#glyph0-37" x="475.673739" y="124.468512"/>
  <use xlink:href="#glyph0-14" x="480.04975" y="124.468512"/>
  <use xlink:href="#glyph0-26" x="484.425761" y="124.468512"/>
  <use xlink:href="#glyph0-4" x="487.551483" y="124.468512"/>
  <use xlink:href="#glyph0-9" x="491.30235" y="124.468512"/>
  <use xlink:href="#glyph0-9" x="494.428072" y="124.468512"/>
  <use xlink:href="#glyph0-19" x="497.553794" y="124.468512"/>
  <use xlink:href="#glyph0-10" x="500.054371" y="124.468512"/>
  <use xlink:href="#glyph0-1" x="504.430382" y="124.468512"/>
</g>
<path style="fill:none;stroke-width:2;stroke-linecap:butt;stroke-linejoin:miter;stroke:rgb(0%,0%,0%);stroke-opacity:1;stroke-dasharray:1,5;stroke-miterlimit:4;" d="M 655.597581 -320.128408 C 655.597581 -314.712153 655.597581 -304.267411 655.597581 -293.159709 " transform="matrix(0.625144,0,0,0.624567,2.500578,227.421998)"/>
<path style="fill-rule:nonzero;fill:rgb(0%,0%,0%);fill-opacity:1;stroke-width:2;stroke-linecap:butt;stroke-linejoin:miter;stroke:rgb(0%,0%,0%);stroke-opacity:1;stroke-miterlimit:4;" d="M 657.347177 -293.022114 L 655.597581 -288.018645 L 653.847985 -293.022114 Z M 657.347177 -293.022114 " transform="matrix(0.625144,0,0,0.624567,2.500578,227.421998)"/>
<g style="fill:rgb(0%,0%,0%);fill-opacity:1;">
  <use xlink:href="#glyph0-9" x="370.773437" y="42.8982"/>
  <use xlink:href="#glyph0-14" x="373.89916" y="42.8982"/>
  <use xlink:href="#glyph0-25" x="378.275171" y="42.8982"/>
  <use xlink:href="#glyph0-19" x="380.775748" y="42.8982"/>
  <use xlink:href="#glyph0-12" x="383.276326" y="42.8982"/>
  <use xlink:href="#glyph0-18" x="385.776904" y="42.8982"/>
  <use xlink:href="#glyph0-1" x="387.652337" y="42.8982"/>
  <use xlink:href="#glyph0-2" x="392.028348" y="42.8982"/>
  <use xlink:href="#glyph0-3" x="395.779214" y="42.8982"/>
  <use xlink:href="#glyph0-4" x="402.655803" y="42.8982"/>
</g>
</g>
</svg>
