<?xml version="1.0" encoding="UTF-8"?>
<svg xmlns="http://www.w3.org/2000/svg" xmlns:xlink="http://www.w3.org/1999/xlink" width="1029px" height="493px" viewBox="0 0 1029 493" version="1.1">
<defs>
<g>
<symbol overflow="visible" id="glyph0-0">
<path style="stroke:none;" d=""/>
</symbol>
<symbol overflow="visible" id="glyph0-1">
<path style="stroke:none;" d="M 7.9375 -7.453125 L 5.328125 -7.453125 L 5.328125 -7.234375 C 6.1875 -7.171875 6.359375 -6.953125 6.375 -5.796875 L 6.375 -2.75 C 6.375 -1.984375 6.3125 -1.5625 6.125 -1.21875 C 5.8125 -0.6875 5.09375 -0.34375 4.25 -0.34375 C 3.453125 -0.34375 2.90625 -0.609375 2.59375 -1.140625 C 2.390625 -1.5 2.3125 -1.90625 2.3125 -2.625 L 2.3125 -6.21875 C 2.328125 -7.046875 2.4375 -7.15625 3.34375 -7.234375 L 3.34375 -7.453125 L 0.15625 -7.453125 L 0.15625 -7.234375 C 1.046875 -7.171875 1.15625 -7.046875 1.171875 -6.21875 L 1.171875 -2.71875 C 1.171875 -0.765625 2.078125 0.15625 4 0.15625 C 5.21875 0.15625 6.0625 -0.234375 6.5 -1 C 6.765625 -1.46875 6.875 -1.984375 6.875 -2.859375 L 6.875 -5.796875 C 6.890625 -6.96875 7.015625 -7.125 7.9375 -7.234375 Z M 7.9375 -7.453125 "/>
</symbol>
<symbol overflow="visible" id="glyph0-2">
<path style="stroke:none;" d="M 5.03125 -7.609375 L 4.796875 -7.609375 C 4.75 -7.359375 4.625 -7.21875 4.4375 -7.21875 C 4.3125 -7.21875 4.125 -7.265625 3.9375 -7.359375 C 3.515625 -7.515625 3.109375 -7.609375 2.734375 -7.609375 C 2.265625 -7.609375 1.765625 -7.40625 1.390625 -7.09375 C 1 -6.734375 0.796875 -6.265625 0.796875 -5.6875 C 0.796875 -4.78125 1.296875 -4.15625 2.546875 -3.484375 C 3.359375 -3.046875 3.953125 -2.59375 4.234375 -2.171875 C 4.328125 -2.03125 4.390625 -1.78125 4.390625 -1.5 C 4.390625 -0.765625 3.828125 -0.25 3 -0.25 C 1.984375 -0.25 1.296875 -0.859375 0.734375 -2.234375 L 0.46875 -2.234375 L 0.8125 0.140625 L 1.0625 0.140625 C 1.0625 -0.0625 1.203125 -0.21875 1.375 -0.21875 C 1.5 -0.21875 1.6875 -0.1875 1.90625 -0.09375 C 2.328125 0.0625 2.796875 0.15625 3.234375 0.15625 C 4.53125 0.15625 5.53125 -0.734375 5.53125 -1.90625 C 5.53125 -2.828125 4.90625 -3.546875 3.421875 -4.359375 C 2.234375 -5 1.765625 -5.484375 1.765625 -6.109375 C 1.765625 -6.734375 2.234375 -7.140625 2.9375 -7.140625 C 3.4375 -7.140625 3.921875 -6.9375 4.3125 -6.53125 C 4.65625 -6.171875 4.8125 -5.875 5 -5.203125 L 5.28125 -5.203125 Z M 5.03125 -7.609375 "/>
</symbol>
<symbol overflow="visible" id="glyph0-3">
<path style="stroke:none;" d="M 6.71875 -1.90625 L 6.40625 -1.90625 C 5.859375 -0.703125 5.359375 -0.421875 3.75 -0.421875 L 3.4375 -0.421875 C 2.265625 -0.453125 2.265625 -0.46875 2.265625 -0.90625 L 2.265625 -3.671875 L 4 -3.671875 C 4.9375 -3.65625 5.078125 -3.515625 5.234375 -2.59375 L 5.484375 -2.59375 L 5.484375 -5.203125 L 5.234375 -5.203125 C 5.09375 -4.296875 4.9375 -4.15625 4 -4.140625 L 2.265625 -4.140625 L 2.265625 -6.640625 C 2.265625 -6.96875 2.3125 -7.015625 2.625 -7.015625 L 4.15625 -7.015625 C 5.453125 -7 5.6875 -6.84375 5.859375 -5.84375 L 6.140625 -5.84375 L 6.109375 -7.453125 L 0.140625 -7.453125 L 0.140625 -7.234375 C 0.953125 -7.171875 1.09375 -7.03125 1.109375 -6.21875 L 1.109375 -1.21875 C 1.09375 -0.421875 0.9375 -0.265625 0.140625 -0.21875 L 0.140625 0 L 6.203125 0 Z M 6.71875 -1.90625 "/>
</symbol>
<symbol overflow="visible" id="glyph0-4">
<path style="stroke:none;" d="M 7.40625 -0.21875 C 6.984375 -0.25 6.765625 -0.359375 6.4375 -0.75 L 4.125 -3.59375 C 5.546875 -3.875 6.15625 -4.4375 6.15625 -5.46875 C 6.15625 -5.953125 6 -6.375 5.71875 -6.6875 C 5.28125 -7.15625 4.34375 -7.453125 3.296875 -7.453125 L 0.1875 -7.453125 L 0.1875 -7.234375 C 1.03125 -7.140625 1.140625 -7.046875 1.140625 -6.21875 L 1.140625 -1.34375 C 1.140625 -0.390625 1.03125 -0.28125 0.1875 -0.21875 L 0.1875 0 L 3.3125 0 L 3.3125 -0.21875 C 2.4375 -0.265625 2.3125 -0.40625 2.296875 -1.21875 L 2.296875 -3.4375 L 2.921875 -3.46875 L 5.609375 0 L 7.40625 0 Z M 2.296875 -6.625 C 2.296875 -6.9375 2.421875 -7.03125 2.875 -7.03125 C 4.28125 -7.03125 4.921875 -6.546875 4.921875 -5.484375 C 4.921875 -4.921875 4.6875 -4.453125 4.28125 -4.234375 C 3.765625 -3.953125 3.375 -3.875 2.296875 -3.859375 Z M 2.296875 -6.625 "/>
</symbol>
<symbol overflow="visible" id="glyph0-5">
<path style="stroke:none;" d=""/>
</symbol>
<symbol overflow="visible" id="glyph0-6">
<path style="stroke:none;" d="M 0.203125 0 L 3.546875 0 L 3.546875 -0.21875 C 2.625 -0.234375 2.46875 -0.390625 2.4375 -1.21875 L 2.4375 -6.21875 C 2.46875 -7.0625 2.609375 -7.203125 3.546875 -7.234375 L 3.546875 -7.453125 L 0.203125 -7.453125 L 0.203125 -7.234375 C 1.15625 -7.171875 1.28125 -7.0625 1.296875 -6.21875 L 1.296875 -1.21875 C 1.28125 -0.375 1.140625 -0.25 0.203125 -0.21875 Z M 0.203125 0 "/>
</symbol>
<symbol overflow="visible" id="glyph0-7">
<path style="stroke:none;" d="M 7.953125 -7.453125 L 5.3125 -7.453125 L 5.3125 -7.234375 C 6.203125 -7.171875 6.359375 -6.984375 6.390625 -5.796875 L 6.390625 -2 L 2.0625 -7.453125 L 0.140625 -7.453125 L 0.140625 -7.234375 C 0.625 -7.234375 0.78125 -7.140625 1.21875 -6.609375 L 1.21875 -1.65625 C 1.203125 -0.46875 1.0625 -0.265625 0.140625 -0.21875 L 0.140625 0 L 2.78125 0 L 2.78125 -0.21875 C 1.90625 -0.265625 1.75 -0.5 1.71875 -1.65625 L 1.71875 -6.0625 L 6.6875 0.125 L 6.890625 0.125 L 6.890625 -5.796875 C 6.921875 -6.96875 7.0625 -7.15625 7.953125 -7.234375 Z M 7.953125 -7.453125 "/>
</symbol>
<symbol overflow="visible" id="glyph0-8">
<path style="stroke:none;" d="M 5.078125 -0.21875 C 4.15625 -0.265625 4.015625 -0.390625 4 -1.21875 L 4 -6.96875 L 4.609375 -6.96875 C 5.921875 -6.953125 6.15625 -6.765625 6.40625 -5.53125 L 6.671875 -5.53125 L 6.609375 -7.453125 L 0.265625 -7.453125 L 0.1875 -5.53125 L 0.46875 -5.53125 C 0.71875 -6.765625 0.953125 -6.953125 2.25 -6.96875 L 2.859375 -6.96875 L 2.859375 -1.34375 C 2.84375 -0.375 2.75 -0.265625 1.796875 -0.21875 L 1.796875 0 L 5.078125 0 Z M 5.078125 -0.21875 "/>
</symbol>
<symbol overflow="visible" id="glyph0-9">
<path style="stroke:none;" d="M 5.390625 -2.59375 L 5.390625 -5.203125 L 5.125 -5.203125 C 5 -4.3125 4.8125 -4.15625 3.890625 -4.140625 L 2.265625 -4.140625 L 2.265625 -6.640625 C 2.265625 -6.96875 2.3125 -7.015625 2.625 -7.015625 L 4.15625 -7.015625 C 5.453125 -7 5.6875 -6.84375 5.859375 -5.84375 L 6.140625 -5.84375 L 6.109375 -7.453125 L 0.140625 -7.453125 L 0.140625 -7.234375 C 0.953125 -7.171875 1.09375 -7.03125 1.109375 -6.21875 L 1.109375 -1.34375 C 1.109375 -0.390625 0.984375 -0.265625 0.140625 -0.21875 L 0.140625 0 L 3.28125 0 L 3.28125 -0.21875 C 2.4375 -0.25 2.265625 -0.40625 2.265625 -1.21875 L 2.265625 -3.671875 L 3.890625 -3.671875 C 4.8125 -3.671875 5 -3.515625 5.125 -2.59375 Z M 5.390625 -2.59375 "/>
</symbol>
<symbol overflow="visible" id="glyph0-10">
<path style="stroke:none;" d="M 7.9375 -0.21875 C 7.4375 -0.25 7.328125 -0.359375 6.9375 -1.1875 L 4.125 -7.578125 L 3.90625 -7.578125 L 1.5625 -2.0625 C 0.84375 -0.421875 0.703125 -0.234375 0.171875 -0.21875 L 0.171875 0 L 2.390625 0 L 2.390625 -0.21875 C 1.859375 -0.21875 1.625 -0.34375 1.625 -0.671875 C 1.625 -0.8125 1.671875 -0.96875 1.71875 -1.109375 L 2.234375 -2.4375 L 5.1875 -2.4375 L 5.640625 -1.34375 C 5.78125 -1.046875 5.859375 -0.75 5.859375 -0.59375 C 5.859375 -0.3125 5.671875 -0.21875 5.078125 -0.21875 L 5.078125 0 L 7.9375 0 Z M 2.4375 -2.890625 L 3.71875 -5.984375 L 5.03125 -2.890625 Z M 2.4375 -2.890625 "/>
</symbol>
<symbol overflow="visible" id="glyph0-11">
<path style="stroke:none;" d="M 6.96875 -5.078125 L 6.875 -7.609375 L 6.640625 -7.609375 C 6.5625 -7.375 6.390625 -7.234375 6.171875 -7.234375 C 6.0625 -7.234375 5.890625 -7.265625 5.71875 -7.328125 C 5.171875 -7.515625 4.609375 -7.609375 4.078125 -7.609375 C 3.15625 -7.609375 2.234375 -7.25 1.53125 -6.640625 C 0.75 -5.9375 0.3125 -4.90625 0.3125 -3.671875 C 0.3125 -1.375 1.8125 0.15625 4.046875 0.15625 C 5.328125 0.15625 6.453125 -0.359375 7.125 -1.265625 L 6.921875 -1.46875 C 6.09375 -0.671875 5.34375 -0.34375 4.40625 -0.34375 C 3.703125 -0.34375 3.078125 -0.5625 2.59375 -0.984375 C 1.96875 -1.546875 1.625 -2.546875 1.625 -3.8125 C 1.625 -5.84375 2.671875 -7.15625 4.296875 -7.15625 C 4.9375 -7.15625 5.53125 -6.921875 5.96875 -6.484375 C 6.328125 -6.125 6.5 -5.8125 6.71875 -5.078125 Z M 6.96875 -5.078125 "/>
</symbol>
<symbol overflow="visible" id="glyph0-12">
<path style="stroke:none;" d="M 0.1875 -7.234375 C 1.140625 -7.171875 1.265625 -7.0625 1.265625 -6.21875 L 1.265625 -1.21875 C 1.265625 -0.375 1.109375 -0.25 0.1875 -0.21875 L 0.1875 0 L 3.953125 0 C 4.8125 0 5.625 -0.234375 6.046875 -0.625 C 6.453125 -0.984375 6.671875 -1.484375 6.671875 -2.03125 C 6.671875 -2.515625 6.484375 -2.96875 6.125 -3.296875 C 5.78125 -3.59375 5.484375 -3.734375 4.75 -3.921875 C 5.328125 -4.0625 5.5625 -4.171875 5.84375 -4.40625 C 6.125 -4.65625 6.28125 -5.0625 6.28125 -5.53125 C 6.28125 -6.796875 5.28125 -7.453125 3.34375 -7.453125 L 0.1875 -7.453125 Z M 2.421875 -3.671875 C 3.515625 -3.671875 4.03125 -3.59375 4.4375 -3.4375 C 5.078125 -3.171875 5.375 -2.71875 5.375 -2.015625 C 5.375 -1.40625 5.140625 -0.96875 4.6875 -0.703125 C 4.328125 -0.5 3.875 -0.421875 3.125 -0.421875 C 2.578125 -0.421875 2.421875 -0.515625 2.421875 -0.875 Z M 2.421875 -4.109375 L 2.421875 -6.6875 C 2.4375 -6.9375 2.46875 -7.015625 2.671875 -7.015625 L 3.15625 -7.03125 C 4.40625 -7.0625 5.140625 -6.484375 5.140625 -5.484375 C 5.140625 -4.59375 4.5625 -4.125 3.484375 -4.125 Z M 2.421875 -4.109375 "/>
</symbol>
<symbol overflow="visible" id="glyph0-13">
<path style="stroke:none;" d="M 4.0625 -7.609375 C 1.90625 -7.609375 0.375 -6 0.375 -3.71875 C 0.375 -2.671875 0.75 -1.625 1.34375 -0.984375 C 2 -0.28125 3 0.15625 4 0.15625 C 6.203125 0.15625 7.734375 -1.40625 7.734375 -3.671875 C 7.734375 -4.796875 7.40625 -5.765625 6.796875 -6.421875 C 6.09375 -7.203125 5.140625 -7.609375 4.0625 -7.609375 Z M 4.0625 -7.203125 C 4.578125 -7.203125 5.09375 -7 5.5 -6.640625 C 6.109375 -6.09375 6.453125 -5.03125 6.453125 -3.6875 C 6.453125 -3.03125 6.328125 -2.25 6.09375 -1.671875 C 5.984375 -1.390625 5.796875 -1.109375 5.53125 -0.84375 C 5.140625 -0.453125 4.640625 -0.25 4.03125 -0.25 C 3.515625 -0.25 3.015625 -0.453125 2.609375 -0.796875 C 2.03125 -1.3125 1.671875 -2.453125 1.671875 -3.703125 C 1.671875 -4.84375 1.984375 -5.9375 2.453125 -6.46875 C 2.890625 -6.953125 3.4375 -7.203125 4.0625 -7.203125 Z M 4.0625 -7.203125 "/>
</symbol>
<symbol overflow="visible" id="glyph0-14">
<path style="stroke:none;" d="M 0.1875 -7.234375 C 1.015625 -7.140625 1.109375 -7.046875 1.125 -6.21875 L 1.125 -1.34375 C 1.109375 -0.390625 1.03125 -0.296875 0.1875 -0.21875 L 0.1875 0 L 3.328125 0 L 3.328125 -0.21875 C 2.4375 -0.234375 2.28125 -0.390625 2.265625 -1.21875 L 2.265625 -3.28125 C 2.5625 -3.25 2.75 -3.234375 3.046875 -3.234375 C 3.9375 -3.234375 4.53125 -3.359375 5.015625 -3.625 C 5.6875 -3.984375 6.09375 -4.671875 6.09375 -5.40625 C 6.09375 -5.890625 5.9375 -6.3125 5.640625 -6.640625 C 5.1875 -7.125 4.203125 -7.453125 3.15625 -7.453125 L 0.1875 -7.453125 Z M 2.265625 -6.65625 C 2.265625 -6.953125 2.34375 -7.03125 2.65625 -7.03125 C 4.171875 -7.03125 4.875 -6.5 4.875 -5.34375 C 4.875 -4.25 4.203125 -3.6875 2.90625 -3.6875 C 2.6875 -3.6875 2.53125 -3.703125 2.265625 -3.71875 Z M 2.265625 -6.65625 "/>
</symbol>
<symbol overflow="visible" id="glyph0-15">
<path style="stroke:none;" d="M 0.1875 0 L 3.375 0 C 4.6875 0 5.859375 -0.375 6.5625 -1 C 7.296875 -1.671875 7.703125 -2.671875 7.703125 -3.75 C 7.703125 -4.765625 7.375 -5.640625 6.75 -6.265625 C 5.984375 -7.046875 4.765625 -7.453125 3.21875 -7.453125 L 0.1875 -7.453125 L 0.1875 -7.234375 C 1.0625 -7.15625 1.15625 -7.0625 1.171875 -6.21875 L 1.171875 -1.21875 C 1.15625 -0.40625 1.03125 -0.265625 0.1875 -0.21875 Z M 2.3125 -6.59375 C 2.3125 -6.9375 2.4375 -7.03125 2.90625 -7.03125 C 3.875 -7.03125 4.59375 -6.84375 5.140625 -6.46875 C 6.015625 -5.859375 6.484375 -4.890625 6.484375 -3.671875 C 6.484375 -2.34375 6.015625 -1.40625 5.109375 -0.875 C 4.53125 -0.546875 3.875 -0.421875 2.90625 -0.421875 C 2.453125 -0.421875 2.3125 -0.515625 2.3125 -0.875 Z M 2.3125 -6.59375 "/>
</symbol>
<symbol overflow="visible" id="glyph0-16">
<path style="stroke:none;" d="M 3.3125 -7.453125 L 0.140625 -7.453125 L 0.140625 -7.234375 C 0.953125 -7.171875 1.09375 -7.03125 1.109375 -6.21875 L 1.109375 -1.21875 C 1.09375 -0.421875 0.9375 -0.265625 0.140625 -0.21875 L 0.140625 0 L 6.1875 0 L 6.734375 -1.953125 L 6.453125 -1.953125 C 5.921875 -0.78125 5.4375 -0.484375 3.984375 -0.4375 L 3.234375 -0.4375 C 2.359375 -0.46875 2.265625 -0.5 2.265625 -0.90625 L 2.265625 -6.21875 C 2.28125 -7.046875 2.4375 -7.1875 3.3125 -7.234375 Z M 3.3125 -7.453125 "/>
</symbol>
<symbol overflow="visible" id="glyph0-17">
<path style="stroke:none;" d="M 0.21875 0 L 3.34375 0 L 3.34375 -0.21875 C 2.5 -0.28125 2.359375 -0.421875 2.34375 -1.21875 L 2.34375 -3.546875 L 5.765625 -3.546875 L 5.765625 -1.34375 C 5.75 -0.390625 5.640625 -0.265625 4.765625 -0.21875 L 4.765625 0 L 7.890625 0 L 7.890625 -0.21875 C 7.046875 -0.28125 6.921875 -0.421875 6.90625 -1.21875 L 6.90625 -6.21875 C 6.921875 -7.046875 7.03125 -7.15625 7.890625 -7.234375 L 7.890625 -7.453125 L 4.765625 -7.453125 L 4.765625 -7.234375 C 5.640625 -7.171875 5.75 -7.046875 5.765625 -6.21875 L 5.765625 -4.03125 L 2.34375 -4.03125 L 2.34375 -6.21875 C 2.359375 -7.046875 2.46875 -7.15625 3.34375 -7.234375 L 3.34375 -7.453125 L 0.21875 -7.453125 L 0.21875 -7.234375 C 1.078125 -7.171875 1.1875 -7.046875 1.203125 -6.21875 L 1.203125 -1.34375 C 1.1875 -0.390625 1.09375 -0.265625 0.21875 -0.21875 Z M 0.21875 0 "/>
</symbol>
<symbol overflow="visible" id="glyph0-18">
<path style="stroke:none;" d="M 4.640625 -7.234375 C 5.328125 -7.203125 5.40625 -7.15625 5.40625 -6.890625 C 5.40625 -6.640625 5.15625 -6.296875 4.53125 -5.71875 L 2.546875 -3.921875 L 2.546875 -6.21875 C 2.546875 -7.0625 2.671875 -7.171875 3.578125 -7.234375 L 3.578125 -7.453125 L 0.375 -7.453125 L 0.375 -7.234375 C 1.25 -7.171875 1.375 -7.046875 1.390625 -6.21875 L 1.390625 -1.34375 C 1.390625 -0.390625 1.265625 -0.265625 0.375 -0.21875 L 0.375 0 L 3.5625 0 L 3.5625 -0.21875 C 2.6875 -0.265625 2.546875 -0.390625 2.546875 -1.21875 L 2.546875 -3.328125 L 2.828125 -3.5625 L 4.03125 -2.390625 C 4.890625 -1.515625 5.484375 -0.75 5.484375 -0.46875 C 5.484375 -0.296875 5.34375 -0.234375 5.015625 -0.21875 C 4.96875 -0.21875 4.84375 -0.21875 4.703125 -0.21875 L 4.703125 0 L 8.140625 0 L 8.140625 -0.21875 C 7.546875 -0.21875 7.390625 -0.34375 6.375 -1.421875 L 3.75 -4.234375 L 5.890625 -6.359375 C 6.65625 -7.09375 6.828125 -7.171875 7.59375 -7.234375 L 7.59375 -7.453125 L 4.640625 -7.453125 Z M 4.640625 -7.234375 "/>
</symbol>
<symbol overflow="visible" id="glyph1-0">
<path style="stroke:none;" d=""/>
</symbol>
<symbol overflow="visible" id="glyph1-1">
<path style="stroke:none;" d="M 2.703125 -5.0625 C 1.28125 -5.0625 0.25 -4 0.25 -2.484375 C 0.25 -1.78125 0.5 -1.09375 0.90625 -0.65625 C 1.328125 -0.1875 2 0.109375 2.65625 0.109375 C 4.140625 0.109375 5.15625 -0.9375 5.15625 -2.453125 C 5.15625 -3.1875 4.9375 -3.84375 4.53125 -4.28125 C 4.0625 -4.796875 3.421875 -5.0625 2.703125 -5.0625 Z M 2.703125 -4.796875 C 3.046875 -4.796875 3.390625 -4.671875 3.671875 -4.421875 C 4.078125 -4.0625 4.3125 -3.359375 4.3125 -2.453125 C 4.3125 -2.015625 4.21875 -1.5 4.0625 -1.109375 C 3.984375 -0.921875 3.859375 -0.734375 3.6875 -0.5625 C 3.421875 -0.296875 3.09375 -0.171875 2.6875 -0.171875 C 2.34375 -0.171875 2.015625 -0.296875 1.734375 -0.53125 C 1.359375 -0.875 1.109375 -1.640625 1.109375 -2.46875 C 1.109375 -3.234375 1.3125 -3.953125 1.640625 -4.3125 C 1.921875 -4.640625 2.296875 -4.796875 2.703125 -4.796875 Z M 2.703125 -4.796875 "/>
</symbol>
<symbol overflow="visible" id="glyph1-2">
<path style="stroke:none;" d="M 0.125 -4.828125 C 0.671875 -4.765625 0.75 -4.6875 0.75 -4.140625 L 0.75 -0.90625 C 0.75 -0.265625 0.6875 -0.1875 0.125 -0.140625 L 0.125 0 L 2.21875 0 L 2.21875 -0.140625 C 1.625 -0.15625 1.515625 -0.265625 1.515625 -0.8125 L 1.515625 -2.1875 C 1.703125 -2.171875 1.84375 -2.15625 2.03125 -2.15625 C 2.625 -2.15625 3.015625 -2.234375 3.34375 -2.421875 C 3.796875 -2.65625 4.0625 -3.109375 4.0625 -3.609375 C 4.0625 -3.921875 3.953125 -4.203125 3.75 -4.421875 C 3.453125 -4.75 2.8125 -4.96875 2.09375 -4.96875 L 0.125 -4.96875 Z M 1.515625 -4.4375 C 1.515625 -4.640625 1.5625 -4.6875 1.765625 -4.6875 C 2.78125 -4.6875 3.25 -4.328125 3.25 -3.5625 C 3.25 -2.828125 2.8125 -2.453125 1.9375 -2.453125 C 1.796875 -2.453125 1.6875 -2.46875 1.515625 -2.484375 Z M 1.515625 -4.4375 "/>
</symbol>
<symbol overflow="visible" id="glyph1-3">
<path style="stroke:none;" d="M 4.484375 -1.265625 L 4.265625 -1.265625 C 3.90625 -0.46875 3.5625 -0.28125 2.5 -0.28125 L 2.296875 -0.28125 C 1.515625 -0.296875 1.5 -0.3125 1.5 -0.59375 L 1.5 -2.453125 L 2.65625 -2.453125 C 3.296875 -2.4375 3.390625 -2.34375 3.484375 -1.734375 L 3.65625 -1.734375 L 3.65625 -3.46875 L 3.484375 -3.46875 C 3.390625 -2.859375 3.296875 -2.78125 2.65625 -2.765625 L 1.5 -2.765625 L 1.5 -4.421875 C 1.515625 -4.65625 1.546875 -4.6875 1.75 -4.6875 L 2.765625 -4.6875 C 3.640625 -4.671875 3.78125 -4.5625 3.90625 -3.890625 L 4.09375 -3.890625 L 4.078125 -4.96875 L 0.09375 -4.96875 L 0.09375 -4.828125 C 0.640625 -4.78125 0.734375 -4.6875 0.75 -4.140625 L 0.75 -0.8125 C 0.734375 -0.28125 0.625 -0.171875 0.09375 -0.140625 L 0.09375 0 L 4.140625 0 Z M 4.484375 -1.265625 "/>
</symbol>
<symbol overflow="visible" id="glyph1-4">
<path style="stroke:none;" d="M 4.9375 -0.140625 C 4.65625 -0.171875 4.5 -0.234375 4.296875 -0.5 L 2.75 -2.390625 C 3.703125 -2.578125 4.109375 -2.953125 4.109375 -3.640625 C 4.109375 -3.96875 4 -4.25 3.8125 -4.46875 C 3.53125 -4.765625 2.890625 -4.96875 2.203125 -4.96875 L 0.125 -4.96875 L 0.125 -4.828125 C 0.6875 -4.765625 0.75 -4.6875 0.765625 -4.140625 L 0.765625 -0.90625 C 0.75 -0.265625 0.6875 -0.1875 0.125 -0.140625 L 0.125 0 L 2.203125 0 L 2.203125 -0.140625 C 1.625 -0.1875 1.53125 -0.265625 1.53125 -0.8125 L 1.53125 -2.296875 L 1.953125 -2.3125 L 3.734375 0 L 4.9375 0 Z M 1.53125 -4.421875 C 1.53125 -4.625 1.609375 -4.6875 1.90625 -4.6875 C 2.84375 -4.6875 3.28125 -4.359375 3.28125 -3.65625 C 3.28125 -3.28125 3.125 -2.96875 2.859375 -2.828125 C 2.515625 -2.625 2.25 -2.59375 1.53125 -2.578125 Z M 1.53125 -4.421875 "/>
</symbol>
<symbol overflow="visible" id="glyph1-5">
<path style="stroke:none;" d="M 5.296875 -0.140625 C 4.953125 -0.171875 4.875 -0.234375 4.625 -0.796875 L 2.75 -5.0625 L 2.609375 -5.0625 L 1.046875 -1.375 C 0.5625 -0.28125 0.46875 -0.15625 0.109375 -0.140625 L 0.109375 0 L 1.59375 0 L 1.59375 -0.140625 C 1.234375 -0.140625 1.09375 -0.234375 1.09375 -0.453125 C 1.09375 -0.546875 1.109375 -0.640625 1.140625 -0.75 L 1.5 -1.625 L 3.453125 -1.625 L 3.765625 -0.90625 C 3.859375 -0.703125 3.90625 -0.5 3.90625 -0.390625 C 3.90625 -0.203125 3.78125 -0.15625 3.375 -0.140625 L 3.375 0 L 5.296875 0 Z M 1.625 -1.921875 L 2.484375 -3.984375 L 3.359375 -1.921875 Z M 1.625 -1.921875 "/>
</symbol>
<symbol overflow="visible" id="glyph1-6">
<path style="stroke:none;" d="M 3.390625 -0.140625 C 2.78125 -0.171875 2.671875 -0.265625 2.671875 -0.8125 L 2.671875 -4.65625 L 3.078125 -4.65625 C 3.9375 -4.640625 4.109375 -4.5 4.265625 -3.6875 L 4.453125 -3.6875 L 4.40625 -4.96875 L 0.171875 -4.96875 L 0.125 -3.6875 L 0.3125 -3.6875 C 0.484375 -4.5 0.640625 -4.640625 1.5 -4.65625 L 1.90625 -4.65625 L 1.90625 -0.90625 C 1.890625 -0.25 1.828125 -0.1875 1.203125 -0.140625 L 1.203125 0 L 3.390625 0 Z M 3.390625 -0.140625 "/>
</symbol>
<symbol overflow="visible" id="glyph1-7">
<path style="stroke:none;" d="M 0.140625 0 L 2.359375 0 L 2.359375 -0.140625 C 1.75 -0.15625 1.640625 -0.265625 1.625 -0.8125 L 1.625 -4.140625 C 1.640625 -4.703125 1.734375 -4.796875 2.359375 -4.828125 L 2.359375 -4.96875 L 0.140625 -4.96875 L 0.140625 -4.828125 C 0.765625 -4.78125 0.859375 -4.703125 0.859375 -4.140625 L 0.859375 -0.8125 C 0.859375 -0.25 0.765625 -0.171875 0.140625 -0.140625 Z M 0.140625 0 "/>
</symbol>
<symbol overflow="visible" id="glyph1-8">
<path style="stroke:none;" d="M 5.296875 -4.96875 L 3.546875 -4.96875 L 3.546875 -4.828125 C 4.140625 -4.78125 4.234375 -4.65625 4.265625 -3.859375 L 4.265625 -1.328125 L 1.375 -4.96875 L 0.09375 -4.96875 L 0.09375 -4.828125 C 0.40625 -4.828125 0.515625 -4.765625 0.8125 -4.40625 L 0.8125 -1.109375 C 0.796875 -0.3125 0.703125 -0.1875 0.09375 -0.140625 L 0.09375 0 L 1.859375 0 L 1.859375 -0.140625 C 1.28125 -0.171875 1.15625 -0.328125 1.140625 -1.109375 L 1.140625 -4.046875 L 4.46875 0.078125 L 4.59375 0.078125 L 4.59375 -3.859375 C 4.609375 -4.640625 4.703125 -4.765625 5.296875 -4.828125 Z M 5.296875 -4.96875 "/>
</symbol>
<symbol overflow="visible" id="glyph1-9">
<path style="stroke:none;" d="M 5.3125 -2.65625 L 3.40625 -2.65625 L 3.40625 -2.515625 C 3.984375 -2.484375 4.046875 -2.421875 4.0625 -1.859375 L 4.0625 -0.640625 C 4.0625 -0.390625 3.609375 -0.1875 3.0625 -0.1875 C 1.84375 -0.1875 1.09375 -1.046875 1.09375 -2.4375 C 1.09375 -3.15625 1.3125 -3.828125 1.640625 -4.203125 C 1.953125 -4.5625 2.4375 -4.765625 2.9375 -4.765625 C 3.359375 -4.765625 3.734375 -4.625 4.015625 -4.359375 C 4.25 -4.140625 4.359375 -3.9375 4.546875 -3.484375 L 4.71875 -3.484375 L 4.671875 -5.0625 L 4.5 -5.0625 C 4.453125 -4.921875 4.3125 -4.828125 4.15625 -4.828125 C 4.09375 -4.828125 3.96875 -4.84375 3.828125 -4.890625 C 3.5 -5.015625 3.140625 -5.0625 2.8125 -5.0625 C 1.3125 -5.0625 0.234375 -3.96875 0.234375 -2.4375 C 0.234375 -1.703125 0.4375 -1.140625 0.859375 -0.703125 C 1.359375 -0.1875 2.078125 0.109375 2.90625 0.109375 C 3.5625 0.109375 4.5 -0.15625 4.796875 -0.421875 L 4.796875 -1.9375 C 4.8125 -2.40625 4.890625 -2.484375 5.3125 -2.515625 Z M 5.3125 -2.65625 "/>
</symbol>
<symbol overflow="visible" id="glyph1-10">
<path style="stroke:none;" d=""/>
</symbol>
<symbol overflow="visible" id="glyph1-11">
<path style="stroke:none;" d="M 3.359375 -5.0625 L 3.1875 -5.0625 C 3.171875 -4.90625 3.078125 -4.8125 2.953125 -4.8125 C 2.875 -4.8125 2.75 -4.84375 2.625 -4.90625 C 2.34375 -5.015625 2.0625 -5.0625 1.828125 -5.0625 C 1.5 -5.0625 1.171875 -4.9375 0.9375 -4.71875 C 0.671875 -4.5 0.53125 -4.171875 0.53125 -3.78125 C 0.53125 -3.1875 0.859375 -2.765625 1.703125 -2.328125 C 2.25 -2.03125 2.625 -1.734375 2.8125 -1.453125 C 2.890625 -1.34375 2.921875 -1.1875 2.921875 -1 C 2.921875 -0.515625 2.546875 -0.171875 2 -0.171875 C 1.328125 -0.171875 0.859375 -0.578125 0.484375 -1.5 L 0.3125 -1.5 L 0.546875 0.09375 L 0.703125 0.09375 C 0.71875 -0.046875 0.796875 -0.15625 0.921875 -0.15625 C 1 -0.15625 1.125 -0.125 1.265625 -0.0625 C 1.546875 0.046875 1.859375 0.109375 2.15625 0.109375 C 3.015625 0.109375 3.6875 -0.484375 3.6875 -1.265625 C 3.6875 -1.875 3.265625 -2.359375 2.28125 -2.90625 C 1.5 -3.328125 1.171875 -3.65625 1.171875 -4.078125 C 1.171875 -4.484375 1.5 -4.765625 1.953125 -4.765625 C 2.296875 -4.765625 2.609375 -4.625 2.875 -4.34375 C 3.109375 -4.109375 3.203125 -3.921875 3.328125 -3.46875 L 3.515625 -3.46875 Z M 3.359375 -5.0625 "/>
</symbol>
<symbol overflow="visible" id="glyph1-12">
<path style="stroke:none;" d="M 5.265625 -4.96875 L 3.625 -4.96875 L 3.625 -4.828125 C 4.015625 -4.8125 4.140625 -4.75 4.140625 -4.578125 C 4.140625 -4.5 4.125 -4.40625 4.046875 -4.296875 L 2.96875 -2.609375 L 1.859375 -4.265625 C 1.78125 -4.390625 1.734375 -4.515625 1.734375 -4.59375 C 1.734375 -4.734375 1.84375 -4.796875 2.078125 -4.8125 C 2.109375 -4.8125 2.1875 -4.8125 2.265625 -4.828125 L 2.265625 -4.96875 L 0.171875 -4.96875 L 0.171875 -4.828125 C 0.53125 -4.8125 0.625 -4.703125 1.375 -3.640625 L 2.359375 -2.203125 L 2.359375 -0.90625 C 2.359375 -0.234375 2.28125 -0.171875 1.609375 -0.140625 L 1.609375 0 L 3.90625 0 L 3.90625 -0.140625 C 3.234375 -0.15625 3.140625 -0.234375 3.125 -0.8125 L 3.125 -2.265625 L 4.234375 -3.96875 C 4.6875 -4.625 4.890625 -4.796875 5.265625 -4.828125 Z M 5.265625 -4.96875 "/>
</symbol>
<symbol overflow="visible" id="glyph1-13">
<path style="stroke:none;" d="M 6.46875 -4.96875 L 4.984375 -4.96875 L 3.328125 -1.171875 L 1.59375 -4.96875 L 0.109375 -4.96875 L 0.109375 -4.828125 C 0.71875 -4.796875 0.796875 -4.703125 0.8125 -4.140625 L 0.8125 -1.109375 C 0.796875 -0.3125 0.703125 -0.1875 0.09375 -0.140625 L 0.09375 0 L 1.859375 0 L 1.859375 -0.140625 C 1.28125 -0.171875 1.15625 -0.328125 1.140625 -1.109375 L 1.140625 -4.125 L 3.03125 0 L 3.140625 0 L 5.0625 -4.296875 L 5.0625 -0.90625 C 5.046875 -0.265625 4.96875 -0.1875 4.375 -0.140625 L 4.375 0 L 6.46875 0 L 6.46875 -0.140625 C 5.9375 -0.171875 5.828125 -0.28125 5.8125 -0.8125 L 5.8125 -4.140625 C 5.828125 -4.6875 5.921875 -4.78125 6.46875 -4.828125 Z M 6.46875 -4.96875 "/>
</symbol>
<symbol overflow="visible" id="glyph1-14">
<path style="stroke:none;" d="M 4.65625 -3.375 L 4.578125 -5.0625 L 4.421875 -5.0625 C 4.375 -4.90625 4.265625 -4.828125 4.109375 -4.828125 C 4.046875 -4.828125 3.9375 -4.84375 3.8125 -4.875 C 3.453125 -5.015625 3.078125 -5.0625 2.71875 -5.0625 C 2.109375 -5.0625 1.484375 -4.84375 1.015625 -4.421875 C 0.5 -3.953125 0.203125 -3.265625 0.203125 -2.4375 C 0.203125 -0.921875 1.203125 0.109375 2.703125 0.109375 C 3.546875 0.109375 4.296875 -0.234375 4.75 -0.84375 L 4.609375 -0.984375 C 4.0625 -0.453125 3.5625 -0.21875 2.9375 -0.21875 C 2.46875 -0.21875 2.046875 -0.375 1.71875 -0.65625 C 1.3125 -1.03125 1.078125 -1.703125 1.078125 -2.546875 C 1.078125 -3.90625 1.78125 -4.765625 2.859375 -4.765625 C 3.296875 -4.765625 3.6875 -4.609375 3.984375 -4.3125 C 4.21875 -4.078125 4.328125 -3.875 4.484375 -3.375 Z M 4.65625 -3.375 "/>
</symbol>
<symbol overflow="visible" id="glyph1-15">
<path style="stroke:none;" d="M 0.140625 0 L 2.234375 0 L 2.234375 -0.140625 C 1.671875 -0.1875 1.578125 -0.28125 1.5625 -0.8125 L 1.5625 -2.359375 L 3.84375 -2.359375 L 3.84375 -0.90625 C 3.828125 -0.265625 3.765625 -0.1875 3.1875 -0.140625 L 3.1875 0 L 5.265625 0 L 5.265625 -0.140625 C 4.703125 -0.1875 4.609375 -0.28125 4.609375 -0.8125 L 4.609375 -4.140625 C 4.609375 -4.6875 4.6875 -4.765625 5.265625 -4.828125 L 5.265625 -4.96875 L 3.1875 -4.96875 L 3.1875 -4.828125 C 3.75 -4.78125 3.828125 -4.703125 3.84375 -4.140625 L 3.84375 -2.6875 L 1.5625 -2.6875 L 1.5625 -4.140625 C 1.578125 -4.6875 1.65625 -4.765625 2.234375 -4.828125 L 2.234375 -4.96875 L 0.140625 -4.96875 L 0.140625 -4.828125 C 0.71875 -4.78125 0.796875 -4.703125 0.796875 -4.140625 L 0.796875 -0.90625 C 0.796875 -0.265625 0.734375 -0.1875 0.140625 -0.140625 Z M 0.140625 0 "/>
</symbol>
<symbol overflow="visible" id="glyph1-16">
<path style="stroke:none;" d="M 0.125 0 L 2.25 0 C 3.125 0 3.90625 -0.25 4.375 -0.671875 C 4.859375 -1.109375 5.140625 -1.78125 5.140625 -2.5 C 5.140625 -3.1875 4.921875 -3.765625 4.5 -4.171875 C 3.984375 -4.6875 3.171875 -4.96875 2.140625 -4.96875 L 0.125 -4.96875 L 0.125 -4.828125 C 0.71875 -4.765625 0.765625 -4.703125 0.78125 -4.140625 L 0.78125 -0.8125 C 0.765625 -0.265625 0.6875 -0.1875 0.125 -0.140625 Z M 1.546875 -4.390625 C 1.546875 -4.625 1.625 -4.6875 1.9375 -4.6875 C 2.59375 -4.6875 3.0625 -4.5625 3.421875 -4.3125 C 4.015625 -3.90625 4.3125 -3.265625 4.3125 -2.453125 C 4.3125 -1.5625 4.015625 -0.9375 3.40625 -0.578125 C 3.015625 -0.375 2.59375 -0.28125 1.9375 -0.28125 C 1.640625 -0.28125 1.546875 -0.34375 1.546875 -0.578125 Z M 1.546875 -4.390625 "/>
</symbol>
<symbol overflow="visible" id="glyph1-17">
<path style="stroke:none;" d="M 5.28125 -4.96875 L 3.546875 -4.96875 L 3.546875 -4.828125 C 4.125 -4.78125 4.234375 -4.640625 4.25 -3.859375 L 4.25 -1.84375 C 4.25 -1.328125 4.203125 -1.046875 4.078125 -0.8125 C 3.875 -0.453125 3.390625 -0.21875 2.828125 -0.21875 C 2.296875 -0.21875 1.9375 -0.40625 1.734375 -0.75 C 1.59375 -1 1.546875 -1.28125 1.546875 -1.75 L 1.546875 -4.140625 C 1.546875 -4.6875 1.625 -4.765625 2.234375 -4.828125 L 2.234375 -4.96875 L 0.109375 -4.96875 L 0.109375 -4.828125 C 0.703125 -4.78125 0.765625 -4.703125 0.78125 -4.140625 L 0.78125 -1.8125 C 0.78125 -0.515625 1.390625 0.109375 2.65625 0.109375 C 3.484375 0.109375 4.046875 -0.15625 4.328125 -0.671875 C 4.515625 -0.984375 4.578125 -1.328125 4.578125 -1.90625 L 4.578125 -3.859375 C 4.59375 -4.65625 4.6875 -4.75 5.28125 -4.828125 Z M 5.28125 -4.96875 "/>
</symbol>
<symbol overflow="visible" id="glyph1-18">
<path style="stroke:none;" d="M 2.203125 -4.96875 L 0.09375 -4.96875 L 0.09375 -4.828125 C 0.640625 -4.78125 0.734375 -4.6875 0.75 -4.140625 L 0.75 -0.8125 C 0.734375 -0.28125 0.625 -0.171875 0.09375 -0.140625 L 0.09375 0 L 4.125 0 L 4.484375 -1.3125 L 4.296875 -1.3125 C 3.9375 -0.515625 3.625 -0.328125 2.65625 -0.296875 L 2.15625 -0.296875 C 1.578125 -0.3125 1.515625 -0.328125 1.5 -0.59375 L 1.5 -4.140625 C 1.515625 -4.6875 1.625 -4.796875 2.203125 -4.828125 Z M 2.203125 -4.96875 "/>
</symbol>
<symbol overflow="visible" id="glyph1-19">
<path style="stroke:none;" d="M 0.125 -4.828125 C 0.75 -4.78125 0.84375 -4.703125 0.84375 -4.140625 L 0.84375 -0.8125 C 0.84375 -0.25 0.75 -0.171875 0.125 -0.140625 L 0.125 0 L 2.625 0 C 3.203125 0 3.75 -0.15625 4.03125 -0.40625 C 4.296875 -0.65625 4.453125 -0.984375 4.453125 -1.34375 C 4.453125 -1.6875 4.3125 -1.984375 4.078125 -2.203125 C 3.859375 -2.40625 3.65625 -2.484375 3.171875 -2.609375 C 3.5625 -2.703125 3.71875 -2.78125 3.890625 -2.9375 C 4.078125 -3.109375 4.1875 -3.375 4.1875 -3.6875 C 4.1875 -4.53125 3.515625 -4.96875 2.234375 -4.96875 L 0.125 -4.96875 Z M 1.609375 -2.4375 C 2.34375 -2.4375 2.6875 -2.40625 2.953125 -2.28125 C 3.375 -2.109375 3.578125 -1.8125 3.578125 -1.34375 C 3.578125 -0.9375 3.421875 -0.640625 3.125 -0.46875 C 2.890625 -0.34375 2.578125 -0.28125 2.078125 -0.28125 C 1.71875 -0.28125 1.609375 -0.34375 1.609375 -0.578125 Z M 1.609375 -2.734375 L 1.609375 -4.46875 C 1.625 -4.625 1.65625 -4.671875 1.78125 -4.6875 L 2.109375 -4.6875 C 2.9375 -4.703125 3.421875 -4.328125 3.421875 -3.65625 C 3.421875 -3.0625 3.046875 -2.75 2.328125 -2.75 Z M 1.609375 -2.734375 "/>
</symbol>
<symbol overflow="visible" id="glyph1-20">
<path style="stroke:none;" d="M 3.59375 -1.734375 L 3.59375 -3.46875 L 3.421875 -3.46875 C 3.34375 -2.875 3.203125 -2.78125 2.59375 -2.765625 L 1.5 -2.765625 L 1.5 -4.421875 C 1.515625 -4.65625 1.53125 -4.671875 1.75 -4.6875 L 2.765625 -4.6875 C 3.640625 -4.671875 3.78125 -4.5625 3.90625 -3.890625 L 4.09375 -3.890625 L 4.078125 -4.96875 L 0.09375 -4.96875 L 0.09375 -4.828125 C 0.640625 -4.78125 0.734375 -4.6875 0.75 -4.140625 L 0.75 -0.90625 C 0.734375 -0.265625 0.65625 -0.1875 0.09375 -0.140625 L 0.09375 0 L 2.1875 0 L 2.1875 -0.140625 C 1.625 -0.171875 1.515625 -0.265625 1.5 -0.8125 L 1.5 -2.453125 L 2.59375 -2.453125 C 3.203125 -2.4375 3.328125 -2.34375 3.421875 -1.734375 Z M 3.59375 -1.734375 "/>
</symbol>
<symbol overflow="visible" id="glyph1-21">
<path style="stroke:none;" d="M 0.9375 -0.75 C 0.71875 -0.75 0.53125 -0.5625 0.53125 -0.328125 C 0.53125 -0.109375 0.71875 0.078125 0.9375 0.078125 C 1.15625 0.078125 1.359375 -0.09375 1.359375 -0.328125 C 1.359375 -0.5625 1.15625 -0.75 0.9375 -0.75 Z M 0.9375 -0.75 "/>
</symbol>
<symbol overflow="visible" id="glyph1-22">
<path style="stroke:none;" d="M 5.21875 -4.96875 L 3.4375 -4.96875 L 3.4375 -4.828125 C 3.84375 -4.8125 3.953125 -4.75 3.953125 -4.578125 C 3.953125 -4.46875 3.890625 -4.328125 3.65625 -4.0625 L 2.8125 -3.03125 L 2.5 -3.46875 C 2.046875 -4.125 1.859375 -4.4375 1.859375 -4.59375 C 1.859375 -4.75 1.96875 -4.8125 2.21875 -4.8125 L 2.4375 -4.828125 L 2.4375 -4.96875 L 0.171875 -4.96875 L 0.171875 -4.828125 C 0.65625 -4.796875 0.78125 -4.6875 1.515625 -3.640625 L 2.34375 -2.4375 L 1.15625 -1 C 0.5 -0.203125 0.453125 -0.171875 0.078125 -0.140625 L 0.078125 0 L 1.828125 0 L 1.828125 -0.140625 C 1.375 -0.171875 1.25 -0.234375 1.25 -0.40625 C 1.25 -0.515625 1.359375 -0.703125 1.640625 -1.046875 L 2.53125 -2.15625 L 3.25 -1.109375 C 3.5 -0.734375 3.625 -0.484375 3.625 -0.375 C 3.625 -0.234375 3.515625 -0.171875 3.25 -0.15625 C 3.21875 -0.15625 3.140625 -0.15625 3.046875 -0.140625 L 3.046875 0 L 5.28125 0 L 5.28125 -0.140625 C 4.875 -0.1875 4.765625 -0.265625 4.453125 -0.703125 L 3 -2.75 L 4.109375 -4.125 C 4.59375 -4.703125 4.734375 -4.796875 5.21875 -4.828125 Z M 5.21875 -4.96875 "/>
</symbol>
<symbol overflow="visible" id="glyph1-23">
<path style="stroke:none;" d="M 3.09375 -4.828125 C 3.546875 -4.796875 3.609375 -4.765625 3.609375 -4.59375 C 3.609375 -4.421875 3.4375 -4.203125 3.015625 -3.8125 L 1.6875 -2.609375 L 1.6875 -4.140625 C 1.703125 -4.703125 1.78125 -4.78125 2.390625 -4.828125 L 2.390625 -4.96875 L 0.25 -4.96875 L 0.25 -4.828125 C 0.828125 -4.78125 0.921875 -4.6875 0.9375 -4.140625 L 0.9375 -0.90625 C 0.921875 -0.265625 0.84375 -0.1875 0.25 -0.140625 L 0.25 0 L 2.375 0 L 2.375 -0.140625 C 1.796875 -0.1875 1.703125 -0.265625 1.6875 -0.8125 L 1.6875 -2.21875 L 1.890625 -2.375 L 2.6875 -1.59375 C 3.265625 -1.015625 3.65625 -0.5 3.65625 -0.3125 C 3.65625 -0.203125 3.5625 -0.15625 3.34375 -0.15625 C 3.3125 -0.15625 3.21875 -0.15625 3.140625 -0.140625 L 3.140625 0 L 5.421875 0 L 5.421875 -0.140625 C 5.03125 -0.15625 4.921875 -0.21875 4.25 -0.953125 L 2.5 -2.828125 L 3.921875 -4.234375 C 4.4375 -4.71875 4.546875 -4.78125 5.0625 -4.828125 L 5.0625 -4.96875 L 3.09375 -4.96875 Z M 3.09375 -4.828125 "/>
</symbol>
<symbol overflow="visible" id="glyph1-24">
<path style="stroke:none;" d="M 0.890625 0 L 2.953125 0 L 2.953125 -0.109375 C 2.375 -0.109375 2.25 -0.1875 2.25 -0.5625 L 2.25 -5.0625 L 2.1875 -5.0625 L 0.828125 -4.390625 L 0.828125 -4.28125 C 1.125 -4.390625 1.3125 -4.453125 1.375 -4.453125 C 1.53125 -4.453125 1.59375 -4.328125 1.59375 -4.09375 L 1.59375 -0.703125 C 1.578125 -0.21875 1.453125 -0.125 0.890625 -0.109375 Z M 0.890625 0 "/>
</symbol>
<symbol overflow="visible" id="glyph1-25">
<path style="stroke:none;" d="M 1.90625 -5.0625 C 1.5 -5.0625 1.171875 -4.953125 0.90625 -4.6875 C 0.46875 -4.265625 0.1875 -3.390625 0.1875 -2.515625 C 0.1875 -1.6875 0.421875 -0.828125 0.78125 -0.40625 C 1.0625 -0.078125 1.4375 0.109375 1.875 0.109375 C 2.25 0.109375 2.578125 -0.015625 2.84375 -0.28125 C 3.28125 -0.703125 3.5625 -1.5625 3.5625 -2.46875 C 3.5625 -4.015625 2.890625 -5.0625 1.90625 -5.0625 Z M 1.875 -4.875 C 2.515625 -4.875 2.84375 -4.03125 2.84375 -2.453125 C 2.84375 -0.890625 2.515625 -0.09375 1.875 -0.09375 C 1.234375 -0.09375 0.90625 -0.890625 0.90625 -2.453125 C 0.90625 -4.046875 1.234375 -4.875 1.875 -4.875 Z M 1.875 -4.875 "/>
</symbol>
<symbol overflow="visible" id="glyph1-26">
<path style="stroke:none;" d="M 5.234375 -4.96875 L 3.6875 -4.96875 L 3.6875 -4.828125 C 4.109375 -4.796875 4.234375 -4.71875 4.234375 -4.5 C 4.234375 -4.390625 4.1875 -4.1875 4.09375 -3.953125 L 3 -1.203125 L 1.859375 -3.75 C 1.609375 -4.296875 1.546875 -4.46875 1.546875 -4.578125 C 1.546875 -4.71875 1.65625 -4.796875 1.890625 -4.8125 C 1.9375 -4.8125 2.015625 -4.8125 2.109375 -4.828125 L 2.109375 -4.96875 L 0.125 -4.96875 L 0.125 -4.828125 C 0.484375 -4.8125 0.59375 -4.703125 0.921875 -4.03125 L 2.765625 0.078125 L 2.875 0.078125 L 4.53125 -4.125 C 4.78125 -4.71875 4.875 -4.796875 5.234375 -4.828125 Z M 5.234375 -4.96875 "/>
</symbol>
<symbol overflow="visible" id="glyph1-27">
<path style="stroke:none;" d="M 2.78125 -4.96875 L 0.625 -4.96875 L 0.625 -4.828125 C 1.234375 -4.78125 1.3125 -4.703125 1.3125 -4.140625 L 1.3125 -0.671875 C 1.3125 -0.34375 1.234375 -0.1875 1.03125 -0.1875 C 0.9375 -0.1875 0.890625 -0.234375 0.828125 -0.421875 C 0.75 -0.6875 0.640625 -0.8125 0.4375 -0.8125 C 0.234375 -0.8125 0.078125 -0.640625 0.078125 -0.4375 C 0.078125 -0.125 0.375 0.109375 0.8125 0.109375 C 1.625 0.109375 2.078125 -0.4375 2.078125 -1.375 L 2.078125 -4.140625 C 2.09375 -4.703125 2.171875 -4.78125 2.78125 -4.828125 Z M 2.78125 -4.96875 "/>
</symbol>
<symbol overflow="visible" id="glyph1-28">
<path style="stroke:none;" d="M 5.25 1.1875 C 4.40625 1.171875 3.796875 0.84375 3.1875 0.046875 C 3.703125 -0.046875 3.96875 -0.171875 4.3125 -0.46875 C 4.875 -0.96875 5.15625 -1.65625 5.15625 -2.484375 C 5.15625 -3.984375 4.140625 -5.0625 2.703125 -5.0625 C 1.28125 -5.0625 0.25 -3.984375 0.25 -2.46875 C 0.25 -1.734375 0.484375 -1.125 0.921875 -0.640625 C 1.21875 -0.328125 1.453125 -0.171875 1.984375 0 L 2.34375 0.421875 C 2.84375 1.015625 3.75 1.328125 4.953125 1.328125 C 5.046875 1.328125 5.140625 1.328125 5.21875 1.328125 L 5.25 1.328125 Z M 2.734375 -4.796875 C 3.046875 -4.796875 3.390625 -4.65625 3.65625 -4.421875 C 4.0625 -4.0625 4.3125 -3.34375 4.3125 -2.5 C 4.3125 -1.75 4.09375 -0.984375 3.78125 -0.640625 C 3.515625 -0.34375 3.125 -0.171875 2.703125 -0.171875 C 2.34375 -0.171875 2.015625 -0.296875 1.734375 -0.53125 C 1.34375 -0.890625 1.109375 -1.625 1.109375 -2.515625 C 1.109375 -3.234375 1.328125 -3.96875 1.640625 -4.3125 C 1.9375 -4.640625 2.296875 -4.796875 2.734375 -4.796875 Z M 2.734375 -4.796875 "/>
</symbol>
<symbol overflow="visible" id="glyph1-29">
<path style="stroke:none;" d="M 2.21875 -5.0625 C 1.65625 -4.703125 1.4375 -4.515625 1.15625 -4.171875 C 0.625 -3.515625 0.359375 -2.765625 0.359375 -1.890625 C 0.359375 -0.9375 0.640625 -0.203125 1.296875 0.5625 C 1.609375 0.921875 1.796875 1.09375 2.1875 1.328125 L 2.28125 1.203125 C 1.6875 0.734375 1.46875 0.46875 1.265625 -0.09375 C 1.09375 -0.59375 1 -1.15625 1 -1.90625 C 1 -2.703125 1.109375 -3.328125 1.3125 -3.78125 C 1.515625 -4.25 1.734375 -4.515625 2.28125 -4.953125 Z M 2.21875 -5.0625 "/>
</symbol>
<symbol overflow="visible" id="glyph1-30">
<path style="stroke:none;" d="M 0.28125 1.328125 C 0.84375 0.953125 1.0625 0.765625 1.34375 0.421875 C 1.875 -0.21875 2.140625 -0.96875 2.140625 -1.859375 C 2.140625 -2.8125 1.859375 -3.546875 1.203125 -4.3125 C 0.890625 -4.671875 0.703125 -4.828125 0.3125 -5.0625 L 0.21875 -4.953125 C 0.8125 -4.484375 1.015625 -4.21875 1.234375 -3.65625 C 1.40625 -3.15625 1.5 -2.59375 1.5 -1.828125 C 1.5 -1.046875 1.390625 -0.421875 1.1875 0.03125 C 0.984375 0.5 0.75 0.765625 0.21875 1.203125 Z M 0.28125 1.328125 "/>
</symbol>
</g>
</defs>
<g id="surface1">
<path style=" stroke:none;fill-rule:nonzero;fill:rgb(100%,100%,100%);fill-opacity:1;" d="M 0 492.886719 L 0 0.113281 L 1029 0.113281 L 1029 492.886719 Z M 0 492.886719 "/>
<path style="fill-rule:nonzero;fill:rgb(100%,100%,0%);fill-opacity:1;stroke-width:1;stroke-linecap:butt;stroke-linejoin:miter;stroke:rgb(0%,0%,0%);stroke-opacity:1;stroke-miterlimit:4;" d="M 1555 -1306.596159 L 1181 -1306.596159 L 1181 -932.600748 L 1555 -932.600748 Z M 1555 -1306.596159 " transform="matrix(0.375,0,0,0.374848,1.5,491.388149)"/>
<g style="fill:rgb(0%,0%,0%);fill-opacity:1;">
  <use xlink:href="#glyph0-1" x="468.375" y="10.610043"/>
  <use xlink:href="#glyph0-2" x="476.25" y="10.610043"/>
  <use xlink:href="#glyph0-3" x="482.625" y="10.610043"/>
  <use xlink:href="#glyph0-4" x="489.375" y="10.610043"/>
  <use xlink:href="#glyph0-5" x="496.875" y="10.610043"/>
  <use xlink:href="#glyph0-6" x="499.5" y="10.610043"/>
  <use xlink:href="#glyph0-7" x="503.25" y="10.610043"/>
  <use xlink:href="#glyph0-8" x="511.5" y="10.610043"/>
  <use xlink:href="#glyph0-3" x="518.625" y="10.610043"/>
  <use xlink:href="#glyph0-4" x="525.375" y="10.610043"/>
  <use xlink:href="#glyph0-9" x="533.25" y="10.610043"/>
  <use xlink:href="#glyph0-10" x="538.875" y="10.610043"/>
  <use xlink:href="#glyph0-11" x="546.375" y="10.610043"/>
  <use xlink:href="#glyph0-3" x="553.875" y="10.610043"/>
</g>
<path style="fill-rule:nonzero;fill:rgb(82.745099%,82.745099%,82.745099%);fill-opacity:1;stroke-width:1;stroke-linecap:butt;stroke-linejoin:miter;stroke:rgb(0%,0%,0%);stroke-opacity:1;stroke-miterlimit:4;" d="M 2736 -683.999937 L 0 -683.999937 L 0 -0.00381639 L 2736 -0.00381639 Z M 2736 -683.999937 " transform="matrix(0.375,0,0,0.374848,1.5,491.388149)"/>
<g style="fill:rgb(0%,0%,0%);fill-opacity:1;">
  <use xlink:href="#glyph0-3" x="462.5625" y="243.98895"/>
  <use xlink:href="#glyph0-11" x="469.3125" y="243.98895"/>
  <use xlink:href="#glyph0-1" x="476.8125" y="243.98895"/>
  <use xlink:href="#glyph0-5" x="485.0625" y="243.98895"/>
  <use xlink:href="#glyph0-10" x="487.6875" y="243.98895"/>
  <use xlink:href="#glyph0-12" x="495.9375" y="243.98895"/>
  <use xlink:href="#glyph0-2" x="503.0625" y="243.98895"/>
  <use xlink:href="#glyph0-8" x="509.0625" y="243.98895"/>
  <use xlink:href="#glyph0-4" x="516.1875" y="243.98895"/>
  <use xlink:href="#glyph0-10" x="524.0625" y="243.98895"/>
  <use xlink:href="#glyph0-11" x="531.5625" y="243.98895"/>
  <use xlink:href="#glyph0-8" x="539.0625" y="243.98895"/>
  <use xlink:href="#glyph0-6" x="546.1875" y="243.98895"/>
  <use xlink:href="#glyph0-13" x="549.9375" y="243.98895"/>
  <use xlink:href="#glyph0-7" x="558.1875" y="243.98895"/>
</g>
<path style="fill-rule:nonzero;fill:rgb(100%,64.705884%,0%);fill-opacity:1;stroke-width:1;stroke-linecap:butt;stroke-linejoin:miter;stroke:rgb(0%,0%,0%);stroke-opacity:1;stroke-miterlimit:4;" d="M 1555 -205.097402 L 1181 -205.097402 L 1181 -18.104907 L 1555 -18.104907 Z M 1555 -205.097402 " transform="matrix(0.375,0,0,0.374848,1.5,491.388149)"/>
<g style="fill:rgb(0%,0%,0%);fill-opacity:1;">
  <use xlink:href="#glyph1-1" x="477.9375" y="447.307981"/>
  <use xlink:href="#glyph1-2" x="483.1875" y="447.307981"/>
  <use xlink:href="#glyph1-3" x="487.3125" y="447.307981"/>
  <use xlink:href="#glyph1-4" x="491.8125" y="447.307981"/>
  <use xlink:href="#glyph1-5" x="497.0625" y="447.307981"/>
  <use xlink:href="#glyph1-6" x="501.9375" y="447.307981"/>
  <use xlink:href="#glyph1-7" x="506.4375" y="447.307981"/>
  <use xlink:href="#glyph1-8" x="509.0625" y="447.307981"/>
  <use xlink:href="#glyph1-9" x="514.3125" y="447.307981"/>
  <use xlink:href="#glyph1-10" x="519.5625" y="447.307981"/>
  <use xlink:href="#glyph1-11" x="521.4375" y="447.307981"/>
  <use xlink:href="#glyph1-12" x="525.5625" y="447.307981"/>
  <use xlink:href="#glyph1-11" x="530.8125" y="447.307981"/>
  <use xlink:href="#glyph1-6" x="534.9375" y="447.307981"/>
  <use xlink:href="#glyph1-3" x="539.8125" y="447.307981"/>
  <use xlink:href="#glyph1-13" x="544.3125" y="447.307981"/>
</g>
<g style="fill:rgb(0%,0%,0%);fill-opacity:1;">
  <use xlink:href="#glyph1-11" x="492.9375" y="455.554075"/>
  <use xlink:href="#glyph1-14" x="497.0625" y="455.554075"/>
  <use xlink:href="#glyph1-15" x="501.9375" y="455.554075"/>
  <use xlink:href="#glyph1-3" x="507.1875" y="455.554075"/>
  <use xlink:href="#glyph1-16" x="511.6875" y="455.554075"/>
  <use xlink:href="#glyph1-17" x="516.9375" y="455.554075"/>
  <use xlink:href="#glyph1-18" x="522.1875" y="455.554075"/>
  <use xlink:href="#glyph1-3" x="526.6875" y="455.554075"/>
  <use xlink:href="#glyph1-4" x="531.1875" y="455.554075"/>
</g>
<g style="fill:rgb(0%,0%,0%);fill-opacity:1;">
  <use xlink:href="#glyph0-14" x="202.6875" y="438.871762"/>
  <use xlink:href="#glyph0-3" x="208.6875" y="438.871762"/>
  <use xlink:href="#glyph0-4" x="215.4375" y="438.871762"/>
  <use xlink:href="#glyph0-6" x="223.3125" y="438.871762"/>
  <use xlink:href="#glyph0-13" x="227.0625" y="438.871762"/>
  <use xlink:href="#glyph0-15" x="235.3125" y="438.871762"/>
  <use xlink:href="#glyph0-6" x="243.5625" y="438.871762"/>
  <use xlink:href="#glyph0-11" x="247.3125" y="438.871762"/>
  <use xlink:href="#glyph0-5" x="254.8125" y="438.871762"/>
  <use xlink:href="#glyph0-11" x="257.4375" y="438.871762"/>
  <use xlink:href="#glyph0-10" x="264.5625" y="438.871762"/>
  <use xlink:href="#glyph0-16" x="272.8125" y="438.871762"/>
  <use xlink:href="#glyph0-16" x="279.5625" y="438.871762"/>
</g>
<g style="fill:rgb(0%,0%,0%);fill-opacity:1;">
  <use xlink:href="#glyph0-9" x="750.375" y="438.871762"/>
  <use xlink:href="#glyph0-6" x="756.75" y="438.871762"/>
  <use xlink:href="#glyph0-7" x="760.5" y="438.871762"/>
  <use xlink:href="#glyph0-6" x="768.75" y="438.871762"/>
  <use xlink:href="#glyph0-2" x="772.5" y="438.871762"/>
  <use xlink:href="#glyph0-17" x="778.875" y="438.871762"/>
  <use xlink:href="#glyph0-5" x="787.125" y="438.871762"/>
  <use xlink:href="#glyph0-8" x="789.75" y="438.871762"/>
  <use xlink:href="#glyph0-10" x="796.125" y="438.871762"/>
  <use xlink:href="#glyph0-2" x="804" y="438.871762"/>
  <use xlink:href="#glyph0-18" x="810.375" y="438.871762"/>
</g>
<path style="fill:none;stroke-width:1;stroke-linecap:butt;stroke-linejoin:miter;stroke:rgb(0%,0%,0%);stroke-opacity:1;stroke-miterlimit:4;" d="M 1180.75 -111.601154 C 1171.90625 -111.601154 44.864583 -111.601154 36.052083 -111.601154 " transform="matrix(0.375,0,0,0.374848,1.5,491.388149)"/>
<path style="fill:none;stroke-width:1;stroke-linecap:butt;stroke-linejoin:miter;stroke:rgb(0%,0%,0%);stroke-opacity:1;stroke-miterlimit:4;" d="M 36 -111.6741 C 36 -117.15549 36 -466.078233 36 -471.538781 " transform="matrix(0.375,0,0,0.374848,1.5,491.388149)"/>
<path style="fill:none;stroke-width:1;stroke-linecap:butt;stroke-linejoin:miter;stroke:rgb(0%,0%,0%);stroke-opacity:1;stroke-miterlimit:4;" d="M 36.052083 -471.601306 C 37.708333 -471.601306 78.552083 -471.601306 97.947917 -471.601306 " transform="matrix(0.375,0,0,0.374848,1.5,491.388149)"/>
<path style="fill-rule:nonzero;fill:rgb(0%,0%,0%);fill-opacity:1;stroke-width:1;stroke-linecap:butt;stroke-linejoin:miter;stroke:rgb(0%,0%,0%);stroke-opacity:1;stroke-miterlimit:4;" d="M 97.947917 -475.102726 L 107.947917 -471.601306 L 97.947917 -468.099886 Z M 97.947917 -475.102726 " transform="matrix(0.375,0,0,0.374848,1.5,491.388149)"/>
<path style="fill:none;stroke-width:1;stroke-linecap:butt;stroke-linejoin:miter;stroke:rgb(0%,0%,0%);stroke-opacity:1;stroke-miterlimit:4;" d="M 1555.25 -111.601154 C 1564.09375 -111.601154 2691.135417 -111.601154 2699.947917 -111.601154 " transform="matrix(0.375,0,0,0.374848,1.5,491.388149)"/>
<path style="fill:none;stroke-width:1;stroke-linecap:butt;stroke-linejoin:miter;stroke:rgb(0%,0%,0%);stroke-opacity:1;stroke-miterlimit:4;" d="M 2700 -111.6741 C 2700 -117.15549 2700 -466.078233 2700 -471.538781 " transform="matrix(0.375,0,0,0.374848,1.5,491.388149)"/>
<path style="fill:none;stroke-width:1;stroke-linecap:butt;stroke-linejoin:miter;stroke:rgb(0%,0%,0%);stroke-opacity:1;stroke-miterlimit:4;" d="M 2699.916667 -471.601306 C 2696.697917 -471.601306 2595.25 -471.601306 2592.083333 -471.601306 " transform="matrix(0.375,0,0,0.374848,1.5,491.388149)"/>
<path style="fill-rule:nonzero;fill:rgb(100%,100%,0%);fill-opacity:1;stroke-width:1;stroke-linecap:butt;stroke-linejoin:miter;stroke:rgb(0%,0%,0%);stroke-opacity:1;stroke-miterlimit:4;" d="M 1367.895833 -1213.099912 L 1180.895833 -1213.099912 L 1180.895833 -1026.096996 L 1367.895833 -1026.096996 Z M 1367.895833 -1213.099912 " transform="matrix(0.375,0,0,0.374848,1.5,491.388149)"/>
<g style="fill:rgb(0%,0%,0%);fill-opacity:1;">
  <use xlink:href="#glyph1-11" x="452.210938" y="65.335325"/>
  <use xlink:href="#glyph1-6" x="456.335938" y="65.335325"/>
  <use xlink:href="#glyph1-7" x="460.835938" y="65.335325"/>
  <use xlink:href="#glyph1-13" x="463.460938" y="65.335325"/>
  <use xlink:href="#glyph1-17" x="470.210938" y="65.335325"/>
  <use xlink:href="#glyph1-18" x="475.460938" y="65.335325"/>
  <use xlink:href="#glyph1-5" x="479.960938" y="65.335325"/>
  <use xlink:href="#glyph1-6" x="484.835938" y="65.335325"/>
  <use xlink:href="#glyph1-7" x="489.335938" y="65.335325"/>
  <use xlink:href="#glyph1-1" x="491.960938" y="65.335325"/>
  <use xlink:href="#glyph1-8" x="497.210938" y="65.335325"/>
  <use xlink:href="#glyph1-11" x="502.460938" y="65.335325"/>
</g>
<g style="fill:rgb(0%,0%,0%);fill-opacity:1;">
  <use xlink:href="#glyph1-5" x="471.523438" y="73.581419"/>
  <use xlink:href="#glyph1-8" x="476.773438" y="73.581419"/>
  <use xlink:href="#glyph1-16" x="482.023438" y="73.581419"/>
</g>
<g style="fill:rgb(0%,0%,0%);fill-opacity:1;">
  <use xlink:href="#glyph1-1" x="450.335938" y="81.827513"/>
  <use xlink:href="#glyph1-11" x="455.585938" y="81.827513"/>
  <use xlink:href="#glyph1-14" x="459.710938" y="81.827513"/>
  <use xlink:href="#glyph1-7" x="464.585938" y="81.827513"/>
  <use xlink:href="#glyph1-18" x="467.210938" y="81.827513"/>
  <use xlink:href="#glyph1-18" x="471.710938" y="81.827513"/>
  <use xlink:href="#glyph1-1" x="476.210938" y="81.827513"/>
  <use xlink:href="#glyph1-11" x="481.460938" y="81.827513"/>
  <use xlink:href="#glyph1-14" x="485.585938" y="81.827513"/>
  <use xlink:href="#glyph1-1" x="490.460938" y="81.827513"/>
  <use xlink:href="#glyph1-2" x="495.710938" y="81.827513"/>
  <use xlink:href="#glyph1-3" x="499.835938" y="81.827513"/>
  <use xlink:href="#glyph1-11" x="504.335938" y="81.827513"/>
</g>
<path style="fill-rule:nonzero;fill:rgb(100%,100%,0%);fill-opacity:1;stroke-width:1;stroke-linecap:butt;stroke-linejoin:miter;stroke:rgb(0%,0%,0%);stroke-opacity:1;stroke-miterlimit:4;" d="M 1555.104167 -1213.099912 L 1368.104167 -1213.099912 L 1368.104167 -1026.096996 L 1555.104167 -1026.096996 Z M 1555.104167 -1213.099912 " transform="matrix(0.375,0,0,0.374848,1.5,491.388149)"/>
<g style="fill:rgb(0%,0%,0%);fill-opacity:1;">
  <use xlink:href="#glyph1-14" x="524.664062" y="69.460325"/>
  <use xlink:href="#glyph1-5" x="529.539062" y="69.460325"/>
  <use xlink:href="#glyph1-18" x="534.789062" y="69.460325"/>
  <use xlink:href="#glyph1-7" x="539.289062" y="69.460325"/>
  <use xlink:href="#glyph1-19" x="541.914062" y="69.460325"/>
  <use xlink:href="#glyph1-4" x="546.789062" y="69.460325"/>
  <use xlink:href="#glyph1-5" x="552.039062" y="69.460325"/>
  <use xlink:href="#glyph1-6" x="556.914062" y="69.460325"/>
  <use xlink:href="#glyph1-7" x="561.414062" y="69.460325"/>
  <use xlink:href="#glyph1-1" x="564.039062" y="69.460325"/>
  <use xlink:href="#glyph1-8" x="569.289062" y="69.460325"/>
</g>
<g style="fill:rgb(0%,0%,0%);fill-opacity:1;">
  <use xlink:href="#glyph1-11" x="539.476562" y="77.706419"/>
  <use xlink:href="#glyph1-17" x="543.601562" y="77.706419"/>
  <use xlink:href="#glyph1-4" x="548.851562" y="77.706419"/>
  <use xlink:href="#glyph1-20" x="554.101562" y="77.706419"/>
  <use xlink:href="#glyph1-21" x="557.851562" y="77.706419"/>
</g>
<path style="fill:none;stroke-width:1;stroke-linecap:butt;stroke-linejoin:miter;stroke:rgb(0%,0%,0%);stroke-opacity:1;stroke-miterlimit:4;" d="M 1368 -932.319384 C 1368 -930.683304 1368 -905.256327 1368 -903.682772 " transform="matrix(0.375,0,0,0.374848,1.5,491.388149)"/>
<path style="fill:none;stroke-width:1;stroke-linecap:butt;stroke-linejoin:miter;stroke:rgb(0%,0%,0%);stroke-opacity:1;stroke-miterlimit:4;" d="M 1367.947917 -903.599405 C 1360.166667 -903.599405 367.802083 -903.599405 360.052083 -903.599405 " transform="matrix(0.375,0,0,0.374848,1.5,491.388149)"/>
<path style="fill:none;stroke-width:1;stroke-linecap:butt;stroke-linejoin:miter;stroke:rgb(0%,0%,0%);stroke-opacity:1;stroke-miterlimit:4;" d="M 1368.052083 -903.599405 C 1375.833333 -903.599405 2368.197917 -903.599405 2375.947917 -903.599405 " transform="matrix(0.375,0,0,0.374848,1.5,491.388149)"/>
<path style="fill:none;stroke-width:1;stroke-linecap:butt;stroke-linejoin:miter;stroke:rgb(0%,0%,0%);stroke-opacity:1;stroke-miterlimit:4;" d="M 1368 -903.495196 C 1368 -901.452701 1368 -869.6794 1368 -867.69943 " transform="matrix(0.375,0,0,0.374848,1.5,491.388149)"/>
<path style="fill:none;stroke-width:1;stroke-linecap:butt;stroke-linejoin:miter;stroke:rgb(0%,0%,0%);stroke-opacity:1;stroke-miterlimit:4;" d="M 360 -903.495196 C 360 -901.452701 360 -869.6794 360 -867.69943 " transform="matrix(0.375,0,0,0.374848,1.5,491.388149)"/>
<path style="fill:none;stroke-width:1;stroke-linecap:butt;stroke-linejoin:miter;stroke:rgb(0%,0%,0%);stroke-opacity:1;stroke-miterlimit:4;" d="M 2376 -903.495196 C 2376 -901.452701 2376 -869.6794 2376 -867.69943 " transform="matrix(0.375,0,0,0.374848,1.5,491.388149)"/>
<path style=" stroke:none;fill-rule:nonzero;fill:rgb(62.7451%,32.156864%,17.647059%);fill-opacity:1;" d="M 987 247.136719 L 42 247.136719 L 42 382.082031 L 987 382.082031 Z M 987 247.136719 "/>
<g style="fill:rgb(100%,100%,100%);fill-opacity:1;">
  <use xlink:href="#glyph0-8" x="488.4375" y="256.133481"/>
  <use xlink:href="#glyph0-10" x="494.8125" y="256.133481"/>
  <use xlink:href="#glyph0-2" x="502.6875" y="256.133481"/>
  <use xlink:href="#glyph0-18" x="509.0625" y="256.133481"/>
  <use xlink:href="#glyph0-16" x="517.3125" y="256.133481"/>
  <use xlink:href="#glyph0-6" x="524.0625" y="256.133481"/>
  <use xlink:href="#glyph0-2" x="527.8125" y="256.133481"/>
  <use xlink:href="#glyph0-8" x="533.8125" y="256.133481"/>
</g>
<path style=" stroke:none;fill-rule:nonzero;fill:rgb(67.843139%,84.705883%,90.196079%);fill-opacity:1;" d="M 217.5 166.171875 L 55.5 166.171875 L 55.5 193.160156 L 217.5 193.160156 Z M 217.5 166.171875 "/>
<g style="fill:rgb(0%,0%,0%);fill-opacity:1;">
  <use xlink:href="#glyph1-2" x="111.9375" y="177.417356"/>
  <use xlink:href="#glyph1-1" x="116.0625" y="177.417356"/>
  <use xlink:href="#glyph1-11" x="121.3125" y="177.417356"/>
  <use xlink:href="#glyph1-6" x="125.4375" y="177.417356"/>
  <use xlink:href="#glyph1-9" x="129.9375" y="177.417356"/>
  <use xlink:href="#glyph1-4" x="135.1875" y="177.417356"/>
  <use xlink:href="#glyph1-3" x="140.4375" y="177.417356"/>
  <use xlink:href="#glyph1-11" x="144.9375" y="177.417356"/>
  <use xlink:href="#glyph1-10" x="149.0625" y="177.417356"/>
  <use xlink:href="#glyph1-16" x="150.9375" y="177.417356"/>
  <use xlink:href="#glyph1-19" x="156.1875" y="177.417356"/>
</g>
<g style="fill:rgb(0%,0%,0%);fill-opacity:1;">
  <use xlink:href="#glyph1-11" x="98.25" y="185.66345"/>
  <use xlink:href="#glyph1-6" x="102.375" y="185.66345"/>
  <use xlink:href="#glyph1-7" x="106.875" y="185.66345"/>
  <use xlink:href="#glyph1-13" x="109.5" y="185.66345"/>
  <use xlink:href="#glyph1-21" x="116.25" y="185.66345"/>
  <use xlink:href="#glyph1-10" x="118.125" y="185.66345"/>
  <use xlink:href="#glyph1-11" x="120" y="185.66345"/>
  <use xlink:href="#glyph1-7" x="124.125" y="185.66345"/>
  <use xlink:href="#glyph1-9" x="126.75" y="185.66345"/>
  <use xlink:href="#glyph1-8" x="132" y="185.66345"/>
  <use xlink:href="#glyph1-5" x="137.25" y="185.66345"/>
  <use xlink:href="#glyph1-18" x="142.5" y="185.66345"/>
  <use xlink:href="#glyph1-10" x="147" y="185.66345"/>
  <use xlink:href="#glyph1-5" x="148.875" y="185.66345"/>
  <use xlink:href="#glyph1-4" x="154.125" y="185.66345"/>
  <use xlink:href="#glyph1-4" x="159.375" y="185.66345"/>
  <use xlink:href="#glyph1-5" x="164.625" y="185.66345"/>
  <use xlink:href="#glyph1-12" x="169.5" y="185.66345"/>
</g>
<path style=" stroke:none;fill-rule:nonzero;fill:rgb(56.470591%,93.333334%,56.470591%);fill-opacity:1;" d="M 217.5 260.632812 L 55.5 260.632812 L 55.5 368.589844 L 217.5 368.589844 Z M 217.5 260.632812 "/>
<g style="fill:rgb(0%,0%,0%);fill-opacity:1;">
  <use xlink:href="#glyph1-9" x="97.875" y="295.491575"/>
  <use xlink:href="#glyph1-3" x="103.125" y="295.491575"/>
  <use xlink:href="#glyph1-6" x="107.625" y="295.491575"/>
  <use xlink:href="#glyph1-10" x="112.125" y="295.491575"/>
  <use xlink:href="#glyph1-2" x="114" y="295.491575"/>
  <use xlink:href="#glyph1-1" x="118.125" y="295.491575"/>
  <use xlink:href="#glyph1-11" x="123.375" y="295.491575"/>
  <use xlink:href="#glyph1-6" x="127.5" y="295.491575"/>
  <use xlink:href="#glyph1-9" x="132" y="295.491575"/>
  <use xlink:href="#glyph1-4" x="137.25" y="295.491575"/>
  <use xlink:href="#glyph1-3" x="142.5" y="295.491575"/>
  <use xlink:href="#glyph1-11" x="147" y="295.491575"/>
  <use xlink:href="#glyph1-10" x="151.125" y="295.491575"/>
  <use xlink:href="#glyph1-11" x="153" y="295.491575"/>
  <use xlink:href="#glyph1-6" x="157.125" y="295.491575"/>
  <use xlink:href="#glyph1-7" x="161.625" y="295.491575"/>
  <use xlink:href="#glyph1-13" x="164.25" y="295.491575"/>
  <use xlink:href="#glyph1-11" x="171" y="295.491575"/>
</g>
<g style="fill:rgb(0%,0%,0%);fill-opacity:1;">
  <use xlink:href="#glyph1-20" x="81.375" y="303.737669"/>
  <use xlink:href="#glyph1-1" x="85.5" y="303.737669"/>
  <use xlink:href="#glyph1-4" x="90.75" y="303.737669"/>
  <use xlink:href="#glyph1-10" x="95.625" y="303.737669"/>
  <use xlink:href="#glyph1-8" x="97.5" y="303.737669"/>
  <use xlink:href="#glyph1-3" x="102.75" y="303.737669"/>
  <use xlink:href="#glyph1-22" x="107.25" y="303.737669"/>
  <use xlink:href="#glyph1-6" x="112.875" y="303.737669"/>
  <use xlink:href="#glyph1-10" x="117.375" y="303.737669"/>
  <use xlink:href="#glyph1-11" x="119.25" y="303.737669"/>
  <use xlink:href="#glyph1-7" x="123.375" y="303.737669"/>
  <use xlink:href="#glyph1-13" x="126" y="303.737669"/>
  <use xlink:href="#glyph1-17" x="132.75" y="303.737669"/>
  <use xlink:href="#glyph1-18" x="138" y="303.737669"/>
  <use xlink:href="#glyph1-5" x="142.5" y="303.737669"/>
  <use xlink:href="#glyph1-6" x="147.375" y="303.737669"/>
  <use xlink:href="#glyph1-7" x="151.875" y="303.737669"/>
  <use xlink:href="#glyph1-1" x="154.5" y="303.737669"/>
  <use xlink:href="#glyph1-8" x="159.75" y="303.737669"/>
  <use xlink:href="#glyph1-10" x="165" y="303.737669"/>
  <use xlink:href="#glyph1-19" x="166.875" y="303.737669"/>
  <use xlink:href="#glyph1-18" x="171.75" y="303.737669"/>
  <use xlink:href="#glyph1-1" x="176.25" y="303.737669"/>
  <use xlink:href="#glyph1-14" x="181.5" y="303.737669"/>
  <use xlink:href="#glyph1-23" x="186.375" y="303.737669"/>
</g>
<g style="fill:rgb(0%,0%,0%);fill-opacity:1;">
  <use xlink:href="#glyph1-4" x="87.5625" y="320.983763"/>
  <use xlink:href="#glyph1-3" x="92.8125" y="320.983763"/>
  <use xlink:href="#glyph1-5" x="97.3125" y="320.983763"/>
  <use xlink:href="#glyph1-16" x="102.5625" y="320.983763"/>
  <use xlink:href="#glyph1-11" x="107.8125" y="320.983763"/>
  <use xlink:href="#glyph1-10" x="111.9375" y="320.983763"/>
  <use xlink:href="#glyph1-5" x="113.8125" y="320.983763"/>
  <use xlink:href="#glyph1-10" x="119.0625" y="320.983763"/>
  <use xlink:href="#glyph1-19" x="120.9375" y="320.983763"/>
  <use xlink:href="#glyph1-18" x="125.8125" y="320.983763"/>
  <use xlink:href="#glyph1-1" x="130.3125" y="320.983763"/>
  <use xlink:href="#glyph1-14" x="135.5625" y="320.983763"/>
  <use xlink:href="#glyph1-23" x="140.4375" y="320.983763"/>
  <use xlink:href="#glyph1-10" x="145.6875" y="320.983763"/>
  <use xlink:href="#glyph1-1" x="147.5625" y="320.983763"/>
  <use xlink:href="#glyph1-20" x="152.8125" y="320.983763"/>
  <use xlink:href="#glyph1-10" x="156.9375" y="320.983763"/>
  <use xlink:href="#glyph1-3" x="158.8125" y="320.983763"/>
  <use xlink:href="#glyph1-21" x="163.3125" y="320.983763"/>
  <use xlink:href="#glyph1-9" x="165.1875" y="320.983763"/>
  <use xlink:href="#glyph1-21" x="170.4375" y="320.983763"/>
  <use xlink:href="#glyph1-10" x="172.3125" y="320.983763"/>
  <use xlink:href="#glyph1-24" x="174.1875" y="320.983763"/>
  <use xlink:href="#glyph1-25" x="177.9375" y="320.983763"/>
  <use xlink:href="#glyph1-25" x="181.6875" y="320.983763"/>
</g>
<g style="fill:rgb(0%,0%,0%);fill-opacity:1;">
  <use xlink:href="#glyph1-11" x="88.875" y="329.229856"/>
  <use xlink:href="#glyph1-6" x="93" y="329.229856"/>
  <use xlink:href="#glyph1-7" x="97.5" y="329.229856"/>
  <use xlink:href="#glyph1-13" x="100.125" y="329.229856"/>
  <use xlink:href="#glyph1-10" x="106.875" y="329.229856"/>
  <use xlink:href="#glyph1-26" x="108.75" y="329.229856"/>
  <use xlink:href="#glyph1-5" x="113.25" y="329.229856"/>
  <use xlink:href="#glyph1-18" x="118.5" y="329.229856"/>
  <use xlink:href="#glyph1-17" x="123" y="329.229856"/>
  <use xlink:href="#glyph1-3" x="128.25" y="329.229856"/>
  <use xlink:href="#glyph1-11" x="132.75" y="329.229856"/>
  <use xlink:href="#glyph1-10" x="136.875" y="329.229856"/>
  <use xlink:href="#glyph1-7" x="138.75" y="329.229856"/>
  <use xlink:href="#glyph1-20" x="141.375" y="329.229856"/>
  <use xlink:href="#glyph1-10" x="145.5" y="329.229856"/>
  <use xlink:href="#glyph1-2" x="147.375" y="329.229856"/>
  <use xlink:href="#glyph1-4" x="151.5" y="329.229856"/>
  <use xlink:href="#glyph1-3" x="156.75" y="329.229856"/>
  <use xlink:href="#glyph1-26" x="161.25" y="329.229856"/>
  <use xlink:href="#glyph1-7" x="166.875" y="329.229856"/>
  <use xlink:href="#glyph1-1" x="169.5" y="329.229856"/>
  <use xlink:href="#glyph1-17" x="174.75" y="329.229856"/>
  <use xlink:href="#glyph1-11" x="180" y="329.229856"/>
</g>
<g style="fill:rgb(0%,0%,0%);fill-opacity:1;">
  <use xlink:href="#glyph1-24" x="79.875" y="337.47595"/>
  <use xlink:href="#glyph1-25" x="83.625" y="337.47595"/>
  <use xlink:href="#glyph1-25" x="87.375" y="337.47595"/>
  <use xlink:href="#glyph1-10" x="91.125" y="337.47595"/>
  <use xlink:href="#glyph1-11" x="93" y="337.47595"/>
  <use xlink:href="#glyph1-6" x="97.125" y="337.47595"/>
  <use xlink:href="#glyph1-7" x="101.625" y="337.47595"/>
  <use xlink:href="#glyph1-13" x="104.25" y="337.47595"/>
  <use xlink:href="#glyph1-10" x="111" y="337.47595"/>
  <use xlink:href="#glyph1-26" x="112.875" y="337.47595"/>
  <use xlink:href="#glyph1-5" x="117.375" y="337.47595"/>
  <use xlink:href="#glyph1-18" x="122.625" y="337.47595"/>
  <use xlink:href="#glyph1-11" x="127.125" y="337.47595"/>
  <use xlink:href="#glyph1-21" x="131.25" y="337.47595"/>
  <use xlink:href="#glyph1-10" x="133.125" y="337.47595"/>
  <use xlink:href="#glyph1-5" x="135" y="337.47595"/>
  <use xlink:href="#glyph1-4" x="140.25" y="337.47595"/>
  <use xlink:href="#glyph1-3" x="145.5" y="337.47595"/>
  <use xlink:href="#glyph1-10" x="150" y="337.47595"/>
  <use xlink:href="#glyph1-2" x="151.875" y="337.47595"/>
  <use xlink:href="#glyph1-4" x="156" y="337.47595"/>
  <use xlink:href="#glyph1-1" x="160.5" y="337.47595"/>
  <use xlink:href="#glyph1-14" x="165.75" y="337.47595"/>
  <use xlink:href="#glyph1-3" x="170.625" y="337.47595"/>
  <use xlink:href="#glyph1-11" x="175.125" y="337.47595"/>
  <use xlink:href="#glyph1-11" x="179.25" y="337.47595"/>
  <use xlink:href="#glyph1-3" x="183.375" y="337.47595"/>
  <use xlink:href="#glyph1-16" x="187.875" y="337.47595"/>
</g>
<path style="fill:none;stroke-width:1;stroke-linecap:butt;stroke-linejoin:miter;stroke:rgb(0%,0%,0%);stroke-opacity:1;stroke-miterlimit:4;" d="M 360 -795.430541 C 360 -753.350977 360 -681.259242 360 -615.774354 " transform="matrix(0.375,0,0,0.374848,1.5,491.388149)"/>
<path style=" stroke:none;fill-rule:nonzero;fill:rgb(67.843139%,84.705883%,90.196079%);fill-opacity:1;" d="M 595.5 166.171875 L 433.5 166.171875 L 433.5 193.160156 L 595.5 193.160156 Z M 595.5 166.171875 "/>
<g style="fill:rgb(0%,0%,0%);fill-opacity:1;">
  <use xlink:href="#glyph1-2" x="489.9375" y="177.417356"/>
  <use xlink:href="#glyph1-1" x="494.0625" y="177.417356"/>
  <use xlink:href="#glyph1-11" x="499.3125" y="177.417356"/>
  <use xlink:href="#glyph1-6" x="503.4375" y="177.417356"/>
  <use xlink:href="#glyph1-9" x="507.9375" y="177.417356"/>
  <use xlink:href="#glyph1-4" x="513.1875" y="177.417356"/>
  <use xlink:href="#glyph1-3" x="518.4375" y="177.417356"/>
  <use xlink:href="#glyph1-11" x="522.9375" y="177.417356"/>
  <use xlink:href="#glyph1-10" x="527.0625" y="177.417356"/>
  <use xlink:href="#glyph1-16" x="528.9375" y="177.417356"/>
  <use xlink:href="#glyph1-19" x="534.1875" y="177.417356"/>
</g>
<g style="fill:rgb(0%,0%,0%);fill-opacity:1;">
  <use xlink:href="#glyph1-14" x="496.6875" y="185.66345"/>
  <use xlink:href="#glyph1-5" x="501.5625" y="185.66345"/>
  <use xlink:href="#glyph1-18" x="506.8125" y="185.66345"/>
  <use xlink:href="#glyph1-10" x="511.3125" y="185.66345"/>
  <use xlink:href="#glyph1-16" x="513.1875" y="185.66345"/>
  <use xlink:href="#glyph1-5" x="518.0625" y="185.66345"/>
  <use xlink:href="#glyph1-6" x="522.9375" y="185.66345"/>
  <use xlink:href="#glyph1-5" x="527.0625" y="185.66345"/>
</g>
<path style="fill-rule:nonzero;fill:rgb(100%,64.705884%,0%);fill-opacity:1;stroke-width:1;stroke-linecap:butt;stroke-linejoin:miter;stroke:rgb(0%,0%,0%);stroke-opacity:1;stroke-miterlimit:4;" d="M 1584 -615.597199 L 1152 -615.597199 L 1152 -327.594993 L 1584 -327.594993 Z M 1584 -615.597199 " transform="matrix(0.375,0,0,0.374848,1.5,491.388149)"/>
<g style="fill:rgb(0%,0%,0%);fill-opacity:1;">
  <use xlink:href="#glyph1-1" x="473.8125" y="303.737669"/>
  <use xlink:href="#glyph1-19" x="479.0625" y="303.737669"/>
  <use xlink:href="#glyph1-27" x="483.9375" y="303.737669"/>
  <use xlink:href="#glyph1-10" x="486.9375" y="303.737669"/>
  <use xlink:href="#glyph1-14" x="488.8125" y="303.737669"/>
  <use xlink:href="#glyph1-1" x="493.6875" y="303.737669"/>
  <use xlink:href="#glyph1-13" x="498.9375" y="303.737669"/>
  <use xlink:href="#glyph1-2" x="505.6875" y="303.737669"/>
  <use xlink:href="#glyph1-7" x="509.8125" y="303.737669"/>
  <use xlink:href="#glyph1-18" x="512.4375" y="303.737669"/>
  <use xlink:href="#glyph1-3" x="516.9375" y="303.737669"/>
  <use xlink:href="#glyph1-16" x="521.4375" y="303.737669"/>
  <use xlink:href="#glyph1-10" x="526.6875" y="303.737669"/>
  <use xlink:href="#glyph1-1" x="528.5625" y="303.737669"/>
  <use xlink:href="#glyph1-17" x="533.8125" y="303.737669"/>
  <use xlink:href="#glyph1-6" x="539.4375" y="303.737669"/>
  <use xlink:href="#glyph1-10" x="543.9375" y="303.737669"/>
  <use xlink:href="#glyph1-1" x="545.8125" y="303.737669"/>
  <use xlink:href="#glyph1-20" x="551.0625" y="303.737669"/>
</g>
<g style="fill:rgb(0%,0%,0%);fill-opacity:1;">
  <use xlink:href="#glyph1-17" x="449.4375" y="311.987669"/>
  <use xlink:href="#glyph1-8" x="454.6875" y="311.987669"/>
  <use xlink:href="#glyph1-14" x="459.9375" y="311.987669"/>
  <use xlink:href="#glyph1-15" x="464.8125" y="311.987669"/>
  <use xlink:href="#glyph1-5" x="470.4375" y="311.987669"/>
  <use xlink:href="#glyph1-8" x="475.6875" y="311.987669"/>
  <use xlink:href="#glyph1-9" x="480.9375" y="311.987669"/>
  <use xlink:href="#glyph1-3" x="486.1875" y="311.987669"/>
  <use xlink:href="#glyph1-16" x="490.6875" y="311.987669"/>
  <use xlink:href="#glyph1-10" x="495.9375" y="311.987669"/>
  <use xlink:href="#glyph1-18" x="497.8125" y="311.987669"/>
  <use xlink:href="#glyph1-3" x="502.3125" y="311.987669"/>
  <use xlink:href="#glyph1-9" x="506.8125" y="311.987669"/>
  <use xlink:href="#glyph1-5" x="512.0625" y="311.987669"/>
  <use xlink:href="#glyph1-14" x="516.9375" y="311.987669"/>
  <use xlink:href="#glyph1-12" x="521.8125" y="311.987669"/>
  <use xlink:href="#glyph1-10" x="527.0625" y="311.987669"/>
  <use xlink:href="#glyph1-11" x="528.9375" y="311.987669"/>
  <use xlink:href="#glyph1-1" x="533.0625" y="311.987669"/>
  <use xlink:href="#glyph1-17" x="538.3125" y="311.987669"/>
  <use xlink:href="#glyph1-4" x="543.5625" y="311.987669"/>
  <use xlink:href="#glyph1-14" x="548.4375" y="311.987669"/>
  <use xlink:href="#glyph1-3" x="553.3125" y="311.987669"/>
  <use xlink:href="#glyph1-10" x="557.8125" y="311.987669"/>
  <use xlink:href="#glyph1-14" x="559.6875" y="311.987669"/>
  <use xlink:href="#glyph1-1" x="564.5625" y="311.987669"/>
  <use xlink:href="#glyph1-16" x="569.8125" y="311.987669"/>
  <use xlink:href="#glyph1-3" x="575.0625" y="311.987669"/>
</g>
<g style="fill:rgb(0%,0%,0%);fill-opacity:1;">
  <use xlink:href="#glyph1-14" x="469.875" y="329.229856"/>
  <use xlink:href="#glyph1-10" x="474.75" y="329.229856"/>
  <use xlink:href="#glyph1-13" x="476.625" y="329.229856"/>
  <use xlink:href="#glyph1-1" x="483.375" y="329.229856"/>
  <use xlink:href="#glyph1-16" x="488.625" y="329.229856"/>
  <use xlink:href="#glyph1-17" x="493.875" y="329.229856"/>
  <use xlink:href="#glyph1-18" x="499.125" y="329.229856"/>
  <use xlink:href="#glyph1-3" x="503.625" y="329.229856"/>
  <use xlink:href="#glyph1-10" x="508.125" y="329.229856"/>
  <use xlink:href="#glyph1-6" x="510" y="329.229856"/>
  <use xlink:href="#glyph1-1" x="514.5" y="329.229856"/>
  <use xlink:href="#glyph1-10" x="519.75" y="329.229856"/>
  <use xlink:href="#glyph1-11" x="521.625" y="329.229856"/>
  <use xlink:href="#glyph1-7" x="525.75" y="329.229856"/>
  <use xlink:href="#glyph1-13" x="528.375" y="329.229856"/>
  <use xlink:href="#glyph1-17" x="535.125" y="329.229856"/>
  <use xlink:href="#glyph1-18" x="540.375" y="329.229856"/>
  <use xlink:href="#glyph1-5" x="544.875" y="329.229856"/>
  <use xlink:href="#glyph1-6" x="549.75" y="329.229856"/>
  <use xlink:href="#glyph1-3" x="554.625" y="329.229856"/>
</g>
<path style="fill:none;stroke-width:1;stroke-linecap:butt;stroke-linejoin:miter;stroke:rgb(0%,0%,0%);stroke-opacity:1;stroke-miterlimit:4;" d="M 1368 -795.430541 C 1368 -753.350977 1368 -681.259242 1368 -615.774354 " transform="matrix(0.375,0,0,0.374848,1.5,491.388149)"/>
<path style=" stroke:none;fill-rule:nonzero;fill:rgb(67.843139%,84.705883%,90.196079%);fill-opacity:1;" d="M 973.5 166.171875 L 811.5 166.171875 L 811.5 193.160156 L 973.5 193.160156 Z M 973.5 166.171875 "/>
<g style="fill:rgb(0%,0%,0%);fill-opacity:1;">
  <use xlink:href="#glyph1-2" x="867.9375" y="177.417356"/>
  <use xlink:href="#glyph1-1" x="872.0625" y="177.417356"/>
  <use xlink:href="#glyph1-11" x="877.3125" y="177.417356"/>
  <use xlink:href="#glyph1-6" x="881.4375" y="177.417356"/>
  <use xlink:href="#glyph1-9" x="885.9375" y="177.417356"/>
  <use xlink:href="#glyph1-4" x="891.1875" y="177.417356"/>
  <use xlink:href="#glyph1-3" x="896.4375" y="177.417356"/>
  <use xlink:href="#glyph1-11" x="900.9375" y="177.417356"/>
  <use xlink:href="#glyph1-10" x="905.0625" y="177.417356"/>
  <use xlink:href="#glyph1-16" x="906.9375" y="177.417356"/>
  <use xlink:href="#glyph1-19" x="912.1875" y="177.417356"/>
</g>
<g style="fill:rgb(0%,0%,0%);fill-opacity:1;">
  <use xlink:href="#glyph1-16" x="855.75" y="185.66345"/>
  <use xlink:href="#glyph1-5" x="860.625" y="185.66345"/>
  <use xlink:href="#glyph1-28" x="865.5" y="185.66345"/>
  <use xlink:href="#glyph1-21" x="870.75" y="185.66345"/>
  <use xlink:href="#glyph1-10" x="872.625" y="185.66345"/>
  <use xlink:href="#glyph1-11" x="874.5" y="185.66345"/>
  <use xlink:href="#glyph1-7" x="878.625" y="185.66345"/>
  <use xlink:href="#glyph1-9" x="881.25" y="185.66345"/>
  <use xlink:href="#glyph1-8" x="886.5" y="185.66345"/>
  <use xlink:href="#glyph1-5" x="891.75" y="185.66345"/>
  <use xlink:href="#glyph1-18" x="897" y="185.66345"/>
  <use xlink:href="#glyph1-10" x="901.5" y="185.66345"/>
  <use xlink:href="#glyph1-5" x="903.375" y="185.66345"/>
  <use xlink:href="#glyph1-4" x="908.625" y="185.66345"/>
  <use xlink:href="#glyph1-4" x="913.875" y="185.66345"/>
  <use xlink:href="#glyph1-5" x="919.125" y="185.66345"/>
  <use xlink:href="#glyph1-12" x="924" y="185.66345"/>
</g>
<path style=" stroke:none;fill-rule:nonzero;fill:rgb(56.470591%,93.333334%,56.470591%);fill-opacity:1;" d="M 973.5 260.632812 L 811.5 260.632812 L 811.5 368.589844 L 973.5 368.589844 Z M 973.5 260.632812 "/>
<g style="fill:rgb(0%,0%,0%);fill-opacity:1;">
  <use xlink:href="#glyph1-11" x="850.5" y="304.112669"/>
  <use xlink:href="#glyph1-3" x="854.625" y="304.112669"/>
  <use xlink:href="#glyph1-8" x="859.125" y="304.112669"/>
  <use xlink:href="#glyph1-16" x="864.375" y="304.112669"/>
  <use xlink:href="#glyph1-10" x="869.625" y="304.112669"/>
  <use xlink:href="#glyph1-16" x="871.5" y="304.112669"/>
  <use xlink:href="#glyph1-5" x="876.375" y="304.112669"/>
  <use xlink:href="#glyph1-28" x="881.25" y="304.112669"/>
  <use xlink:href="#glyph1-10" x="886.5" y="304.112669"/>
  <use xlink:href="#glyph1-11" x="888.375" y="304.112669"/>
  <use xlink:href="#glyph1-7" x="892.5" y="304.112669"/>
  <use xlink:href="#glyph1-9" x="895.125" y="304.112669"/>
  <use xlink:href="#glyph1-8" x="900.375" y="304.112669"/>
  <use xlink:href="#glyph1-5" x="905.625" y="304.112669"/>
  <use xlink:href="#glyph1-18" x="910.875" y="304.112669"/>
  <use xlink:href="#glyph1-10" x="915.375" y="304.112669"/>
  <use xlink:href="#glyph1-5" x="917.25" y="304.112669"/>
  <use xlink:href="#glyph1-4" x="922.5" y="304.112669"/>
  <use xlink:href="#glyph1-4" x="927.75" y="304.112669"/>
  <use xlink:href="#glyph1-21" x="932.625" y="304.112669"/>
</g>
<g style="fill:rgb(0%,0%,0%);fill-opacity:1;">
  <use xlink:href="#glyph1-6" x="868.125" y="312.362669"/>
  <use xlink:href="#glyph1-1" x="872.625" y="312.362669"/>
  <use xlink:href="#glyph1-10" x="877.875" y="312.362669"/>
  <use xlink:href="#glyph1-2" x="879.75" y="312.362669"/>
  <use xlink:href="#glyph1-1" x="883.875" y="312.362669"/>
  <use xlink:href="#glyph1-11" x="889.125" y="312.362669"/>
  <use xlink:href="#glyph1-6" x="893.25" y="312.362669"/>
  <use xlink:href="#glyph1-9" x="897.75" y="312.362669"/>
  <use xlink:href="#glyph1-4" x="903" y="312.362669"/>
  <use xlink:href="#glyph1-3" x="908.25" y="312.362669"/>
  <use xlink:href="#glyph1-11" x="912.75" y="312.362669"/>
</g>
<g style="fill:rgb(0%,0%,0%);fill-opacity:1;">
  <use xlink:href="#glyph1-7" x="838.3125" y="320.608763"/>
  <use xlink:href="#glyph1-20" x="840.9375" y="320.608763"/>
  <use xlink:href="#glyph1-10" x="845.0625" y="320.608763"/>
  <use xlink:href="#glyph1-5" x="846.9375" y="320.608763"/>
  <use xlink:href="#glyph1-18" x="852.1875" y="320.608763"/>
  <use xlink:href="#glyph1-18" x="856.6875" y="320.608763"/>
  <use xlink:href="#glyph1-10" x="861.1875" y="320.608763"/>
  <use xlink:href="#glyph1-16" x="863.0625" y="320.608763"/>
  <use xlink:href="#glyph1-5" x="867.9375" y="320.608763"/>
  <use xlink:href="#glyph1-28" x="872.8125" y="320.608763"/>
  <use xlink:href="#glyph1-10" x="878.0625" y="320.608763"/>
  <use xlink:href="#glyph1-5" x="879.9375" y="320.608763"/>
  <use xlink:href="#glyph1-4" x="885.1875" y="320.608763"/>
  <use xlink:href="#glyph1-4" x="890.4375" y="320.608763"/>
  <use xlink:href="#glyph1-5" x="895.6875" y="320.608763"/>
  <use xlink:href="#glyph1-12" x="900.5625" y="320.608763"/>
  <use xlink:href="#glyph1-10" x="905.8125" y="320.608763"/>
  <use xlink:href="#glyph1-3" x="907.6875" y="320.608763"/>
  <use xlink:href="#glyph1-18" x="912.1875" y="320.608763"/>
  <use xlink:href="#glyph1-3" x="916.6875" y="320.608763"/>
  <use xlink:href="#glyph1-13" x="921.1875" y="320.608763"/>
  <use xlink:href="#glyph1-3" x="927.9375" y="320.608763"/>
  <use xlink:href="#glyph1-8" x="932.4375" y="320.608763"/>
  <use xlink:href="#glyph1-6" x="938.0625" y="320.608763"/>
  <use xlink:href="#glyph1-11" x="942.5625" y="320.608763"/>
</g>
<g style="fill:rgb(0%,0%,0%);fill-opacity:1;">
  <use xlink:href="#glyph1-29" x="845.625" y="328.854856"/>
  <use xlink:href="#glyph1-3" x="848.25" y="328.854856"/>
  <use xlink:href="#glyph1-21" x="852.75" y="328.854856"/>
  <use xlink:href="#glyph1-9" x="854.625" y="328.854856"/>
  <use xlink:href="#glyph1-21" x="859.875" y="328.854856"/>
  <use xlink:href="#glyph1-10" x="861.75" y="328.854856"/>
  <use xlink:href="#glyph1-24" x="863.625" y="328.854856"/>
  <use xlink:href="#glyph1-25" x="867.375" y="328.854856"/>
  <use xlink:href="#glyph1-25" x="871.125" y="328.854856"/>
  <use xlink:href="#glyph1-30" x="874.875" y="328.854856"/>
  <use xlink:href="#glyph1-10" x="877.5" y="328.854856"/>
  <use xlink:href="#glyph1-5" x="879.375" y="328.854856"/>
  <use xlink:href="#glyph1-4" x="884.625" y="328.854856"/>
  <use xlink:href="#glyph1-3" x="889.875" y="328.854856"/>
  <use xlink:href="#glyph1-10" x="894.375" y="328.854856"/>
  <use xlink:href="#glyph1-14" x="896.25" y="328.854856"/>
  <use xlink:href="#glyph1-1" x="901.125" y="328.854856"/>
  <use xlink:href="#glyph1-18" x="906.375" y="328.854856"/>
  <use xlink:href="#glyph1-18" x="910.875" y="328.854856"/>
  <use xlink:href="#glyph1-3" x="915.375" y="328.854856"/>
  <use xlink:href="#glyph1-14" x="919.875" y="328.854856"/>
  <use xlink:href="#glyph1-6" x="924.75" y="328.854856"/>
  <use xlink:href="#glyph1-3" x="929.625" y="328.854856"/>
  <use xlink:href="#glyph1-16" x="934.125" y="328.854856"/>
</g>
<path style="fill:none;stroke-width:1;stroke-linecap:butt;stroke-linejoin:miter;stroke:rgb(0%,0%,0%);stroke-opacity:1;stroke-miterlimit:4;" d="M 2376 -795.430541 C 2376 -753.350977 2376 -681.259242 2376 -615.774354 " transform="matrix(0.375,0,0,0.374848,1.5,491.388149)"/>
<path style=" stroke:none;fill-rule:nonzero;fill:rgb(56.470591%,93.333334%,56.470591%);fill-opacity:1;" d="M 406.5 260.632812 L 244.5 260.632812 L 244.5 368.589844 L 406.5 368.589844 Z M 406.5 260.632812 "/>
<g style="fill:rgb(0%,0%,0%);fill-opacity:1;">
  <use xlink:href="#glyph1-14" x="259.875" y="287.245481"/>
  <use xlink:href="#glyph1-1" x="264.75" y="287.245481"/>
  <use xlink:href="#glyph1-8" x="270" y="287.245481"/>
  <use xlink:href="#glyph1-26" x="275.25" y="287.245481"/>
  <use xlink:href="#glyph1-3" x="280.875" y="287.245481"/>
  <use xlink:href="#glyph1-4" x="285.375" y="287.245481"/>
  <use xlink:href="#glyph1-6" x="290.25" y="287.245481"/>
  <use xlink:href="#glyph1-10" x="294.75" y="287.245481"/>
  <use xlink:href="#glyph1-11" x="296.625" y="287.245481"/>
  <use xlink:href="#glyph1-6" x="300.75" y="287.245481"/>
  <use xlink:href="#glyph1-7" x="305.25" y="287.245481"/>
  <use xlink:href="#glyph1-13" x="307.875" y="287.245481"/>
  <use xlink:href="#glyph1-10" x="314.625" y="287.245481"/>
  <use xlink:href="#glyph1-11" x="316.5" y="287.245481"/>
  <use xlink:href="#glyph1-7" x="320.625" y="287.245481"/>
  <use xlink:href="#glyph1-9" x="323.25" y="287.245481"/>
  <use xlink:href="#glyph1-8" x="328.5" y="287.245481"/>
  <use xlink:href="#glyph1-5" x="333.75" y="287.245481"/>
  <use xlink:href="#glyph1-18" x="339" y="287.245481"/>
  <use xlink:href="#glyph1-11" x="343.5" y="287.245481"/>
  <use xlink:href="#glyph1-10" x="347.625" y="287.245481"/>
  <use xlink:href="#glyph1-20" x="349.5" y="287.245481"/>
  <use xlink:href="#glyph1-4" x="353.625" y="287.245481"/>
  <use xlink:href="#glyph1-1" x="358.125" y="287.245481"/>
  <use xlink:href="#glyph1-13" x="363.375" y="287.245481"/>
  <use xlink:href="#glyph1-10" x="370.125" y="287.245481"/>
  <use xlink:href="#glyph1-2" x="372" y="287.245481"/>
  <use xlink:href="#glyph1-15" x="376.125" y="287.245481"/>
  <use xlink:href="#glyph1-12" x="381.75" y="287.245481"/>
  <use xlink:href="#glyph1-11" x="387" y="287.245481"/>
</g>
<g style="fill:rgb(0%,0%,0%);fill-opacity:1;">
  <use xlink:href="#glyph1-6" x="264.375" y="295.491575"/>
  <use xlink:href="#glyph1-1" x="268.875" y="295.491575"/>
  <use xlink:href="#glyph1-10" x="274.125" y="295.491575"/>
  <use xlink:href="#glyph1-3" x="276" y="295.491575"/>
  <use xlink:href="#glyph1-14" x="280.5" y="295.491575"/>
  <use xlink:href="#glyph1-17" x="285.375" y="295.491575"/>
  <use xlink:href="#glyph1-10" x="290.625" y="295.491575"/>
  <use xlink:href="#glyph1-5" x="292.5" y="295.491575"/>
  <use xlink:href="#glyph1-8" x="297.75" y="295.491575"/>
  <use xlink:href="#glyph1-16" x="303" y="295.491575"/>
  <use xlink:href="#glyph1-10" x="308.25" y="295.491575"/>
  <use xlink:href="#glyph1-16" x="310.125" y="295.491575"/>
  <use xlink:href="#glyph1-7" x="315.375" y="295.491575"/>
  <use xlink:href="#glyph1-11" x="318" y="295.491575"/>
  <use xlink:href="#glyph1-6" x="322.125" y="295.491575"/>
  <use xlink:href="#glyph1-4" x="326.625" y="295.491575"/>
  <use xlink:href="#glyph1-7" x="331.875" y="295.491575"/>
  <use xlink:href="#glyph1-19" x="334.5" y="295.491575"/>
  <use xlink:href="#glyph1-17" x="339.375" y="295.491575"/>
  <use xlink:href="#glyph1-6" x="345" y="295.491575"/>
  <use xlink:href="#glyph1-3" x="349.875" y="295.491575"/>
  <use xlink:href="#glyph1-10" x="354.375" y="295.491575"/>
  <use xlink:href="#glyph1-6" x="356.25" y="295.491575"/>
  <use xlink:href="#glyph1-1" x="360.75" y="295.491575"/>
  <use xlink:href="#glyph1-10" x="366" y="295.491575"/>
  <use xlink:href="#glyph1-26" x="367.875" y="295.491575"/>
  <use xlink:href="#glyph1-5" x="372.375" y="295.491575"/>
  <use xlink:href="#glyph1-4" x="377.625" y="295.491575"/>
  <use xlink:href="#glyph1-11" x="382.5" y="295.491575"/>
</g>
<g style="fill:rgb(0%,0%,0%);fill-opacity:1;">
  <use xlink:href="#glyph1-6" x="290.8125" y="312.733763"/>
  <use xlink:href="#glyph1-15" x="295.3125" y="312.733763"/>
  <use xlink:href="#glyph1-3" x="300.5625" y="312.733763"/>
  <use xlink:href="#glyph1-4" x="305.0625" y="312.733763"/>
  <use xlink:href="#glyph1-3" x="310.3125" y="312.733763"/>
  <use xlink:href="#glyph1-10" x="314.8125" y="312.733763"/>
  <use xlink:href="#glyph1-7" x="316.6875" y="312.733763"/>
  <use xlink:href="#glyph1-11" x="319.3125" y="312.733763"/>
  <use xlink:href="#glyph1-10" x="323.4375" y="312.733763"/>
  <use xlink:href="#glyph1-1" x="325.3125" y="312.733763"/>
  <use xlink:href="#glyph1-8" x="330.5625" y="312.733763"/>
  <use xlink:href="#glyph1-3" x="335.8125" y="312.733763"/>
  <use xlink:href="#glyph1-10" x="340.3125" y="312.733763"/>
  <use xlink:href="#glyph1-11" x="342.1875" y="312.733763"/>
  <use xlink:href="#glyph1-6" x="346.3125" y="312.733763"/>
  <use xlink:href="#glyph1-7" x="350.8125" y="312.733763"/>
  <use xlink:href="#glyph1-13" x="353.4375" y="312.733763"/>
</g>
<g style="fill:rgb(0%,0%,0%);fill-opacity:1;">
  <use xlink:href="#glyph1-26" x="291.375" y="320.983763"/>
  <use xlink:href="#glyph1-5" x="295.875" y="320.983763"/>
  <use xlink:href="#glyph1-18" x="301.125" y="320.983763"/>
  <use xlink:href="#glyph1-17" x="305.625" y="320.983763"/>
  <use xlink:href="#glyph1-3" x="310.875" y="320.983763"/>
  <use xlink:href="#glyph1-10" x="315.375" y="320.983763"/>
  <use xlink:href="#glyph1-2" x="317.25" y="320.983763"/>
  <use xlink:href="#glyph1-3" x="321.375" y="320.983763"/>
  <use xlink:href="#glyph1-4" x="325.875" y="320.983763"/>
  <use xlink:href="#glyph1-10" x="330.75" y="320.983763"/>
  <use xlink:href="#glyph1-11" x="332.625" y="320.983763"/>
  <use xlink:href="#glyph1-7" x="336.75" y="320.983763"/>
  <use xlink:href="#glyph1-9" x="339.375" y="320.983763"/>
  <use xlink:href="#glyph1-8" x="344.625" y="320.983763"/>
  <use xlink:href="#glyph1-5" x="349.875" y="320.983763"/>
  <use xlink:href="#glyph1-18" x="355.125" y="320.983763"/>
</g>
<g style="fill:rgb(0%,0%,0%);fill-opacity:1;">
  <use xlink:href="#glyph1-5" x="296.8125" y="329.229856"/>
  <use xlink:href="#glyph1-8" x="302.0625" y="329.229856"/>
  <use xlink:href="#glyph1-16" x="307.3125" y="329.229856"/>
  <use xlink:href="#glyph1-10" x="312.5625" y="329.229856"/>
  <use xlink:href="#glyph1-6" x="314.4375" y="329.229856"/>
  <use xlink:href="#glyph1-5" x="318.5625" y="329.229856"/>
  <use xlink:href="#glyph1-11" x="323.8125" y="329.229856"/>
  <use xlink:href="#glyph1-23" x="327.9375" y="329.229856"/>
  <use xlink:href="#glyph1-10" x="333.1875" y="329.229856"/>
  <use xlink:href="#glyph1-14" x="335.0625" y="329.229856"/>
  <use xlink:href="#glyph1-5" x="339.9375" y="329.229856"/>
  <use xlink:href="#glyph1-18" x="345.1875" y="329.229856"/>
  <use xlink:href="#glyph1-18" x="349.6875" y="329.229856"/>
</g>
<g style="fill:rgb(0%,0%,0%);fill-opacity:1;">
  <use xlink:href="#glyph1-14" x="275.4375" y="337.47595"/>
  <use xlink:href="#glyph1-1" x="280.3125" y="337.47595"/>
  <use xlink:href="#glyph1-8" x="285.5625" y="337.47595"/>
  <use xlink:href="#glyph1-26" x="290.8125" y="337.47595"/>
  <use xlink:href="#glyph1-3" x="296.4375" y="337.47595"/>
  <use xlink:href="#glyph1-4" x="300.9375" y="337.47595"/>
  <use xlink:href="#glyph1-6" x="305.8125" y="337.47595"/>
  <use xlink:href="#glyph1-3" x="310.6875" y="337.47595"/>
  <use xlink:href="#glyph1-16" x="315.1875" y="337.47595"/>
  <use xlink:href="#glyph1-10" x="320.4375" y="337.47595"/>
  <use xlink:href="#glyph1-20" x="322.3125" y="337.47595"/>
  <use xlink:href="#glyph1-4" x="326.4375" y="337.47595"/>
  <use xlink:href="#glyph1-1" x="330.9375" y="337.47595"/>
  <use xlink:href="#glyph1-13" x="336.1875" y="337.47595"/>
  <use xlink:href="#glyph1-10" x="342.9375" y="337.47595"/>
  <use xlink:href="#glyph1-2" x="344.8125" y="337.47595"/>
  <use xlink:href="#glyph1-15" x="348.9375" y="337.47595"/>
  <use xlink:href="#glyph1-12" x="354.5625" y="337.47595"/>
  <use xlink:href="#glyph1-11" x="359.8125" y="337.47595"/>
  <use xlink:href="#glyph1-21" x="363.9375" y="337.47595"/>
  <use xlink:href="#glyph1-6" x="365.8125" y="337.47595"/>
  <use xlink:href="#glyph1-1" x="370.3125" y="337.47595"/>
</g>
<g style="fill:rgb(0%,0%,0%);fill-opacity:1;">
  <use xlink:href="#glyph1-3" x="302.4375" y="345.722044"/>
  <use xlink:href="#glyph1-14" x="306.9375" y="345.722044"/>
  <use xlink:href="#glyph1-17" x="311.8125" y="345.722044"/>
  <use xlink:href="#glyph1-10" x="317.0625" y="345.722044"/>
  <use xlink:href="#glyph1-4" x="318.9375" y="345.722044"/>
  <use xlink:href="#glyph1-3" x="324.1875" y="345.722044"/>
  <use xlink:href="#glyph1-2" x="328.6875" y="345.722044"/>
  <use xlink:href="#glyph1-4" x="332.8125" y="345.722044"/>
  <use xlink:href="#glyph1-3" x="338.0625" y="345.722044"/>
  <use xlink:href="#glyph1-11" x="342.5625" y="345.722044"/>
  <use xlink:href="#glyph1-21" x="346.6875" y="345.722044"/>
</g>
<path style=" stroke:none;fill-rule:nonzero;fill:rgb(56.470591%,93.333334%,56.470591%);fill-opacity:1;" d="M 784.5 260.632812 L 622.5 260.632812 L 622.5 368.589844 L 784.5 368.589844 Z M 784.5 260.632812 "/>
<g style="fill:rgb(0%,0%,0%);fill-opacity:1;">
  <use xlink:href="#glyph1-14" x="641.625" y="291.370481"/>
  <use xlink:href="#glyph1-1" x="646.5" y="291.370481"/>
  <use xlink:href="#glyph1-8" x="651.75" y="291.370481"/>
  <use xlink:href="#glyph1-26" x="657" y="291.370481"/>
  <use xlink:href="#glyph1-3" x="662.625" y="291.370481"/>
  <use xlink:href="#glyph1-4" x="667.125" y="291.370481"/>
  <use xlink:href="#glyph1-6" x="672" y="291.370481"/>
  <use xlink:href="#glyph1-10" x="676.5" y="291.370481"/>
  <use xlink:href="#glyph1-16" x="678.375" y="291.370481"/>
  <use xlink:href="#glyph1-5" x="683.25" y="291.370481"/>
  <use xlink:href="#glyph1-28" x="688.125" y="291.370481"/>
  <use xlink:href="#glyph1-10" x="693.375" y="291.370481"/>
  <use xlink:href="#glyph1-11" x="695.25" y="291.370481"/>
  <use xlink:href="#glyph1-7" x="699.375" y="291.370481"/>
  <use xlink:href="#glyph1-9" x="702" y="291.370481"/>
  <use xlink:href="#glyph1-8" x="707.25" y="291.370481"/>
  <use xlink:href="#glyph1-5" x="712.5" y="291.370481"/>
  <use xlink:href="#glyph1-18" x="717.75" y="291.370481"/>
  <use xlink:href="#glyph1-11" x="722.25" y="291.370481"/>
  <use xlink:href="#glyph1-10" x="726.375" y="291.370481"/>
  <use xlink:href="#glyph1-20" x="728.25" y="291.370481"/>
  <use xlink:href="#glyph1-4" x="732.375" y="291.370481"/>
  <use xlink:href="#glyph1-1" x="736.875" y="291.370481"/>
  <use xlink:href="#glyph1-13" x="742.125" y="291.370481"/>
  <use xlink:href="#glyph1-10" x="748.875" y="291.370481"/>
  <use xlink:href="#glyph1-3" x="750.75" y="291.370481"/>
  <use xlink:href="#glyph1-14" x="755.25" y="291.370481"/>
  <use xlink:href="#glyph1-17" x="760.125" y="291.370481"/>
</g>
<g style="fill:rgb(0%,0%,0%);fill-opacity:1;">
  <use xlink:href="#glyph1-6" x="639.75" y="299.616575"/>
  <use xlink:href="#glyph1-1" x="644.25" y="299.616575"/>
  <use xlink:href="#glyph1-10" x="649.5" y="299.616575"/>
  <use xlink:href="#glyph1-2" x="651.375" y="299.616575"/>
  <use xlink:href="#glyph1-15" x="655.5" y="299.616575"/>
  <use xlink:href="#glyph1-12" x="661.125" y="299.616575"/>
  <use xlink:href="#glyph1-11" x="666.375" y="299.616575"/>
  <use xlink:href="#glyph1-10" x="670.5" y="299.616575"/>
  <use xlink:href="#glyph1-5" x="672.375" y="299.616575"/>
  <use xlink:href="#glyph1-8" x="677.625" y="299.616575"/>
  <use xlink:href="#glyph1-16" x="682.875" y="299.616575"/>
  <use xlink:href="#glyph1-10" x="688.125" y="299.616575"/>
  <use xlink:href="#glyph1-14" x="690" y="299.616575"/>
  <use xlink:href="#glyph1-1" x="694.875" y="299.616575"/>
  <use xlink:href="#glyph1-18" x="700.125" y="299.616575"/>
  <use xlink:href="#glyph1-18" x="704.625" y="299.616575"/>
  <use xlink:href="#glyph1-3" x="709.125" y="299.616575"/>
  <use xlink:href="#glyph1-14" x="713.625" y="299.616575"/>
  <use xlink:href="#glyph1-6" x="718.5" y="299.616575"/>
  <use xlink:href="#glyph1-10" x="723" y="299.616575"/>
  <use xlink:href="#glyph1-11" x="724.875" y="299.616575"/>
  <use xlink:href="#glyph1-3" x="729" y="299.616575"/>
  <use xlink:href="#glyph1-8" x="733.5" y="299.616575"/>
  <use xlink:href="#glyph1-16" x="738.75" y="299.616575"/>
  <use xlink:href="#glyph1-10" x="744" y="299.616575"/>
  <use xlink:href="#glyph1-13" x="745.875" y="299.616575"/>
  <use xlink:href="#glyph1-3" x="752.625" y="299.616575"/>
  <use xlink:href="#glyph1-11" x="757.125" y="299.616575"/>
  <use xlink:href="#glyph1-11" x="761.25" y="299.616575"/>
  <use xlink:href="#glyph1-21" x="765.375" y="299.616575"/>
</g>
<g style="fill:rgb(0%,0%,0%);fill-opacity:1;">
  <use xlink:href="#glyph1-11" x="664.5" y="316.858763"/>
  <use xlink:href="#glyph1-7" x="668.625" y="316.858763"/>
  <use xlink:href="#glyph1-8" x="671.25" y="316.858763"/>
  <use xlink:href="#glyph1-9" x="676.5" y="316.858763"/>
  <use xlink:href="#glyph1-18" x="681.75" y="316.858763"/>
  <use xlink:href="#glyph1-3" x="686.25" y="316.858763"/>
  <use xlink:href="#glyph1-10" x="690.75" y="316.858763"/>
  <use xlink:href="#glyph1-1" x="692.625" y="316.858763"/>
  <use xlink:href="#glyph1-17" x="697.875" y="316.858763"/>
  <use xlink:href="#glyph1-6" x="703.5" y="316.858763"/>
  <use xlink:href="#glyph1-2" x="708" y="316.858763"/>
  <use xlink:href="#glyph1-17" x="712.125" y="316.858763"/>
  <use xlink:href="#glyph1-6" x="717.75" y="316.858763"/>
  <use xlink:href="#glyph1-10" x="722.25" y="316.858763"/>
  <use xlink:href="#glyph1-26" x="724.125" y="316.858763"/>
  <use xlink:href="#glyph1-5" x="728.625" y="316.858763"/>
  <use xlink:href="#glyph1-18" x="733.875" y="316.858763"/>
  <use xlink:href="#glyph1-11" x="738.375" y="316.858763"/>
</g>
<g style="fill:rgb(0%,0%,0%);fill-opacity:1;">
  <use xlink:href="#glyph1-5" x="656.25" y="325.104856"/>
  <use xlink:href="#glyph1-4" x="661.5" y="325.104856"/>
  <use xlink:href="#glyph1-3" x="666.75" y="325.104856"/>
  <use xlink:href="#glyph1-10" x="671.25" y="325.104856"/>
  <use xlink:href="#glyph1-14" x="673.125" y="325.104856"/>
  <use xlink:href="#glyph1-1" x="678" y="325.104856"/>
  <use xlink:href="#glyph1-8" x="683.25" y="325.104856"/>
  <use xlink:href="#glyph1-26" x="688.5" y="325.104856"/>
  <use xlink:href="#glyph1-3" x="694.125" y="325.104856"/>
  <use xlink:href="#glyph1-4" x="698.625" y="325.104856"/>
  <use xlink:href="#glyph1-6" x="703.5" y="325.104856"/>
  <use xlink:href="#glyph1-3" x="708.375" y="325.104856"/>
  <use xlink:href="#glyph1-16" x="712.875" y="325.104856"/>
  <use xlink:href="#glyph1-10" x="718.125" y="325.104856"/>
  <use xlink:href="#glyph1-6" x="720" y="325.104856"/>
  <use xlink:href="#glyph1-1" x="724.5" y="325.104856"/>
  <use xlink:href="#glyph1-10" x="729.75" y="325.104856"/>
  <use xlink:href="#glyph1-2" x="731.625" y="325.104856"/>
  <use xlink:href="#glyph1-15" x="735.75" y="325.104856"/>
  <use xlink:href="#glyph1-12" x="741.375" y="325.104856"/>
  <use xlink:href="#glyph1-11" x="746.625" y="325.104856"/>
</g>
<g style="fill:rgb(0%,0%,0%);fill-opacity:1;">
  <use xlink:href="#glyph1-5" x="646.5" y="333.35095"/>
  <use xlink:href="#glyph1-8" x="651.75" y="333.35095"/>
  <use xlink:href="#glyph1-16" x="657" y="333.35095"/>
  <use xlink:href="#glyph1-10" x="662.25" y="333.35095"/>
  <use xlink:href="#glyph1-11" x="664.125" y="333.35095"/>
  <use xlink:href="#glyph1-6" x="668.25" y="333.35095"/>
  <use xlink:href="#glyph1-1" x="672.75" y="333.35095"/>
  <use xlink:href="#glyph1-4" x="678" y="333.35095"/>
  <use xlink:href="#glyph1-3" x="683.25" y="333.35095"/>
  <use xlink:href="#glyph1-16" x="687.75" y="333.35095"/>
  <use xlink:href="#glyph1-10" x="693" y="333.35095"/>
  <use xlink:href="#glyph1-7" x="694.875" y="333.35095"/>
  <use xlink:href="#glyph1-8" x="697.5" y="333.35095"/>
  <use xlink:href="#glyph1-10" x="702.75" y="333.35095"/>
  <use xlink:href="#glyph1-5" x="704.625" y="333.35095"/>
  <use xlink:href="#glyph1-10" x="709.875" y="333.35095"/>
  <use xlink:href="#glyph1-11" x="711.75" y="333.35095"/>
  <use xlink:href="#glyph1-3" x="715.875" y="333.35095"/>
  <use xlink:href="#glyph1-8" x="720.375" y="333.35095"/>
  <use xlink:href="#glyph1-16" x="725.625" y="333.35095"/>
  <use xlink:href="#glyph1-10" x="730.875" y="333.35095"/>
  <use xlink:href="#glyph1-19" x="732.75" y="333.35095"/>
  <use xlink:href="#glyph1-17" x="737.625" y="333.35095"/>
  <use xlink:href="#glyph1-20" x="742.875" y="333.35095"/>
  <use xlink:href="#glyph1-20" x="747" y="333.35095"/>
  <use xlink:href="#glyph1-3" x="751.125" y="333.35095"/>
  <use xlink:href="#glyph1-4" x="755.625" y="333.35095"/>
</g>
<g style="fill:rgb(0%,0%,0%);fill-opacity:1;">
  <use xlink:href="#glyph1-29" x="667.125" y="341.597044"/>
  <use xlink:href="#glyph1-3" x="669.75" y="341.597044"/>
  <use xlink:href="#glyph1-21" x="674.25" y="341.597044"/>
  <use xlink:href="#glyph1-9" x="676.125" y="341.597044"/>
  <use xlink:href="#glyph1-21" x="681.375" y="341.597044"/>
  <use xlink:href="#glyph1-10" x="683.25" y="341.597044"/>
  <use xlink:href="#glyph1-24" x="685.125" y="341.597044"/>
  <use xlink:href="#glyph1-25" x="688.875" y="341.597044"/>
  <use xlink:href="#glyph1-25" x="692.625" y="341.597044"/>
  <use xlink:href="#glyph1-10" x="696.375" y="341.597044"/>
  <use xlink:href="#glyph1-3" x="698.25" y="341.597044"/>
  <use xlink:href="#glyph1-18" x="702.75" y="341.597044"/>
  <use xlink:href="#glyph1-3" x="707.25" y="341.597044"/>
  <use xlink:href="#glyph1-13" x="711.75" y="341.597044"/>
  <use xlink:href="#glyph1-3" x="718.5" y="341.597044"/>
  <use xlink:href="#glyph1-8" x="723" y="341.597044"/>
  <use xlink:href="#glyph1-6" x="728.625" y="341.597044"/>
  <use xlink:href="#glyph1-11" x="733.125" y="341.597044"/>
  <use xlink:href="#glyph1-30" x="737.25" y="341.597044"/>
</g>
</g>
</svg>
