<?xml version="1.0" encoding="UTF-8"?>
<svg xmlns="http://www.w3.org/2000/svg" xmlns:xlink="http://www.w3.org/1999/xlink" width="381px" height="165px" viewBox="0 0 381 165" version="1.1">
<defs>
<g>
<symbol overflow="visible" id="glyph0-0">
<path style="stroke:none;" d=""/>
</symbol>
<symbol overflow="visible" id="glyph0-1">
<path style="stroke:none;" d="M 3.546875 -3.53125 L 3.5 -5.078125 L 3.375 -5.078125 C 3.3125 -4.984375 3.265625 -4.953125 3.1875 -4.953125 C 3.125 -4.953125 3.015625 -4.96875 2.890625 -5.03125 C 2.625 -5.125 2.375 -5.171875 2.109375 -5.171875 C 1.21875 -5.171875 0.578125 -4.59375 0.578125 -3.78125 C 0.578125 -3.15625 0.9375 -2.703125 1.890625 -2.15625 L 2.546875 -1.78125 C 2.9375 -1.5625 3.125 -1.296875 3.125 -0.9375 C 3.125 -0.453125 2.765625 -0.140625 2.1875 -0.140625 C 1.421875 -0.140625 1.03125 -0.5625 0.765625 -1.703125 L 0.578125 -1.703125 L 0.578125 0.046875 L 0.734375 0.046875 C 0.8125 -0.0625 0.859375 -0.09375 0.984375 -0.09375 C 1.109375 -0.09375 1.25 -0.0625 1.5 0 C 1.8125 0.0625 2.109375 0.109375 2.328125 0.109375 C 3.203125 0.109375 3.921875 -0.546875 3.921875 -1.328125 C 3.921875 -1.890625 3.640625 -2.265625 2.96875 -2.671875 L 1.75 -3.390625 C 1.4375 -3.578125 1.265625 -3.84375 1.265625 -4.15625 C 1.265625 -4.609375 1.625 -4.921875 2.140625 -4.921875 C 2.78125 -4.921875 3.109375 -4.546875 3.375 -3.53125 Z M 3.546875 -3.53125 "/>
</symbol>
<symbol overflow="visible" id="glyph0-2">
<path style="stroke:none;" d="M 2.8125 -5.171875 C 1.34375 -5.171875 0.328125 -4.09375 0.328125 -2.546875 C 0.328125 -1.015625 1.375 0.109375 2.796875 0.109375 C 4.203125 0.109375 5.28125 -1.0625 5.28125 -2.625 C 5.28125 -4.125 4.25 -5.171875 2.8125 -5.171875 Z M 2.671875 -4.859375 C 3.609375 -4.859375 4.28125 -3.78125 4.28125 -2.234375 C 4.28125 -0.953125 3.765625 -0.203125 2.921875 -0.203125 C 2.484375 -0.203125 2.0625 -0.46875 1.828125 -0.921875 C 1.515625 -1.5 1.34375 -2.296875 1.34375 -3.09375 C 1.34375 -4.15625 1.859375 -4.859375 2.671875 -4.859375 Z M 2.671875 -4.859375 "/>
</symbol>
<symbol overflow="visible" id="glyph0-3">
<path style="stroke:none;" d="M 5.390625 -0.5625 L 5.328125 -0.5625 C 4.78125 -0.578125 4.703125 -0.671875 4.6875 -1.203125 L 4.6875 -5.0625 L 2.90625 -5.0625 L 2.90625 -4.875 C 3.609375 -4.84375 3.75 -4.71875 3.75 -4.15625 L 3.75 -1.515625 C 3.75 -1.203125 3.6875 -1.046875 3.53125 -0.921875 C 3.234375 -0.671875 2.875 -0.546875 2.546875 -0.546875 C 2.109375 -0.546875 1.75 -0.921875 1.75 -1.390625 L 1.75 -5.0625 L 0.09375 -5.0625 L 0.09375 -4.90625 C 0.625 -4.875 0.78125 -4.71875 0.796875 -4.1875 L 0.796875 -1.34375 C 0.796875 -0.46875 1.34375 0.109375 2.15625 0.109375 C 2.578125 0.109375 3.015625 -0.0625 3.3125 -0.375 L 3.796875 -0.859375 L 3.796875 0.078125 L 3.84375 0.09375 C 4.40625 -0.125 4.8125 -0.25 5.390625 -0.40625 Z M 5.390625 -0.5625 "/>
</symbol>
<symbol overflow="visible" id="glyph0-4">
<path style="stroke:none;" d="M 0.0625 0 L 2.75 0 L 2.75 -0.171875 C 2 -0.1875 1.828125 -0.34375 1.796875 -1.015625 L 1.796875 -3.546875 C 1.796875 -3.90625 2.265625 -4.46875 2.59375 -4.46875 C 2.65625 -4.46875 2.75 -4.40625 2.875 -4.296875 C 3.046875 -4.125 3.1875 -4.078125 3.328125 -4.078125 C 3.59375 -4.078125 3.765625 -4.265625 3.765625 -4.578125 C 3.765625 -4.953125 3.53125 -5.171875 3.15625 -5.171875 C 2.671875 -5.171875 2.359375 -4.921875 1.796875 -4.125 L 1.796875 -5.15625 L 1.75 -5.171875 C 1.109375 -4.921875 0.703125 -4.765625 0.078125 -4.5625 L 0.078125 -4.390625 C 0.234375 -4.421875 0.34375 -4.4375 0.46875 -4.4375 C 0.75 -4.4375 0.859375 -4.25 0.859375 -3.75 L 0.859375 -0.9375 C 0.828125 -0.359375 0.765625 -0.296875 0.0625 -0.171875 Z M 0.0625 0 "/>
</symbol>
<symbol overflow="visible" id="glyph0-5">
<path style="stroke:none;" d="M 4.484375 -1.75 C 3.9375 -0.96875 3.53125 -0.703125 2.890625 -0.703125 C 1.859375 -0.703125 1.140625 -1.59375 1.140625 -2.890625 C 1.140625 -4.0625 1.765625 -4.84375 2.671875 -4.84375 C 3.078125 -4.84375 3.234375 -4.734375 3.34375 -4.3125 L 3.40625 -4.0625 C 3.5 -3.734375 3.703125 -3.546875 3.953125 -3.546875 C 4.234375 -3.546875 4.484375 -3.75 4.484375 -4.015625 C 4.484375 -4.640625 3.6875 -5.171875 2.75 -5.171875 C 2.1875 -5.171875 1.625 -4.953125 1.15625 -4.546875 C 0.59375 -4.046875 0.28125 -3.28125 0.28125 -2.390625 C 0.28125 -0.9375 1.171875 0.109375 2.421875 0.109375 C 2.921875 0.109375 3.375 -0.0625 3.78125 -0.421875 C 4.078125 -0.671875 4.296875 -0.984375 4.640625 -1.65625 Z M 4.484375 -1.75 "/>
</symbol>
<symbol overflow="visible" id="glyph0-6">
<path style="stroke:none;" d="M 4.59375 -1.84375 C 4.046875 -0.984375 3.5625 -0.65625 2.84375 -0.65625 C 2.203125 -0.65625 1.71875 -0.984375 1.390625 -1.625 C 1.1875 -2.0625 1.109375 -2.421875 1.09375 -3.109375 L 4.5625 -3.109375 C 4.46875 -3.84375 4.359375 -4.171875 4.078125 -4.53125 C 3.734375 -4.9375 3.21875 -5.171875 2.625 -5.171875 C 2.0625 -5.171875 1.546875 -4.96875 1.109375 -4.59375 C 0.578125 -4.125 0.28125 -3.328125 0.28125 -2.40625 C 0.28125 -0.859375 1.09375 0.109375 2.390625 0.109375 C 3.453125 0.109375 4.296875 -0.546875 4.765625 -1.765625 Z M 1.109375 -3.46875 C 1.234375 -4.359375 1.625 -4.765625 2.3125 -4.765625 C 3 -4.765625 3.265625 -4.453125 3.40625 -3.46875 Z M 1.109375 -3.46875 "/>
</symbol>
<symbol overflow="visible" id="glyph0-7">
<path style="stroke:none;" d=""/>
</symbol>
<symbol overflow="visible" id="glyph0-8">
<path style="stroke:none;" d="M 5.53125 -0.65625 C 5.375 -0.640625 5.3125 -0.640625 5.265625 -0.640625 C 4.875 -0.640625 4.765625 -0.765625 4.765625 -1.28125 L 4.765625 -7.65625 L 4.71875 -7.6875 C 4.1875 -7.5 3.796875 -7.375 3.0625 -7.1875 L 3.0625 -7.015625 C 3.15625 -7.015625 3.203125 -7.015625 3.3125 -7.015625 C 3.71875 -7.015625 3.828125 -6.90625 3.828125 -6.453125 L 3.828125 -4.6875 C 3.390625 -5.046875 3.09375 -5.171875 2.640625 -5.171875 C 1.34375 -5.171875 0.296875 -3.90625 0.296875 -2.3125 C 0.296875 -0.859375 1.140625 0.109375 2.390625 0.109375 C 3.015625 0.109375 3.4375 -0.109375 3.828125 -0.640625 L 3.828125 0.078125 L 3.875 0.109375 L 5.53125 -0.46875 Z M 3.828125 -1.140625 C 3.828125 -1.0625 3.75 -0.9375 3.640625 -0.8125 C 3.4375 -0.578125 3.15625 -0.46875 2.828125 -0.46875 C 1.875 -0.46875 1.265625 -1.375 1.265625 -2.765625 C 1.265625 -4.03125 1.828125 -4.859375 2.671875 -4.859375 C 3.28125 -4.859375 3.828125 -4.328125 3.828125 -3.734375 Z M 3.828125 -1.140625 "/>
</symbol>
<symbol overflow="visible" id="glyph0-9">
<path style="stroke:none;" d="M 0.1875 0 L 2.84375 0 L 2.84375 -0.171875 C 2.109375 -0.21875 2.03125 -0.328125 2.015625 -1.140625 L 2.015625 -5.140625 L 1.96875 -5.171875 L 0.21875 -4.5625 L 0.21875 -4.390625 L 0.3125 -4.40625 C 0.453125 -4.421875 0.578125 -4.4375 0.703125 -4.4375 C 0.96875 -4.4375 1.0625 -4.25 1.0625 -3.75 L 1.0625 -1.140625 C 1.046875 -0.3125 0.9375 -0.203125 0.1875 -0.171875 Z M 1.4375 -7.6875 C 1.140625 -7.6875 0.875 -7.421875 0.875 -7.109375 C 0.875 -6.78125 1.125 -6.53125 1.4375 -6.53125 C 1.78125 -6.53125 2.03125 -6.78125 2.03125 -7.109375 C 2.03125 -7.4375 1.765625 -7.6875 1.4375 -7.6875 Z M 1.4375 -7.6875 "/>
</symbol>
<symbol overflow="visible" id="glyph0-10">
<path style="stroke:none;" d="M 0.203125 0 L 2.59375 0 L 2.59375 -0.171875 C 2.03125 -0.203125 1.84375 -0.34375 1.84375 -0.75 L 1.84375 -3.921875 C 2.390625 -4.421875 2.625 -4.5625 3 -4.5625 C 3.5625 -4.5625 3.828125 -4.203125 3.828125 -3.46875 L 3.828125 -1.109375 C 3.796875 -0.375 3.671875 -0.203125 3.109375 -0.171875 L 3.109375 0 L 5.453125 0 L 5.453125 -0.171875 C 4.90625 -0.21875 4.78125 -0.359375 4.765625 -0.90625 L 4.765625 -3.484375 C 4.765625 -4.546875 4.28125 -5.171875 3.4375 -5.171875 C 2.921875 -5.171875 2.578125 -4.984375 1.8125 -4.265625 L 1.8125 -5.15625 L 1.734375 -5.171875 C 1.140625 -4.96875 0.765625 -4.84375 0.1875 -4.671875 L 0.1875 -4.484375 C 0.265625 -4.515625 0.359375 -4.515625 0.484375 -4.515625 C 0.796875 -4.515625 0.90625 -4.359375 0.90625 -3.796875 L 0.90625 -1.015625 C 0.890625 -0.34375 0.765625 -0.203125 0.203125 -0.171875 Z M 0.203125 0 "/>
</symbol>
<symbol overflow="visible" id="glyph0-11">
<path style="stroke:none;" d="M 1.53125 -5.15625 C 1.1875 -5.15625 0.90625 -4.875 0.90625 -4.515625 C 0.90625 -4.203125 1.1875 -3.921875 1.515625 -3.921875 C 1.875 -3.921875 2.15625 -4.1875 2.15625 -4.515625 C 2.15625 -4.875 1.875 -5.15625 1.53125 -5.15625 Z M 1.53125 -1.125 C 1.1875 -1.125 0.90625 -0.84375 0.90625 -0.484375 C 0.90625 -0.15625 1.1875 0.125 1.515625 0.125 C 1.875 0.125 2.15625 -0.140625 2.15625 -0.484375 C 2.15625 -0.828125 1.875 -1.125 1.53125 -1.125 Z M 1.53125 -1.125 "/>
</symbol>
<symbol overflow="visible" id="glyph0-12">
<path style="stroke:none;" d="M 7.9375 -0.21875 C 7.4375 -0.25 7.328125 -0.359375 6.9375 -1.1875 L 4.125 -7.578125 L 3.90625 -7.578125 L 1.5625 -2.0625 C 0.84375 -0.421875 0.703125 -0.234375 0.171875 -0.21875 L 0.171875 0 L 2.390625 0 L 2.390625 -0.21875 C 1.859375 -0.21875 1.625 -0.34375 1.625 -0.671875 C 1.625 -0.8125 1.671875 -0.96875 1.71875 -1.109375 L 2.234375 -2.4375 L 5.1875 -2.4375 L 5.640625 -1.34375 C 5.78125 -1.046875 5.859375 -0.75 5.859375 -0.59375 C 5.859375 -0.3125 5.671875 -0.21875 5.078125 -0.21875 L 5.078125 0 L 7.9375 0 Z M 2.4375 -2.890625 L 3.71875 -5.984375 L 5.03125 -2.890625 Z M 2.4375 -2.890625 "/>
</symbol>
<symbol overflow="visible" id="glyph0-13">
<path style="stroke:none;" d="M 5.484375 -0.171875 C 4.875 -0.265625 4.8125 -0.34375 4.796875 -1.140625 L 4.796875 -3.390625 C 4.796875 -4.5625 4.34375 -5.171875 3.421875 -5.171875 C 2.75 -5.171875 2.28125 -4.90625 1.765625 -4.234375 L 1.765625 -7.65625 L 1.703125 -7.6875 C 1.3125 -7.546875 1.03125 -7.453125 0.421875 -7.28125 L 0.109375 -7.1875 L 0.109375 -7.015625 C 0.15625 -7.015625 0.1875 -7.015625 0.25 -7.015625 C 0.734375 -7.015625 0.828125 -6.9375 0.828125 -6.453125 L 0.828125 -1.140625 C 0.796875 -0.34375 0.75 -0.25 0.09375 -0.171875 L 0.09375 0 L 2.53125 0 L 2.53125 -0.171875 C 1.875 -0.21875 1.78125 -0.34375 1.765625 -1.140625 L 1.765625 -3.859375 C 2.234375 -4.375 2.578125 -4.5625 3.03125 -4.5625 C 3.578125 -4.5625 3.859375 -4.15625 3.859375 -3.375 L 3.859375 -1.140625 C 3.84375 -0.34375 3.734375 -0.21875 3.09375 -0.171875 L 3.09375 0 L 5.484375 0 Z M 5.484375 -0.171875 "/>
</symbol>
<symbol overflow="visible" id="glyph0-14">
<path style="stroke:none;" d="M 1.328125 0 L 4.4375 0 L 4.4375 -0.171875 C 3.5625 -0.171875 3.375 -0.296875 3.359375 -0.828125 L 3.359375 -7.578125 L 3.28125 -7.609375 L 1.25 -6.578125 L 1.25 -6.421875 C 1.6875 -6.59375 1.953125 -6.671875 2.0625 -6.671875 C 2.296875 -6.671875 2.390625 -6.5 2.390625 -6.140625 L 2.390625 -1.046875 C 2.375 -0.34375 2.1875 -0.1875 1.328125 -0.171875 Z M 1.328125 0 "/>
</symbol>
<symbol overflow="visible" id="glyph0-15">
<path style="stroke:none;" d="M 9.703125 -7.453125 L 7.46875 -7.453125 L 4.984375 -1.765625 L 2.390625 -7.453125 L 0.15625 -7.453125 L 0.15625 -7.234375 C 1.078125 -7.1875 1.203125 -7.0625 1.21875 -6.21875 L 1.21875 -1.65625 C 1.203125 -0.46875 1.0625 -0.265625 0.140625 -0.21875 L 0.140625 0 L 2.78125 0 L 2.78125 -0.21875 C 1.90625 -0.265625 1.75 -0.5 1.71875 -1.65625 L 1.71875 -6.1875 L 4.546875 0 L 4.703125 0 L 7.578125 -6.453125 L 7.578125 -1.34375 C 7.578125 -0.390625 7.453125 -0.265625 6.5625 -0.21875 L 6.5625 0 L 9.703125 0 L 9.703125 -0.21875 C 8.90625 -0.265625 8.75 -0.421875 8.734375 -1.21875 L 8.734375 -6.21875 C 8.75 -7.03125 8.890625 -7.171875 9.703125 -7.234375 Z M 9.703125 -7.453125 "/>
</symbol>
<symbol overflow="visible" id="glyph0-16">
<path style="stroke:none;" d="M 2.859375 -7.609375 C 2.234375 -7.609375 1.765625 -7.421875 1.34375 -7.015625 C 0.703125 -6.390625 0.265625 -5.09375 0.265625 -3.78125 C 0.265625 -2.546875 0.640625 -1.234375 1.171875 -0.609375 C 1.59375 -0.109375 2.15625 0.15625 2.8125 0.15625 C 3.390625 0.15625 3.875 -0.03125 4.28125 -0.421875 C 4.921875 -1.046875 5.359375 -2.34375 5.359375 -3.71875 C 5.359375 -6.015625 4.328125 -7.609375 2.859375 -7.609375 Z M 2.828125 -7.3125 C 3.765625 -7.3125 4.28125 -6.046875 4.28125 -3.6875 C 4.28125 -1.34375 3.78125 -0.140625 2.8125 -0.140625 C 1.84375 -0.140625 1.34375 -1.34375 1.34375 -3.671875 C 1.34375 -6.078125 1.859375 -7.3125 2.828125 -7.3125 Z M 2.828125 -7.3125 "/>
</symbol>
<symbol overflow="visible" id="glyph0-17">
<path style="stroke:none;" d="M 1.40625 -1.125 C 1.0625 -1.125 0.78125 -0.84375 0.78125 -0.484375 C 0.78125 -0.15625 1.0625 0.125 1.390625 0.125 C 1.75 0.125 2.03125 -0.140625 2.03125 -0.484375 C 2.03125 -0.828125 1.75 -1.125 1.40625 -1.125 Z M 1.40625 -1.125 "/>
</symbol>
<symbol overflow="visible" id="glyph0-18">
<path style="stroke:none;" d="M 2.796875 -3.21875 L 0.34375 -3.21875 L 0.34375 -2.46875 L 2.796875 -2.46875 L 2.796875 0 L 3.546875 0 L 3.546875 -2.46875 L 6 -2.46875 L 6 -3.21875 L 3.546875 -3.21875 L 3.546875 -5.6875 L 2.796875 -5.6875 Z M 2.796875 -3.21875 "/>
</symbol>
<symbol overflow="visible" id="glyph0-19">
<path style="stroke:none;" d="M 3.125 0 L 5.390625 0 L 5.390625 -0.171875 C 5.046875 -0.171875 4.8125 -0.34375 4.46875 -0.84375 L 3.03125 -3.046875 L 3.953125 -4.40625 C 4.171875 -4.703125 4.5 -4.875 4.875 -4.890625 L 4.875 -5.0625 L 3.09375 -5.0625 L 3.09375 -4.890625 C 3.4375 -4.875 3.546875 -4.796875 3.546875 -4.640625 C 3.546875 -4.515625 3.40625 -4.265625 3.125 -3.921875 C 3.078125 -3.84375 2.9375 -3.640625 2.796875 -3.421875 L 2.703125 -3.5625 C 2.53125 -3.8125 2.4375 -3.953125 2.40625 -4 C 2.1875 -4.359375 2.109375 -4.53125 2.109375 -4.640625 C 2.109375 -4.8125 2.265625 -4.875 2.59375 -4.890625 L 2.59375 -5.0625 L 0.265625 -5.0625 L 0.265625 -4.890625 L 0.375 -4.890625 C 0.703125 -4.890625 0.890625 -4.75 1.234375 -4.21875 L 2.296875 -2.59375 L 1.015625 -0.75 C 0.671875 -0.28125 0.5625 -0.203125 0.1875 -0.171875 L 0.1875 0 L 1.828125 0 L 1.828125 -0.171875 C 1.5 -0.171875 1.375 -0.21875 1.375 -0.375 C 1.375 -0.453125 1.4375 -0.59375 1.59375 -0.828125 L 2.484375 -2.21875 L 3.515625 -0.640625 C 3.5625 -0.578125 3.578125 -0.515625 3.578125 -0.4375 C 3.578125 -0.234375 3.5 -0.1875 3.125 -0.171875 Z M 3.125 0 "/>
</symbol>
<symbol overflow="visible" id="glyph0-20">
<path style="stroke:none;" d="M 0.1875 0 L 2.671875 0 L 2.671875 -0.171875 C 2.109375 -0.1875 1.921875 -0.296875 1.90625 -0.75 L 1.90625 -3.921875 C 1.90625 -3.953125 2 -4.0625 2.078125 -4.140625 C 2.359375 -4.40625 2.84375 -4.59375 3.234375 -4.59375 C 3.734375 -4.59375 3.984375 -4.203125 3.984375 -3.40625 L 3.984375 -0.96875 C 3.953125 -0.328125 3.84375 -0.203125 3.21875 -0.171875 L 3.21875 0 L 5.734375 0 L 5.734375 -0.171875 C 5.109375 -0.171875 4.953125 -0.34375 4.921875 -1.0625 L 4.921875 -3.90625 C 5.265625 -4.390625 5.625 -4.59375 6.15625 -4.59375 C 6.796875 -4.59375 7 -4.28125 7 -3.359375 L 7 -0.984375 C 6.96875 -0.3125 6.90625 -0.234375 6.25 -0.171875 L 6.25 0 L 8.71875 0 L 8.71875 -0.171875 L 8.421875 -0.1875 C 8.0625 -0.25 7.9375 -0.421875 7.9375 -0.859375 L 7.9375 -3.171875 C 7.9375 -4.5 7.5 -5.171875 6.640625 -5.171875 C 5.984375 -5.171875 5.40625 -4.875 4.796875 -4.234375 C 4.59375 -4.875 4.21875 -5.171875 3.609375 -5.171875 C 3.109375 -5.171875 2.796875 -5.03125 1.875 -4.3125 L 1.875 -5.15625 L 1.78125 -5.171875 C 1.1875 -4.96875 0.8125 -4.84375 0.21875 -4.671875 L 0.21875 -4.484375 C 0.34375 -4.515625 0.453125 -4.515625 0.578125 -4.515625 C 0.859375 -4.515625 0.96875 -4.34375 0.96875 -3.796875 L 0.96875 -0.953125 C 0.9375 -0.328125 0.796875 -0.171875 0.1875 -0.171875 Z M 0.1875 0 "/>
</symbol>
<symbol overflow="visible" id="glyph0-21">
<path style="stroke:none;" d="M 0.234375 0 L 2.890625 0 L 2.890625 -0.171875 C 2.1875 -0.203125 2.0625 -0.3125 2.046875 -0.9375 L 2.046875 -7.65625 L 2 -7.6875 C 1.421875 -7.5 1.015625 -7.375 0.21875 -7.1875 L 0.21875 -7.015625 L 0.28125 -7.015625 C 0.40625 -7.015625 0.546875 -7.03125 0.625 -7.03125 C 0.984375 -7.03125 1.109375 -6.875 1.109375 -6.34375 L 1.109375 -0.984375 C 1.09375 -0.375 0.9375 -0.21875 0.234375 -0.171875 Z M 0.234375 0 "/>
</symbol>
<symbol overflow="visible" id="glyph0-22">
<path style="stroke:none;" d="M 5.34375 -1.546875 L 5.203125 -1.59375 C 4.78125 -0.9375 4.65625 -0.859375 4.125 -0.859375 L 1.4375 -0.859375 L 3.328125 -2.828125 C 4.328125 -3.875 4.765625 -4.734375 4.765625 -5.609375 C 4.765625 -6.734375 3.859375 -7.609375 2.6875 -7.609375 C 2.0625 -7.609375 1.484375 -7.359375 1.0625 -6.90625 C 0.703125 -6.53125 0.546875 -6.171875 0.34375 -5.359375 L 0.578125 -5.3125 C 1.03125 -6.40625 1.421875 -6.765625 2.21875 -6.765625 C 3.171875 -6.765625 3.796875 -6.125 3.796875 -5.1875 C 3.796875 -4.296875 3.28125 -3.265625 2.34375 -2.265625 L 0.34375 -0.140625 L 0.34375 0 L 4.71875 0 Z M 5.34375 -1.546875 "/>
</symbol>
<symbol overflow="visible" id="glyph0-23">
<path style="stroke:none;" d="M 7.9375 -7.453125 L 5.328125 -7.453125 L 5.328125 -7.234375 C 6.1875 -7.171875 6.359375 -6.953125 6.375 -5.796875 L 6.375 -2.75 C 6.375 -1.984375 6.3125 -1.5625 6.125 -1.21875 C 5.8125 -0.6875 5.09375 -0.34375 4.25 -0.34375 C 3.453125 -0.34375 2.90625 -0.609375 2.59375 -1.140625 C 2.390625 -1.5 2.3125 -1.90625 2.3125 -2.625 L 2.3125 -6.21875 C 2.328125 -7.046875 2.4375 -7.15625 3.34375 -7.234375 L 3.34375 -7.453125 L 0.15625 -7.453125 L 0.15625 -7.234375 C 1.046875 -7.171875 1.15625 -7.046875 1.171875 -6.21875 L 1.171875 -2.71875 C 1.171875 -0.765625 2.078125 0.15625 4 0.15625 C 5.21875 0.15625 6.0625 -0.234375 6.5 -1 C 6.765625 -1.46875 6.875 -1.984375 6.875 -2.859375 L 6.875 -5.796875 C 6.890625 -6.96875 7.015625 -7.125 7.9375 -7.234375 Z M 7.9375 -7.453125 "/>
</symbol>
<symbol overflow="visible" id="glyph0-24">
<path style="stroke:none;" d="M 5.03125 -7.609375 L 4.796875 -7.609375 C 4.75 -7.359375 4.625 -7.21875 4.4375 -7.21875 C 4.3125 -7.21875 4.125 -7.265625 3.9375 -7.359375 C 3.515625 -7.515625 3.109375 -7.609375 2.734375 -7.609375 C 2.265625 -7.609375 1.765625 -7.40625 1.390625 -7.09375 C 1 -6.734375 0.796875 -6.265625 0.796875 -5.6875 C 0.796875 -4.78125 1.296875 -4.15625 2.546875 -3.484375 C 3.359375 -3.046875 3.953125 -2.59375 4.234375 -2.171875 C 4.328125 -2.03125 4.390625 -1.78125 4.390625 -1.5 C 4.390625 -0.765625 3.828125 -0.25 3 -0.25 C 1.984375 -0.25 1.296875 -0.859375 0.734375 -2.234375 L 0.46875 -2.234375 L 0.8125 0.140625 L 1.0625 0.140625 C 1.0625 -0.0625 1.203125 -0.21875 1.375 -0.21875 C 1.5 -0.21875 1.6875 -0.1875 1.90625 -0.09375 C 2.328125 0.0625 2.796875 0.15625 3.234375 0.15625 C 4.53125 0.15625 5.53125 -0.734375 5.53125 -1.90625 C 5.53125 -2.828125 4.90625 -3.546875 3.421875 -4.359375 C 2.234375 -5 1.765625 -5.484375 1.765625 -6.109375 C 1.765625 -6.734375 2.234375 -7.140625 2.9375 -7.140625 C 3.4375 -7.140625 3.921875 -6.9375 4.3125 -6.53125 C 4.65625 -6.171875 4.8125 -5.875 5 -5.203125 L 5.28125 -5.203125 Z M 5.03125 -7.609375 "/>
</symbol>
<symbol overflow="visible" id="glyph0-25">
<path style="stroke:none;" d="M 2.875 -5.0625 L 1.734375 -5.0625 L 1.734375 -6.375 C 1.734375 -6.484375 1.703125 -6.515625 1.65625 -6.515625 C 1 -5.5625 0.65625 -5.1875 0.34375 -5 C 0.21875 -4.921875 0.140625 -4.84375 0.140625 -4.78125 C 0.140625 -4.75 0.15625 -4.71875 0.1875 -4.703125 L 0.78125 -4.703125 L 0.78125 -1.3125 C 0.78125 -0.375 1.125 0.109375 1.78125 0.109375 C 2.34375 0.109375 2.765625 -0.15625 3.140625 -0.75 L 3 -0.859375 C 2.75 -0.578125 2.5625 -0.46875 2.3125 -0.46875 C 1.90625 -0.46875 1.734375 -0.78125 1.734375 -1.484375 L 1.734375 -4.703125 L 2.875 -4.703125 Z M 2.875 -5.0625 "/>
</symbol>
</g>
</defs>
<g id="surface1">
<rect x="0" y="0" width="381" height="165" style="fill:rgb(100%,100%,100%);fill-opacity:1;stroke:none;"/>
<path style="fill-rule:nonzero;fill:rgb(100%,100%,0%);fill-opacity:1;stroke-width:1;stroke-linecap:butt;stroke-linejoin:miter;stroke:rgb(0%,0%,0%);stroke-opacity:1;stroke-miterlimit:4;" d="M 612 -432 L 324 -432 L 324 -360 L 612 -360 Z M 612 -432 " transform="matrix(0.375,0,0,0.375,1.5,163.5)"/>
<g style="fill:rgb(0%,0%,0%);fill-opacity:1;">
  <use xlink:href="#glyph0-1" x="138.9375" y="17.812744"/>
  <use xlink:href="#glyph0-2" x="143.4375" y="17.812744"/>
  <use xlink:href="#glyph0-3" x="149.0625" y="17.812744"/>
  <use xlink:href="#glyph0-4" x="154.6875" y="17.812744"/>
  <use xlink:href="#glyph0-5" x="158.4375" y="17.812744"/>
  <use xlink:href="#glyph0-6" x="163.3125" y="17.812744"/>
  <use xlink:href="#glyph0-7" x="168.1875" y="17.812744"/>
  <use xlink:href="#glyph0-5" x="170.8125" y="17.812744"/>
  <use xlink:href="#glyph0-2" x="175.6875" y="17.812744"/>
  <use xlink:href="#glyph0-8" x="181.3125" y="17.812744"/>
  <use xlink:href="#glyph0-6" x="186.9375" y="17.812744"/>
  <use xlink:href="#glyph0-7" x="191.8125" y="17.812744"/>
  <use xlink:href="#glyph0-8" x="194.4375" y="17.812744"/>
  <use xlink:href="#glyph0-9" x="200.0625" y="17.812744"/>
  <use xlink:href="#glyph0-4" x="203.0625" y="17.812744"/>
  <use xlink:href="#glyph0-7" x="206.8125" y="17.812744"/>
  <use xlink:href="#glyph0-10" x="209.4375" y="17.812744"/>
</g>
<path style="fill-rule:nonzero;fill:rgb(100%,100%,0%);fill-opacity:1;stroke-width:1;stroke-linecap:butt;stroke-linejoin:miter;stroke:rgb(0%,0%,0%);stroke-opacity:1;stroke-miterlimit:4;" d="M 216 -288 L 0 -288 L 0 -216 L 216 -216 Z M 216 -288 " transform="matrix(0.375,0,0,0.375,1.5,163.5)"/>
<g style="fill:rgb(0%,0%,0%);fill-opacity:1;">
  <use xlink:href="#glyph0-8" x="20.25" y="71.812744"/>
  <use xlink:href="#glyph0-9" x="25.875" y="71.812744"/>
  <use xlink:href="#glyph0-4" x="28.875" y="71.812744"/>
  <use xlink:href="#glyph0-11" x="32.625" y="71.812744"/>
  <use xlink:href="#glyph0-12" x="35.625" y="71.812744"/>
  <use xlink:href="#glyph0-4" x="43.875" y="71.812744"/>
  <use xlink:href="#glyph0-5" x="47.625" y="71.812744"/>
  <use xlink:href="#glyph0-13" x="52.5" y="71.812744"/>
  <use xlink:href="#glyph0-14" x="58.125" y="71.812744"/>
</g>
<path style="fill:none;stroke-width:1;stroke-linecap:butt;stroke-linejoin:miter;stroke:rgb(0%,0%,0%);stroke-opacity:1;stroke-miterlimit:4;" d="M 467.927083 -359.979167 C 464.53125 -358.958333 329.354167 -318.40625 225.65625 -287.302083 " transform="matrix(0.375,0,0,0.375,1.5,163.5)"/>
<path style="fill-rule:nonzero;fill:rgb(0%,0%,0%);fill-opacity:1;stroke-width:1;stroke-linecap:butt;stroke-linejoin:miter;stroke:rgb(0%,0%,0%);stroke-opacity:1;stroke-miterlimit:4;" d="M 226.625 -283.9375 L 216.052083 -284.40625 L 224.625 -290.635417 Z M 226.625 -283.9375 " transform="matrix(0.375,0,0,0.375,1.5,163.5)"/>
<path style="fill-rule:nonzero;fill:rgb(100%,64.705884%,0%);fill-opacity:1;stroke-width:1;stroke-linecap:butt;stroke-linejoin:miter;stroke:rgb(0%,0%,0%);stroke-opacity:1;stroke-miterlimit:4;" d="M 630 -288 L 306 -288 L 306 -216 L 630 -216 Z M 630 -288 " transform="matrix(0.375,0,0,0.375,1.5,163.5)"/>
<g style="fill:rgb(0%,0%,0%);fill-opacity:1;">
  <use xlink:href="#glyph0-15" x="133.125" y="71.812744"/>
  <use xlink:href="#glyph0-2" x="143.25" y="71.812744"/>
  <use xlink:href="#glyph0-8" x="148.875" y="71.812744"/>
  <use xlink:href="#glyph0-16" x="154.5" y="71.812744"/>
  <use xlink:href="#glyph0-17" x="160.125" y="71.812744"/>
  <use xlink:href="#glyph0-5" x="162.75" y="71.812744"/>
  <use xlink:href="#glyph0-18" x="167.625" y="71.812744"/>
  <use xlink:href="#glyph0-15" x="174" y="71.812744"/>
  <use xlink:href="#glyph0-2" x="184.125" y="71.812744"/>
  <use xlink:href="#glyph0-8" x="189.75" y="71.812744"/>
  <use xlink:href="#glyph0-16" x="195.375" y="71.812744"/>
  <use xlink:href="#glyph0-17" x="201" y="71.812744"/>
  <use xlink:href="#glyph0-19" x="203.625" y="71.812744"/>
  <use xlink:href="#glyph0-20" x="209.25" y="71.812744"/>
  <use xlink:href="#glyph0-21" x="217.875" y="71.812744"/>
</g>
<path style="fill:none;stroke-width:1;stroke-linecap:butt;stroke-linejoin:miter;stroke:rgb(0%,0%,0%);stroke-opacity:1;stroke-miterlimit:4;" d="M 468 -359.916667 C 468 -358.15625 468 -326.90625 468 -298.5 " transform="matrix(0.375,0,0,0.375,1.5,163.5)"/>
<path style="fill-rule:nonzero;fill:rgb(0%,0%,0%);fill-opacity:1;stroke-width:1;stroke-linecap:butt;stroke-linejoin:miter;stroke:rgb(0%,0%,0%);stroke-opacity:1;stroke-miterlimit:4;" d="M 471.5 -298.21875 L 468 -288.21875 L 464.5 -298.21875 Z M 471.5 -298.21875 " transform="matrix(0.375,0,0,0.375,1.5,163.5)"/>
<path style="fill-rule:nonzero;fill:rgb(100%,100%,0%);fill-opacity:1;stroke-width:1;stroke-linecap:butt;stroke-linejoin:miter;stroke:rgb(0%,0%,0%);stroke-opacity:1;stroke-miterlimit:4;" d="M 936 -288 L 720 -288 L 720 -216 L 936 -216 Z M 936 -288 " transform="matrix(0.375,0,0,0.375,1.5,163.5)"/>
<g style="fill:rgb(0%,0%,0%);fill-opacity:1;">
  <use xlink:href="#glyph0-8" x="290.25" y="71.812744"/>
  <use xlink:href="#glyph0-9" x="295.875" y="71.812744"/>
  <use xlink:href="#glyph0-4" x="298.875" y="71.812744"/>
  <use xlink:href="#glyph0-11" x="302.625" y="71.812744"/>
  <use xlink:href="#glyph0-12" x="305.625" y="71.812744"/>
  <use xlink:href="#glyph0-4" x="313.875" y="71.812744"/>
  <use xlink:href="#glyph0-5" x="317.625" y="71.812744"/>
  <use xlink:href="#glyph0-13" x="322.5" y="71.812744"/>
  <use xlink:href="#glyph0-22" x="328.125" y="71.812744"/>
</g>
<path style="fill:none;stroke-width:1;stroke-linecap:butt;stroke-linejoin:miter;stroke:rgb(0%,0%,0%);stroke-opacity:1;stroke-miterlimit:4;" d="M 468.072917 -359.979167 C 471.46875 -358.958333 606.645833 -318.40625 710.34375 -287.302083 " transform="matrix(0.375,0,0,0.375,1.5,163.5)"/>
<path style="fill-rule:nonzero;fill:rgb(0%,0%,0%);fill-opacity:1;stroke-width:1;stroke-linecap:butt;stroke-linejoin:miter;stroke:rgb(0%,0%,0%);stroke-opacity:1;stroke-miterlimit:4;" d="M 711.375 -290.635417 L 719.947917 -284.40625 L 709.375 -283.9375 Z M 711.375 -290.635417 " transform="matrix(0.375,0,0,0.375,1.5,163.5)"/>
<path style="fill-rule:nonzero;fill:rgb(100%,64.705884%,0%);fill-opacity:1;stroke-width:1;stroke-linecap:butt;stroke-linejoin:miter;stroke:rgb(0%,0%,0%);stroke-opacity:1;stroke-miterlimit:4;" d="M 990 -108 L 666 -108 L 666 -36 L 990 -36 Z M 990 -108 " transform="matrix(0.375,0,0,0.375,1.5,163.5)"/>
<g style="fill:rgb(0%,0%,0%);fill-opacity:1;">
  <use xlink:href="#glyph0-15" x="268.125" y="139.312744"/>
  <use xlink:href="#glyph0-2" x="278.25" y="139.312744"/>
  <use xlink:href="#glyph0-8" x="283.875" y="139.312744"/>
  <use xlink:href="#glyph0-14" x="289.5" y="139.312744"/>
  <use xlink:href="#glyph0-17" x="295.125" y="139.312744"/>
  <use xlink:href="#glyph0-5" x="297.75" y="139.312744"/>
  <use xlink:href="#glyph0-18" x="302.625" y="139.312744"/>
  <use xlink:href="#glyph0-15" x="309" y="139.312744"/>
  <use xlink:href="#glyph0-2" x="319.125" y="139.312744"/>
  <use xlink:href="#glyph0-8" x="324.75" y="139.312744"/>
  <use xlink:href="#glyph0-14" x="330.375" y="139.312744"/>
  <use xlink:href="#glyph0-17" x="336" y="139.312744"/>
  <use xlink:href="#glyph0-19" x="338.625" y="139.312744"/>
  <use xlink:href="#glyph0-20" x="344.25" y="139.312744"/>
  <use xlink:href="#glyph0-21" x="352.875" y="139.312744"/>
</g>
<path style="fill:none;stroke-width:1;stroke-linecap:butt;stroke-linejoin:miter;stroke:rgb(0%,0%,0%);stroke-opacity:1;stroke-miterlimit:4;" d="M 828 -215.572917 C 828 -187.552083 828 -148.625 828 -118.375 " transform="matrix(0.375,0,0,0.375,1.5,163.5)"/>
<path style="fill-rule:nonzero;fill:rgb(0%,0%,0%);fill-opacity:1;stroke-width:1;stroke-linecap:butt;stroke-linejoin:miter;stroke:rgb(0%,0%,0%);stroke-opacity:1;stroke-miterlimit:4;" d="M 831.5 -118.0625 L 828 -108.0625 L 824.5 -118.0625 Z M 831.5 -118.0625 " transform="matrix(0.375,0,0,0.375,1.5,163.5)"/>
<path style="fill:none;stroke-width:1;stroke-linecap:butt;stroke-linejoin:miter;stroke:rgb(0%,0%,100%);stroke-opacity:1;stroke-miterlimit:4;" d="M 1008 -144 L 648 -144 L 648 0.000000000000056843 L 1008 0.000000000000056843 Z M 1008 -144 " transform="matrix(0.375,0,0,0.375,1.5,163.5)"/>
<g style="fill:rgb(0%,0%,0%);fill-opacity:1;">
  <use xlink:href="#glyph0-23" x="279.375" y="160.125244"/>
  <use xlink:href="#glyph0-1" x="287.625" y="160.125244"/>
  <use xlink:href="#glyph0-6" x="292.125" y="160.125244"/>
  <use xlink:href="#glyph0-4" x="297" y="160.125244"/>
  <use xlink:href="#glyph0-7" x="300.75" y="160.125244"/>
  <use xlink:href="#glyph0-24" x="303.375" y="160.125244"/>
  <use xlink:href="#glyph0-6" x="309.375" y="160.125244"/>
  <use xlink:href="#glyph0-21" x="314.25" y="160.125244"/>
  <use xlink:href="#glyph0-6" x="317.25" y="160.125244"/>
  <use xlink:href="#glyph0-5" x="322.125" y="160.125244"/>
  <use xlink:href="#glyph0-25" x="327" y="160.125244"/>
  <use xlink:href="#glyph0-9" x="330.375" y="160.125244"/>
  <use xlink:href="#glyph0-2" x="333.375" y="160.125244"/>
  <use xlink:href="#glyph0-10" x="339" y="160.125244"/>
</g>
</g>
</svg>
