{   "name": "example",
	"version": "2.0",
	"extra_sources": [],
	"initializers": [],
	"loopers": [],
	"buses": {},
	"commands": [],
	"messages": {
		"0x30": {
		"bus": "ls",
		"is_fd" : false,
		"is_extended": false,
		"is_j1939" : false,
		"signals": {
			"LeftTemperature": {
				"generic_name": "hvac.temperature.left",
				"bit_position": 0,
				"bit_size": 8,
				"factor": 1,
				"offset": 0
			},
			"RightTemperature": {
				"generic_name": "hvac.temperature.right",
				"bit_position": 8,
				"bit_size": 8,
				"factor": 1,
				"offset": 0
			},
			"Temperature": {
				"generic_name": "hvac.temperature.average",
				"bit_position": 16,
				"bit_size": 8,
				"factor": 1,
				"offset": 0
			},
			"FanSpeed": {
				"generic_name": "hvac.fan.speed",
				"bit_position": 32,
				"bit_size": 8,
				"factor": 23.529411765,
				"offset": 0
			}
		}
	}
}
}
