(footprint "156125YV73000" (version 20210824) (generator pcbnew) (layer "F.Cu")
  (tedit 6143670C)
  (descr "156125YV73000-1")
  (tags "LED")
  (attr smd)
  (fp_text reference "LED**" (at -0.265 -1.905) (layer "F.SilkS")
    (effects (font (size 1 1) (thickness 0.15)))
    (tstamp d85c9215-914b-4d8d-a342-eea5fb9617d6)
  )
  (fp_text value "156125YV73000" (at -0.265 2.54) (layer "F.SilkS") hide
    (effects (font (size 0.4 0.4) (thickness 0.06)))
    (tstamp 6be8a16f-c7a3-46c2-b69d-7ca95583c7b1)
  )
  (fp_text user "${REFERENCE}" (at -0.265 0) (layer "F.Fab")
    (effects (font (size 0.4 0.4) (thickness 0.06)))
    (tstamp 82c3ff77-4ff2-4105-aaab-4bf6bc2ecc3f)
  )
  (fp_line (start -1 -0.575) (end 1 -0.575) (layer "F.SilkS") (width 0.1) (tstamp 1d0a4238-f080-49b9-a9b6-4e64ef3470f5))
  (fp_line (start -2.5 0.5) (end -2.5 0.5) (layer "F.SilkS") (width 0.3) (tstamp 2dc0c0f1-5e0e-4259-bfbc-41fc61eeba20))
  (fp_line (start -2.5 0.6) (end -2.5 0.6) (layer "F.SilkS") (width 0.3) (tstamp 2f70de20-1838-4191-9d94-21967a140c78))
  (fp_line (start -1 0.6) (end 1 0.6) (layer "F.SilkS") (width 0.1) (tstamp 3eac76ec-81e8-4fc6-907a-23ca50e20c15))
  (fp_arc (start -2.5 0.55) (end -2.5 0.6) (angle -180) (layer "F.SilkS") (width 0.3) (tstamp 5bff8f79-4336-4bfb-98ec-33a68a63efb4))
  (fp_arc (start -2.5 0.55) (end -2.5 0.5) (angle -180) (layer "F.SilkS") (width 0.3) (tstamp f11089b8-3f83-4296-8646-881adcf4a3eb))
  (fp_line (start 3 2) (end -3.53 2) (layer "F.CrtYd") (width 0.1) (tstamp 35e44771-e4ee-45ff-97ae-d0bcb40b52b9))
  (fp_line (start -3.53 2) (end -3.53 -2) (layer "F.CrtYd") (width 0.1) (tstamp 7779a8d7-a377-4358-bc52-d2046d3bba26))
  (fp_line (start 3 -2) (end 3 2) (layer "F.CrtYd") (width 0.1) (tstamp 937e0c04-2154-448b-92c1-98073b2defd5))
  (fp_line (start -3.53 -2) (end 3 -2) (layer "F.CrtYd") (width 0.1) (tstamp fe8bc8e6-978a-4008-b1cc-bbbc734bbf4f))
  (fp_line (start -1.6 0.6) (end -1.6 -0.6) (layer "F.Fab") (width 0.2) (tstamp 105c1eb9-4794-483c-a5a4-9d46618babb4))
  (fp_line (start -1.6 -0.6) (end 1.6 -0.6) (layer "F.Fab") (width 0.2) (tstamp 5a34363c-1782-4be5-9ad3-10028cb2b716))
  (fp_line (start 1.6 0.6) (end -1.6 0.6) (layer "F.Fab") (width 0.2) (tstamp 8be851fc-f14a-4d70-8e6b-3d64df1757bd))
  (fp_line (start 1.6 -0.6) (end 1.6 0.6) (layer "F.Fab") (width 0.2) (tstamp f41dd81f-8457-4d6f-b7ea-32f42b3dbb77))
  (pad "1" smd rect locked (at -1.55 0.575 90) (size 0.85 0.9) (layers "F.Cu" "F.Paste" "F.Mask") (tstamp 5b2c12a6-95a7-4024-8a19-4817131d3992))
  (pad "2" smd rect locked (at -1.55 -0.575 90) (size 0.85 0.9) (layers "F.Cu" "F.Paste" "F.Mask") (tstamp 9be70073-3083-4908-8e05-48d198f20a0c))
  (pad "3" smd rect locked (at 1.55 -0.575 90) (size 0.85 0.9) (layers "F.Cu" "F.Paste" "F.Mask") (tstamp 8c7a5a8c-acd2-42ba-a285-74e089628d7a))
  (pad "4" smd rect locked (at 1.55 0.575 90) (size 0.85 0.9) (layers "F.Cu" "F.Paste" "F.Mask") (tstamp 581c171f-cc98-4cb8-a3b0-34dc0adb1bb2))
  (model "${KICAD6_3DMODEL_DIR}/LED_SMD.3dshapes/LED_1206_3216Metric.wrl"
    (offset (xyz 0 0 0))
    (scale (xyz 1 1 1))
    (rotate (xyz 0 0 0))
  )
)
