(footprint "641737-1" (version 20210824) (generator pcbnew) (layer "F.Cu")
  (tedit 61436715)
  (descr "641737-1")
  (tags "Connector")
  (attr through_hole)
  (fp_text reference "J**" (at 12.7 2.54 180 unlocked) (layer "F.SilkS")
    (effects (font (size 1 1) (thickness 0.15)) (justify left))
    (tstamp b68e2d73-70c4-4a5d-932b-547bad291a74)
  )
  (fp_text value "641737-1" (at -0.575 -3.81) (layer "F.SilkS") hide
    (effects (font (size 1.27 1.27) (thickness 0.254)))
    (tstamp 6fcfacc7-e9c3-46c6-9c41-ea69634c4a01)
  )
  (fp_text user "${REFERENCE}" (at -0.575 -6.35) (layer "F.Fab")
    (effects (font (size 1.27 1.27) (thickness 0.254)))
    (tstamp 4e2bb05c-3d4a-4782-b4b6-c115614e1a3b)
  )
  (fp_line (start 12.7 1) (end 8.623 1) (layer "F.SilkS") (width 0.2) (tstamp 205f62e7-a715-487f-bc8c-ab7f82074681))
  (fp_line (start 12.7 -12) (end 12.7 1) (layer "F.SilkS") (width 0.2) (tstamp 63794e06-01d6-4742-a3c5-094c5582c479))
  (fp_line (start -12.7 1) (end -8.623 1) (layer "F.SilkS") (width 0.2) (tstamp 72715de0-2ee7-4c2e-bcd3-fb0bc012a312))
  (fp_line (start -12.7 -12) (end -6.364 -12) (layer "F.SilkS") (width 0.2) (tstamp 90531901-8cf3-4719-8e3c-b1ade74ab540))
  (fp_line (start -3.8 -12) (end 3.8 -12) (layer "F.SilkS") (width 0.2) (tstamp b079c848-84a7-4434-82b9-e78a06dfc746))
  (fp_line (start -12.7 -12) (end -12.7 1) (layer "F.SilkS") (width 0.2) (tstamp f3694167-c874-47c1-b1c0-5081b8085fff))
  (fp_line (start 12.7 -12) (end 6.364 -12) (layer "F.SilkS") (width 0.2) (tstamp ff7607e2-ec3a-4d0b-becc-fc5bf4d1c073))
  (fp_circle (center 7.523 1.984) (end 7.523 2.05578) (layer "F.SilkS") (width 0.2) (fill none) (tstamp fa6ee2a2-c409-4be2-a948-b87d812a8cef))
  (fp_line (start -12.7 -12) (end 12.7 -12) (layer "F.Fab") (width 0.2) (tstamp 7d31bbbc-411a-4472-859b-7ac7fcf3184f))
  (fp_line (start 12.7 -12) (end 12.7 1) (layer "F.Fab") (width 0.2) (tstamp 9894a532-2850-4dbd-ab40-c9d43635a306))
  (fp_line (start 12.7 1) (end -12.7 1) (layer "F.Fab") (width 0.2) (tstamp a911ce79-f7cf-4f09-a5c1-01a7706510d9))
  (fp_line (start -12.7 1) (end -12.7 -12) (layer "F.Fab") (width 0.2) (tstamp d655d545-64fc-4855-b2c3-1f27e20e4b89))
  (pad "" np_thru_hole circle locked (at -10.16 -2.54) (size 2.54 2.54) (drill 2.54) (layers *.Cu *.Mask) (tstamp 709c47b1-7d2e-4b9a-91d6-754c5d893090))
  (pad "" np_thru_hole circle locked (at 5.08 -10.16) (size 4 4) (drill 4) (layers *.Cu *.Mask) (tstamp 8a3a05dc-fa07-4edd-9df3-560a3c25ee1f))
  (pad "" np_thru_hole circle locked (at 10.16 -2.54) (size 2.54 2.54) (drill 2.54) (layers *.Cu *.Mask) (tstamp c3e1ec32-18e1-44ab-b1f8-ade7ef0d8396))
  (pad "" np_thru_hole circle locked (at -5.08 -10.16) (size 4 4) (drill 4) (layers *.Cu *.Mask) (tstamp e781e9a0-e44d-40a0-899e-d842972c7e72))
  (pad "1" thru_hole circle locked (at 7.62 0) (size 2.4 2.4) (drill 1.6) (layers *.Cu *.Mask) (tstamp b0140639-1cf4-4d1e-b0b9-81c66b23c0e3))
  (pad "2" thru_hole circle locked (at 2.54 0) (size 2.4 2.4) (drill 1.6) (layers *.Cu *.Mask) (tstamp d931425b-face-4c76-b09c-d421647af30c))
  (pad "3" thru_hole circle locked (at -2.54 0) (size 2.4 2.4) (drill 1.6) (layers *.Cu *.Mask) (tstamp 3befe9aa-a657-4dfe-a608-488e2fa57a52))
  (pad "4" thru_hole circle locked (at -7.62 0) (size 2.4 2.4) (drill 1.6) (layers *.Cu *.Mask) (tstamp e3d3f070-4f42-44bf-a833-43067499bcac))
  (model "${KIPRJMOD}/Parts/3DModels/641737-1.3dshapes/641737-1.stp"
    (offset (xyz 0 12.5 4))
    (scale (xyz 1 1 1))
    (rotate (xyz -90 0 180))
  )
)
