(footprint "SOIC127P600X175-8N" (version 20210824) (generator pcbnew) (layer "F.Cu")
  (tedit 6143672A)
  (descr "D (R-PDSO-G8)")
  (tags "Integrated Circuit")
  (attr smd)
  (fp_text reference "IC**" (at 0 -3.81) (layer "F.SilkS")
    (effects (font (size 1 1) (thickness 0.15)))
    (tstamp 307164bc-04c3-4e8d-bc01-872366d73957)
  )
  (fp_text value "SOIC127P600X175-8N" (at 0 3.175) (layer "F.SilkS") hide
    (effects (font (size 0.4 0.4) (thickness 0.06)))
    (tstamp 747e9001-a16a-4f99-bb08-22d9418c8b67)
  )
  (fp_text user "${REFERENCE}" (at 0 0) (layer "F.Fab")
    (effects (font (size 0.4 0.4) (thickness 0.06)))
    (tstamp 2340a4d6-feb1-4f2a-b01e-31b84a672470)
  )
  (fp_line (start -3.475 -2.58) (end -1.95 -2.58) (layer "F.SilkS") (width 0.2) (tstamp 2cb77cd4-fb5e-4c85-93ae-4605852ec73c))
  (fp_line (start 1.6 -2.45) (end 1.6 2.45) (layer "F.SilkS") (width 0.2) (tstamp 36a1673f-1d91-40d4-8e8c-e72be8ab88d0))
  (fp_line (start -1.6 2.45) (end -1.6 -2.45) (layer "F.SilkS") (width 0.2) (tstamp 7777fb49-786e-4a10-87c7-34776f722a7d))
  (fp_line (start -1.6 -2.45) (end 1.6 -2.45) (layer "F.SilkS") (width 0.2) (tstamp b27d3527-bbe2-46c0-b39d-6b012bb858e0))
  (fp_line (start 1.6 2.45) (end -1.6 2.45) (layer "F.SilkS") (width 0.2) (tstamp eda4cdf9-eafe-4629-bc55-2166d6328aaf))
  (fp_line (start -3.725 -2.75) (end 3.725 -2.75) (layer "F.CrtYd") (width 0.05) (tstamp 083a3cff-4382-44c3-9d4c-523c155468c5))
  (fp_line (start 3.725 -2.75) (end 3.725 2.75) (layer "F.CrtYd") (width 0.05) (tstamp 1301ec85-7060-4b02-aa9e-5b20bbdb1cfe))
  (fp_line (start -3.725 2.75) (end -3.725 -2.75) (layer "F.CrtYd") (width 0.05) (tstamp dcbe03e4-162a-440a-a341-29c67c631775))
  (fp_line (start 3.725 2.75) (end -3.725 2.75) (layer "F.CrtYd") (width 0.05) (tstamp f835b8fc-4789-4d38-b586-33ac7bf04ef5))
  (fp_line (start -1.95 2.45) (end -1.95 -2.45) (layer "F.Fab") (width 0.1) (tstamp 34953524-e2f3-4d9b-b234-c8c9ec6625da))
  (fp_line (start 1.95 -2.45) (end 1.95 2.45) (layer "F.Fab") (width 0.1) (tstamp 7d9ab8e7-482b-4dd3-83d5-9983258ce95d))
  (fp_line (start -1.95 -2.45) (end 1.95 -2.45) (layer "F.Fab") (width 0.1) (tstamp 9b9d8ece-80b1-45e9-b337-38b22b291b40))
  (fp_line (start 1.95 2.45) (end -1.95 2.45) (layer "F.Fab") (width 0.1) (tstamp b5cca37b-90ef-457c-a448-b99f8d10057a))
  (fp_line (start -1.95 -1.18) (end -0.68 -2.45) (layer "F.Fab") (width 0.1) (tstamp cd4299b7-4f57-4bfb-8a2c-96904447d961))
  (pad "1" smd rect locked (at -2.712 -1.905 90) (size 0.65 1.525) (layers "F.Cu" "F.Paste" "F.Mask") (tstamp 77635645-5914-4a30-bdcc-9569ecfbc775))
  (pad "2" smd rect locked (at -2.712 -0.635 90) (size 0.65 1.525) (layers "F.Cu" "F.Paste" "F.Mask") (tstamp 347dbfe4-97f2-4a31-9db5-a3197524cdba))
  (pad "3" smd rect locked (at -2.712 0.635 90) (size 0.65 1.525) (layers "F.Cu" "F.Paste" "F.Mask") (tstamp 69a537ce-0a2c-4ec6-abe1-2ac770eaa7ad))
  (pad "4" smd rect locked (at -2.712 1.905 90) (size 0.65 1.525) (layers "F.Cu" "F.Paste" "F.Mask") (tstamp bd11c812-08a7-42f4-a14d-588dbeefb27a))
  (pad "5" smd rect locked (at 2.712 1.905 90) (size 0.65 1.525) (layers "F.Cu" "F.Paste" "F.Mask") (tstamp 15c6b3e2-4f04-48a3-9054-4891ff50a92b))
  (pad "6" smd rect locked (at 2.712 0.635 90) (size 0.65 1.525) (layers "F.Cu" "F.Paste" "F.Mask") (tstamp a05cbdcb-bb9e-4756-9487-2b8e9cb70dde))
  (pad "7" smd rect locked (at 2.712 -0.635 90) (size 0.65 1.525) (layers "F.Cu" "F.Paste" "F.Mask") (tstamp 4098657b-24a4-4c08-8aea-219bc3925763))
  (pad "8" smd rect locked (at 2.712 -1.905 90) (size 0.65 1.525) (layers "F.Cu" "F.Paste" "F.Mask") (tstamp bfee92dd-0814-49bb-90b1-b2940c18ec49))
  (model "${KIPRJMOD}/Parts/3DModels/LM358ADR.3dshapes/SOIC127P600X175-8N.wrl"
    (offset (xyz 0 0 0))
    (scale (xyz 393.7 393.7 393.7))
    (rotate (xyz 0 0 0))
  )
)
