(kicad_sch
	(version 20231120)
	(generator "eeschema")
	(generator_version "8.0")
	(uuid "3ce5836f-fd78-448e-8882-64cb70f46179")
	(paper "A4")
	(lib_symbols
		(symbol "Sprite_MotionPlatform:MB"
			(pin_names
				(offset 1.016)
			)
			(exclude_from_sim no)
			(in_bom yes)
			(on_board yes)
			(property "Reference" "U"
				(at 1.27 1.27 0)
				(effects
					(font
						(size 1.27 1.27)
					)
				)
			)
			(property "Value" "MB"
				(at 10.16 1.27 0)
				(effects
					(font
						(size 1.27 1.27)
					)
				)
			)
			(property "Footprint" ""
				(at 0 0 0)
				(effects
					(font
						(size 1.27 1.27)
					)
					(hide yes)
				)
			)
			(property "Datasheet" ""
				(at 0 0 0)
				(effects
					(font
						(size 1.27 1.27)
					)
					(hide yes)
				)
			)
			(property "Description" "Castle Creations B-LINK Bluetooth Adapter"
				(at 0 0 0)
				(effects
					(font
						(size 1.27 1.27)
					)
					(hide yes)
				)
			)
			(symbol "MB_0_0"
				(rectangle
					(start 0 0)
					(end 20.32 -5.08)
					(stroke
						(width 0)
						(type default)
					)
					(fill
						(type none)
					)
				)
				(text "B-LINK Adapter"
					(at 10.16 -6.35 0)
					(effects
						(font
							(size 1.27 1.27)
						)
					)
				)
			)
			(symbol "MB_1_1"
				(pin input line
					(at -2.54 -2.54 0)
					(length 2.54)
					(name "MB1"
						(effects
							(font
								(size 1.27 1.27)
							)
						)
					)
					(number "1"
						(effects
							(font
								(size 1.27 1.27)
							)
						)
					)
				)
				(pin output line
					(at 22.86 -2.54 180)
					(length 2.54)
					(name "MB2"
						(effects
							(font
								(size 1.27 1.27)
							)
						)
					)
					(number "2"
						(effects
							(font
								(size 1.27 1.27)
							)
						)
					)
				)
			)
		)
		(symbol "Sprite_MotionPlatform:ME"
			(pin_names
				(offset 1.016)
			)
			(exclude_from_sim no)
			(in_bom yes)
			(on_board yes)
			(property "Reference" "U"
				(at 1.27 1.27 0)
				(effects
					(font
						(size 1.27 1.27)
					)
				)
			)
			(property "Value" "ME"
				(at 6.35 1.27 0)
				(effects
					(font
						(size 1.27 1.27)
					)
				)
			)
			(property "Footprint" ""
				(at 1.27 1.27 0)
				(effects
					(font
						(size 1.27 1.27)
					)
					(hide yes)
				)
			)
			(property "Datasheet" ""
				(at 1.27 1.27 0)
				(effects
					(font
						(size 1.27 1.27)
					)
					(hide yes)
				)
			)
			(property "Description" "Castle Creations Mamba X ESC"
				(at 0 0 0)
				(effects
					(font
						(size 1.27 1.27)
					)
					(hide yes)
				)
			)
			(symbol "ME_0_0"
				(text "Mamba X ESC"
					(at 6.35 -16.51 0)
					(effects
						(font
							(size 1.27 1.27)
						)
					)
				)
			)
			(symbol "ME_0_1"
				(rectangle
					(start 0 0)
					(end 12.7 -15.24)
					(stroke
						(width 0)
						(type default)
					)
					(fill
						(type none)
					)
				)
			)
			(symbol "ME_1_1"
				(pin input line
					(at -2.54 -3.81 0)
					(length 2.54)
					(name "ME1"
						(effects
							(font
								(size 1.27 1.27)
							)
						)
					)
					(number "1"
						(effects
							(font
								(size 1.27 1.27)
							)
						)
					)
				)
				(pin input line
					(at -2.54 -6.35 0)
					(length 2.54)
					(name "ME2"
						(effects
							(font
								(size 1.27 1.27)
							)
						)
					)
					(number "2"
						(effects
							(font
								(size 1.27 1.27)
							)
						)
					)
				)
				(pin input line
					(at -2.54 -8.89 0)
					(length 2.54)
					(name "ME3"
						(effects
							(font
								(size 1.27 1.27)
							)
						)
					)
					(number "3"
						(effects
							(font
								(size 1.27 1.27)
							)
						)
					)
				)
				(pin input line
					(at -2.54 -11.43 0)
					(length 2.54)
					(name "ME4"
						(effects
							(font
								(size 1.27 1.27)
							)
						)
					)
					(number "4"
						(effects
							(font
								(size 1.27 1.27)
							)
						)
					)
				)
				(pin output line
					(at 15.24 -7.62 180)
					(length 2.54)
					(name "ME5"
						(effects
							(font
								(size 1.27 1.27)
							)
						)
					)
					(number "5"
						(effects
							(font
								(size 1.27 1.27)
							)
						)
					)
				)
			)
		)
		(symbol "Sprite_MotionPlatform:MM"
			(pin_names
				(offset 1.016)
			)
			(exclude_from_sim no)
			(in_bom yes)
			(on_board yes)
			(property "Reference" "U"
				(at 1.27 1.27 0)
				(effects
					(font
						(size 1.27 1.27)
					)
				)
			)
			(property "Value" "MM"
				(at 6.35 1.27 0)
				(effects
					(font
						(size 1.27 1.27)
					)
				)
			)
			(property "Footprint" ""
				(at 0 0 0)
				(effects
					(font
						(size 1.27 1.27)
					)
					(hide yes)
				)
			)
			(property "Datasheet" ""
				(at 0 0 0)
				(effects
					(font
						(size 1.27 1.27)
					)
					(hide yes)
				)
			)
			(property "Description" "Castle Creations 1406-series 1900Kv motor"
				(at 0 0 0)
				(effects
					(font
						(size 1.27 1.27)
					)
					(hide yes)
				)
			)
			(symbol "MM_0_0"
				(text "1900Kv Motor"
					(at 6.35 -6.35 0)
					(effects
						(font
							(size 1.27 1.27)
						)
					)
				)
			)
			(symbol "MM_0_1"
				(rectangle
					(start 0 0)
					(end 12.7 -5.08)
					(stroke
						(width 0)
						(type default)
					)
					(fill
						(type none)
					)
				)
			)
			(symbol "MM_1_1"
				(pin input line
					(at -2.54 -2.54 0)
					(length 2.54)
					(name "MM1"
						(effects
							(font
								(size 1.27 1.27)
							)
						)
					)
					(number "1"
						(effects
							(font
								(size 1.27 1.27)
							)
						)
					)
				)
				(pin output line
					(at 15.24 -2.54 180)
					(length 2.54)
					(name "MM2"
						(effects
							(font
								(size 1.27 1.27)
							)
						)
					)
					(number "2"
						(effects
							(font
								(size 1.27 1.27)
							)
						)
					)
				)
			)
		)
		(symbol "Sprite_MotionPlatform:MR"
			(pin_names
				(offset 1.016)
			)
			(exclude_from_sim no)
			(in_bom yes)
			(on_board yes)
			(property "Reference" "U"
				(at 1.27 1.27 0)
				(effects
					(font
						(size 1.27 1.27)
					)
				)
			)
			(property "Value" "MR"
				(at 6.35 1.27 0)
				(effects
					(font
						(size 1.27 1.27)
					)
				)
			)
			(property "Footprint" ""
				(at 1.27 1.27 0)
				(effects
					(font
						(size 1.27 1.27)
					)
					(hide yes)
				)
			)
			(property "Datasheet" ""
				(at 1.27 1.27 0)
				(effects
					(font
						(size 1.27 1.27)
					)
					(hide yes)
				)
			)
			(property "Description" "Traxxas RPM Sensor"
				(at 0 0 0)
				(effects
					(font
						(size 1.27 1.27)
					)
					(hide yes)
				)
			)
			(symbol "MR_0_0"
				(text "RPM Sensor"
					(at 6.35 -6.35 0)
					(effects
						(font
							(size 1.27 1.27)
						)
					)
				)
			)
			(symbol "MR_0_1"
				(rectangle
					(start 0 0)
					(end 12.7 -5.08)
					(stroke
						(width 0)
						(type default)
					)
					(fill
						(type none)
					)
				)
			)
			(symbol "MR_1_1"
				(pin output line
					(at 15.24 -2.54 180)
					(length 2.54)
					(name "MR1"
						(effects
							(font
								(size 1.27 1.27)
							)
						)
					)
					(number "1"
						(effects
							(font
								(size 1.27 1.27)
							)
						)
					)
				)
			)
		)
		(symbol "Sprite_MotionPlatform:MS"
			(pin_names
				(offset 1.016)
			)
			(exclude_from_sim no)
			(in_bom yes)
			(on_board yes)
			(property "Reference" "U"
				(at 1.27 1.27 0)
				(effects
					(font
						(size 1.27 1.27)
					)
				)
			)
			(property "Value" "MS"
				(at 6.35 1.27 0)
				(effects
					(font
						(size 1.27 1.27)
					)
				)
			)
			(property "Footprint" ""
				(at 1.27 1.27 0)
				(effects
					(font
						(size 1.27 1.27)
					)
					(hide yes)
				)
			)
			(property "Datasheet" ""
				(at 1.27 1.27 0)
				(effects
					(font
						(size 1.27 1.27)
					)
					(hide yes)
				)
			)
			(property "Description" "Traxxas High-Torque 400 Servo"
				(at 0 0 0)
				(effects
					(font
						(size 1.27 1.27)
					)
					(hide yes)
				)
			)
			(symbol "MS_0_0"
				(text "Servo"
					(at 5.08 -6.35 0)
					(effects
						(font
							(size 1.27 1.27)
						)
					)
				)
			)
			(symbol "MS_0_1"
				(rectangle
					(start 0 0)
					(end 10.16 -5.08)
					(stroke
						(width 0)
						(type default)
					)
					(fill
						(type none)
					)
				)
			)
			(symbol "MS_1_1"
				(pin input line
					(at -2.54 -2.54 0)
					(length 2.54)
					(name "MS1"
						(effects
							(font
								(size 1.27 1.27)
							)
						)
					)
					(number "1"
						(effects
							(font
								(size 1.27 1.27)
							)
						)
					)
				)
			)
		)
	)
	(wire
		(pts
			(xy 142.24 93.98) (xy 144.78 93.98)
		)
		(stroke
			(width 0)
			(type default)
		)
		(uuid "301f3767-c1d9-4b7b-8b1b-b45d926c5d7b")
	)
	(bus
		(pts
			(xy 116.84 99.06) (xy 116.84 102.87)
		)
		(stroke
			(width 0)
			(type default)
		)
		(uuid "52562628-a115-4301-bbd2-dffe5f7d872c")
	)
	(bus
		(pts
			(xy 111.76 96.52) (xy 116.84 96.52)
		)
		(stroke
			(width 0)
			(type default)
		)
		(uuid "54d421f2-0727-41ba-a4a7-18437b212d6f")
	)
	(wire
		(pts
			(xy 111.76 93.98) (xy 116.84 93.98)
		)
		(stroke
			(width 0)
			(type default)
		)
		(uuid "56c1c6c9-c330-40a9-98ce-0b56be74ec8f")
	)
	(wire
		(pts
			(xy 144.78 101.6) (xy 144.78 111.76)
		)
		(stroke
			(width 0)
			(type default)
		)
		(uuid "614915b9-06f0-422f-97ee-6d4d16b87a96")
	)
	(bus
		(pts
			(xy 111.76 99.06) (xy 116.84 99.06)
		)
		(stroke
			(width 0)
			(type default)
		)
		(uuid "71a46fc4-94f7-422a-899c-bc0ccd9b3661")
	)
	(wire
		(pts
			(xy 116.84 87.63) (xy 142.24 87.63)
		)
		(stroke
			(width 0)
			(type default)
		)
		(uuid "7337b6f0-4eb7-4dcc-963f-a85724d35f86")
	)
	(bus
		(pts
			(xy 116.84 107.95) (xy 114.3 107.95)
		)
		(stroke
			(width 0)
			(type default)
		)
		(uuid "986a73c2-c260-46c6-8d59-18ab20969318")
	)
	(bus
		(pts
			(xy 180.34 90.17) (xy 182.88 90.17)
		)
		(stroke
			(width 0)
			(type default)
		)
		(uuid "a5c72940-505d-4c72-a297-1ab468b4a093")
	)
	(bus
		(pts
			(xy 142.24 102.87) (xy 116.84 102.87)
		)
		(stroke
			(width 0)
			(type default)
		)
		(uuid "aa0740d0-d8c2-4a26-85a5-893ecb3674f6")
	)
	(bus
		(pts
			(xy 142.24 99.06) (xy 142.24 102.87)
		)
		(stroke
			(width 0)
			(type default)
		)
		(uuid "c9040ac3-dd01-4627-9614-cec85a5a0a29")
	)
	(wire
		(pts
			(xy 142.24 96.52) (xy 144.78 96.52)
		)
		(stroke
			(width 0)
			(type default)
		)
		(uuid "c96267ae-43ad-49e7-a55e-cfdacd4253dd")
	)
	(wire
		(pts
			(xy 162.56 97.79) (xy 162.56 105.41)
		)
		(stroke
			(width 0)
			(type default)
		)
		(uuid "d2433350-1623-40d8-81e2-ced45eec18f6")
	)
	(wire
		(pts
			(xy 180.34 105.41) (xy 180.34 111.76)
		)
		(stroke
			(width 0)
			(type default)
		)
		(uuid "d2d1e731-ca00-4c21-9bb5-ce7d16c92af1")
	)
	(wire
		(pts
			(xy 142.24 87.63) (xy 142.24 93.98)
		)
		(stroke
			(width 0)
			(type default)
		)
		(uuid "d3d69e9f-255e-451a-832a-24721ad4f630")
	)
	(wire
		(pts
			(xy 116.84 93.98) (xy 116.84 87.63)
		)
		(stroke
			(width 0)
			(type default)
		)
		(uuid "d46a3587-32e9-422c-a478-c008c18a3e4e")
	)
	(wire
		(pts
			(xy 180.34 111.76) (xy 144.78 111.76)
		)
		(stroke
			(width 0)
			(type default)
		)
		(uuid "df1c7df0-a267-4205-82b4-6b2d71b32def")
	)
	(bus
		(pts
			(xy 114.3 107.95) (xy 114.3 101.6)
		)
		(stroke
			(width 0)
			(type default)
		)
		(uuid "ef3dd575-3918-43ba-b358-128411f0d74c")
	)
	(bus
		(pts
			(xy 111.76 101.6) (xy 114.3 101.6)
		)
		(stroke
			(width 0)
			(type default)
		)
		(uuid "f17233ac-cae3-402d-aa80-c63ab3044243")
	)
	(bus
		(pts
			(xy 144.78 99.06) (xy 142.24 99.06)
		)
		(stroke
			(width 0)
			(type default)
		)
		(uuid "f404a9e8-4163-45f7-80ab-1a031e9ff508")
	)
	(hierarchical_label "M2{SERVO}"
		(shape input)
		(at 111.76 96.52 180)
		(effects
			(font
				(size 1.27 1.27)
			)
			(justify right)
		)
		(uuid "3a615c97-96e2-4fcc-b6c8-97d1ee0f2b8f")
	)
	(hierarchical_label "M3{SERVO}"
		(shape input)
		(at 111.76 99.06 180)
		(effects
			(font
				(size 1.27 1.27)
			)
			(justify right)
		)
		(uuid "7cd06216-f12e-44f9-8c98-8c8307791973")
	)
	(hierarchical_label "M4{SERVO}"
		(shape input)
		(at 111.76 101.6 180)
		(effects
			(font
				(size 1.27 1.27)
			)
			(justify right)
		)
		(uuid "87af9a9e-893e-4b38-a852-3293eb8dd219")
	)
	(hierarchical_label "M1"
		(shape input)
		(at 111.76 93.98 180)
		(effects
			(font
				(size 1.27 1.27)
			)
			(justify right)
		)
		(uuid "8903bf56-1274-4ce9-aab7-40ecf4c534cc")
	)
	(hierarchical_label "M5{SERVO}"
		(shape input)
		(at 182.88 90.17 0)
		(effects
			(font
				(size 1.27 1.27)
			)
			(justify left)
		)
		(uuid "d4a338af-0140-420a-89cc-c41b9ddc4ccb")
	)
	(symbol
		(lib_id "Sprite_MotionPlatform:ME")
		(at 147.32 90.17 0)
		(unit 1)
		(exclude_from_sim no)
		(in_bom yes)
		(on_board yes)
		(dnp no)
		(uuid "00000000-0000-0000-0000-00005da7cdff")
		(property "Reference" "#U8"
			(at 153.67 85.979 0)
			(effects
				(font
					(size 1.27 1.27)
				)
			)
		)
		(property "Value" "ME"
			(at 153.67 88.2904 0)
			(effects
				(font
					(size 1.27 1.27)
				)
			)
		)
		(property "Footprint" ""
			(at 148.59 88.9 0)
			(effects
				(font
					(size 1.27 1.27)
				)
				(hide yes)
			)
		)
		(property "Datasheet" ""
			(at 148.59 88.9 0)
			(effects
				(font
					(size 1.27 1.27)
				)
				(hide yes)
			)
		)
		(property "Description" ""
			(at 147.32 90.17 0)
			(effects
				(font
					(size 1.27 1.27)
				)
				(hide yes)
			)
		)
		(pin "1"
			(uuid "3d8463de-315c-4adf-be6d-5ae216d9b9a4")
		)
		(pin "2"
			(uuid "d29fdc4f-7549-44e8-a95b-c51cba259e18")
		)
		(pin "3"
			(uuid "fa5a7607-2b8d-4d41-ab20-4f9a1273278f")
		)
		(pin "4"
			(uuid "7f3f32ae-73d1-4071-8550-d491865832d2")
		)
		(pin "5"
			(uuid "3ae39288-88bb-425a-a086-8834cd23f1d5")
		)
		(instances
			(project ""
				(path "/9b6fff56-12db-4aef-a2e1-d9345cf3ec72/00000000-0000-0000-0000-00005da7ca58"
					(reference "#U8")
					(unit 1)
				)
			)
		)
	)
	(symbol
		(lib_id "Sprite_MotionPlatform:MM")
		(at 165.1 102.87 0)
		(unit 1)
		(exclude_from_sim no)
		(in_bom yes)
		(on_board yes)
		(dnp no)
		(uuid "00000000-0000-0000-0000-00005da7cf37")
		(property "Reference" "#U10"
			(at 171.45 98.679 0)
			(effects
				(font
					(size 1.27 1.27)
				)
			)
		)
		(property "Value" "MM"
			(at 171.45 100.9904 0)
			(effects
				(font
					(size 1.27 1.27)
				)
			)
		)
		(property "Footprint" ""
			(at 165.1 102.87 0)
			(effects
				(font
					(size 1.27 1.27)
				)
				(hide yes)
			)
		)
		(property "Datasheet" ""
			(at 165.1 102.87 0)
			(effects
				(font
					(size 1.27 1.27)
				)
				(hide yes)
			)
		)
		(property "Description" ""
			(at 165.1 102.87 0)
			(effects
				(font
					(size 1.27 1.27)
				)
				(hide yes)
			)
		)
		(pin "1"
			(uuid "1396f2a0-1c1b-4e99-bc02-677c5fe714dd")
		)
		(pin "2"
			(uuid "74e896a9-173f-4d16-b5ce-72c1b1104ec5")
		)
		(instances
			(project ""
				(path "/9b6fff56-12db-4aef-a2e1-d9345cf3ec72/00000000-0000-0000-0000-00005da7ca58"
					(reference "#U10")
					(unit 1)
				)
			)
		)
	)
	(symbol
		(lib_id "Sprite_MotionPlatform:MS")
		(at 119.38 105.41 0)
		(unit 1)
		(exclude_from_sim no)
		(in_bom yes)
		(on_board yes)
		(dnp no)
		(uuid "00000000-0000-0000-0000-00005da7d079")
		(property "Reference" "#U7"
			(at 130.2512 107.8738 0)
			(effects
				(font
					(size 1.27 1.27)
				)
				(justify left)
			)
		)
		(property "Value" "MS"
			(at 130.2512 110.1852 0)
			(effects
				(font
					(size 1.27 1.27)
				)
				(justify left)
			)
		)
		(property "Footprint" ""
			(at 120.65 104.14 0)
			(effects
				(font
					(size 1.27 1.27)
				)
				(hide yes)
			)
		)
		(property "Datasheet" ""
			(at 120.65 104.14 0)
			(effects
				(font
					(size 1.27 1.27)
				)
				(hide yes)
			)
		)
		(property "Description" ""
			(at 119.38 105.41 0)
			(effects
				(font
					(size 1.27 1.27)
				)
				(hide yes)
			)
		)
		(pin "1"
			(uuid "a33a21b7-00cf-4340-820c-d4c57c6a32cc")
		)
		(instances
			(project ""
				(path "/9b6fff56-12db-4aef-a2e1-d9345cf3ec72/00000000-0000-0000-0000-00005da7ca58"
					(reference "#U7")
					(unit 1)
				)
			)
		)
	)
	(symbol
		(lib_id "Sprite_MotionPlatform:MR")
		(at 165.1 87.63 0)
		(unit 1)
		(exclude_from_sim no)
		(in_bom yes)
		(on_board yes)
		(dnp no)
		(uuid "00000000-0000-0000-0000-00005da7d1cd")
		(property "Reference" "#U9"
			(at 172.9232 83.439 0)
			(effects
				(font
					(size 1.27 1.27)
				)
			)
		)
		(property "Value" "MR"
			(at 172.9232 85.7504 0)
			(effects
				(font
					(size 1.27 1.27)
				)
			)
		)
		(property "Footprint" ""
			(at 166.37 86.36 0)
			(effects
				(font
					(size 1.27 1.27)
				)
				(hide yes)
			)
		)
		(property "Datasheet" ""
			(at 166.37 86.36 0)
			(effects
				(font
					(size 1.27 1.27)
				)
				(hide yes)
			)
		)
		(property "Description" ""
			(at 165.1 87.63 0)
			(effects
				(font
					(size 1.27 1.27)
				)
				(hide yes)
			)
		)
		(pin "1"
			(uuid "6da7dda8-f2ee-47eb-aa1c-b81dc617ef90")
		)
		(instances
			(project ""
				(path "/9b6fff56-12db-4aef-a2e1-d9345cf3ec72/00000000-0000-0000-0000-00005da7ca58"
					(reference "#U9")
					(unit 1)
				)
			)
		)
	)
	(symbol
		(lib_id "Sprite_MotionPlatform:MB")
		(at 119.38 93.98 0)
		(unit 1)
		(exclude_from_sim no)
		(in_bom yes)
		(on_board yes)
		(dnp no)
		(uuid "00000000-0000-0000-0000-00005db14ddb")
		(property "Reference" "#U6"
			(at 129.54 89.789 0)
			(effects
				(font
					(size 1.27 1.27)
				)
			)
		)
		(property "Value" "MB"
			(at 129.54 92.1004 0)
			(effects
				(font
					(size 1.27 1.27)
				)
			)
		)
		(property "Footprint" ""
			(at 119.38 93.98 0)
			(effects
				(font
					(size 1.27 1.27)
				)
				(hide yes)
			)
		)
		(property "Datasheet" ""
			(at 119.38 93.98 0)
			(effects
				(font
					(size 1.27 1.27)
				)
				(hide yes)
			)
		)
		(property "Description" ""
			(at 119.38 93.98 0)
			(effects
				(font
					(size 1.27 1.27)
				)
				(hide yes)
			)
		)
		(pin "1"
			(uuid "a31812d5-300e-4b0e-80ba-0e949f6b39cb")
		)
		(pin "2"
			(uuid "215df615-df11-4cee-95b6-d46c91844bdf")
		)
		(instances
			(project ""
				(path "/9b6fff56-12db-4aef-a2e1-d9345cf3ec72/00000000-0000-0000-0000-00005da7ca58"
					(reference "#U6")
					(unit 1)
				)
			)
		)
	)
)
