(kicad_symbol_lib (version 20210619) (generator kicad_symbol_editor)
  (symbol "76SD01T" (pin_names (offset 0) hide) (in_bom yes) (on_board yes)
    (property "Reference" "SW" (id 0) (at 0 8.89 0)
      (effects (font (size 1.27 1.27)))
    )
    (property "Value" "76SD01T" (id 1) (at 0 -10.16 0)
      (effects (font (size 1.27 1.27)))
    )
    (property "Footprint" "" (id 2) (at 0 5.08 0)
      (effects (font (size 1.27 1.27)) hide)
    )
    (property "Datasheet" "" (id 3) (at 0 5.08 0)
      (effects (font (size 1.27 1.27)) hide)
    )
    (symbol "76SD01T_0_0"
      (circle (center -2.032 -5.08) (radius 0.508) (stroke (width 0)) (fill (type none)))
      (circle (center -2.032 5.08) (radius 0.508) (stroke (width 0)) (fill (type none)))
      (circle (center 2.032 -7.62) (radius 0.508) (stroke (width 0)) (fill (type none)))
      (circle (center 2.032 2.54) (radius 0.508) (stroke (width 0)) (fill (type none)))
    )
    (symbol "76SD01T_0_1"
      (circle (center 2.032 -2.54) (radius 0.508) (stroke (width 0)) (fill (type none)))
      (circle (center 2.032 7.62) (radius 0.508) (stroke (width 0)) (fill (type none)))
      (polyline
        (pts
          (xy -1.524 -4.826)
          (xy 2.54 -3.048)
        )
        (stroke (width 0)) (fill (type none))
      )
      (polyline
        (pts
          (xy -1.524 5.334)
          (xy 2.54 7.112)
        )
        (stroke (width 0)) (fill (type none))
      )
      (polyline
        (pts
          (xy 0 -2.286)
          (xy 0 -4.064)
        )
        (stroke (width 0)) (fill (type none))
      )
      (polyline
        (pts
          (xy 0 -1.016)
          (xy 0 0)
        )
        (stroke (width 0)) (fill (type none))
      )
      (polyline
        (pts
          (xy 0 1.27)
          (xy 0 2.286)
        )
        (stroke (width 0)) (fill (type none))
      )
      (polyline
        (pts
          (xy 0 3.556)
          (xy 0 4.572)
        )
        (stroke (width 0)) (fill (type none))
      )
      (polyline
        (pts
          (xy 0 7.874)
          (xy 0 6.096)
        )
        (stroke (width 0)) (fill (type none))
      )
    )
    (symbol "76SD01T_1_1"
      (pin passive line (at 5.08 7.62 180) (length 2.54)
        (name "A" (effects (font (size 1.27 1.27))))
        (number "1" (effects (font (size 1.27 1.27))))
      )
      (pin passive line (at 5.08 2.54 180) (length 2.54)
        (name "C" (effects (font (size 1.27 1.27))))
        (number "2" (effects (font (size 1.27 1.27))))
      )
      (pin passive line (at 5.08 -2.54 180) (length 2.54)
        (name "A" (effects (font (size 1.27 1.27))))
        (number "3" (effects (font (size 1.27 1.27))))
      )
      (pin passive line (at 5.08 -7.62 180) (length 2.54)
        (name "C" (effects (font (size 1.27 1.27))))
        (number "4" (effects (font (size 1.27 1.27))))
      )
      (pin passive line (at -5.08 5.08 0) (length 2.54)
        (name "B" (effects (font (size 1.27 1.27))))
        (number "C1" (effects (font (size 1.27 1.27))))
      )
      (pin passive line (at -5.08 -5.08 0) (length 2.54)
        (name "B" (effects (font (size 1.27 1.27))))
        (number "C2" (effects (font (size 1.27 1.27))))
      )
    )
  )
)
