Change Component Designator: Old Designator=C? New Designator=C6
Change Component Designator: Old Designator=C? New Designator=C7
Change Component Designator: Old Designator=R? New Designator=R7
Change Component Designator: Old Designator=X? New Designator=X1
