{
  "version": 3,
  "artifactType": {
    "type": "APK",
    "kind": "Directory"
  },
  "applicationId": "com.autogramma.multimedia",
  "variantName": "debug",
  "elements": [
    {
      "type": "SINGLE",
      "filters": [],
      "attributes": [],
      "versionCode": 1,
      "versionName": "1.0",
      "outputFile": "app-debug.apk"
    }
  ],
  "elementType": "File"
}
