{
  "__readme": [
    "Basic Camera HAL v3 configuration."
  ],

  "hal_version": "3",
  "cam_blit_copy": "GPU_3D",
  "cam_blit_csc": "GPU_3D",

  "camera_metadata": [
    {
      "camera_type": "back",
      "camera_name": "mx6s-csi",
      "bus_info": "platform:30b80000.csi2_bridge",
      "orientation": "0",
      "buffer_type": "mmap",
      "ActiveArrayWidth": "2592",
      "ActiveArrayHeight": "1944",
      "PixelArrayWidth": "2592",
      "PixelArrayHeight": "1944",
      "PhysicalWidth": "3.6288",
      "PhysicalHeight": "2.7216",
      "FocalLength": "3.37",
      "MaxJpegSize": "8388608",
      "MinFrameDuration": "33331760",
      "MaxFrameDuration": "300000000",
      "OmitFrame": [
          {
              "width": "2592",
              "height": "1944",
              "omit_num": "3"
          },
          {
              "width": "1920",
              "height": "1080",
              "omit_num": "2"
          }
      ]
    }
  ]
}
