{
  "name": "autodut-engine-ci-tool-pages",
  "version": "1.0.0",
  "description": "Project to generate VuePress documentation",
  "docs_site": {
    "title": "${CI_PROJECT_TITLE} ${CI_COMMIT_TAG} documentation",
    "description": "Documentation for ${CI_PROJECT_TITLE} ${CI_COMMIT_TAG}",
    "from_folder": "./docs/",
    "base_url": "${vuepress_baseurl}"
  },
  "authors": {
    "name": "CieNTi",
    "email": "cienti@cienti.com"
  },
  "repository": "${CI_PROJECT_URL}",
  "license": "MIT",
  "private": false,
  "scripts": {
    "docs:dev": "vuepress dev docs",
    "docs:build": "vuepress build docs"
  },
  "dependencies": {
    "@vuepress/plugin-back-to-top": "^1.5.4",
    "@vuepress/plugin-medium-zoom": "^1.5.4",
    "markdown-it-attrs": "^3.0.3",
    "markdown-it-footnote": "^3.0.2",
    "markdown-it-include": "^2.0.0",
    "moment": "^2.27.0",
    "vuepress": "1.6.0",
    "vuepress-plugin-fulltext-search": "^2.0.5",
    "vuepress-plugin-reading-progress": "^1.0.10",
    "vuepress-plugin-reading-time": "^0.1.1"
  }
}
