{
	"fields": [
		{
			"id": "5f987329cd3f4d4eba31b2cd",
			"name": "Field ",
			"address": {},
			"contactPoint": [],
			"area": ["5f987329cd3f4d4eba31b2ce"]
		}
	],
	"areas": [
		{
			"id": "5f987329cd3f4d4eba31b2ce",
			"type": "Feature",
			"properties": {
				"dateCreated": "2020-10-27T19:21:13.263Z",
				"featureOfInterest": "5f987329cd3f4d4eba31b2cd",
				"name": "Area"
			},
			"geometry": {
				"coordinates": [
					[
						[-84.34145295182078, 42.77978727137011],
						[-84.34045850999432, 42.77976283990171],
						[-84.34047723379466, 42.77961014300436],
						[-84.341192899042, 42.77963762847338],
						[-84.34114921017483, 42.779402474619644],
						[-84.34146543435422, 42.77939483973887],
						[-84.34145295182078, 42.77978727137011]
					]
				],
				"type": "Polygon"
			}
		}
	],
	"stratifications": [
		{
			"id": "5f987329cd3f4d4eba31b2cf",
			"name": "Stratification",
			"dateCreated": "2020-10-27T19:21:13.263Z",
			"object": "5f987329cd3f4d4eba31b2ce"
		}
	],
	"locations": [
		{
			"type": "Feature",
			"properties": {},
			"geometry": {
				"type": "Point",
				"coordinates": [-84.3405999339466, 42.77970143514443]
			},
			"id": "5f987329cd3f4d4eba31b2d0"
		},
		{
			"type": "Feature",
			"properties": {},
			"geometry": {
				"type": "Point",
				"coordinates": [-84.34065866971751, 42.77970333907187]
			},
			"id": "5f987329cd3f4d4eba31b2d1"
		},
		{
			"type": "Feature",
			"properties": {},
			"geometry": {
				"type": "Point",
				"coordinates": [-84.34131777134675, 42.77970265565555]
			},
			"id": "5f987329cd3f4d4eba31b2d2"
		},
		{
			"type": "Feature",
			"properties": {},
			"geometry": {
				"type": "Point",
				"coordinates": [-84.34051468446614, 42.77971923885736]
			},
			"id": "5f987329cd3f4d4eba31b2d3"
		},
		{
			"type": "Feature",
			"properties": {},
			"geometry": {
				"type": "Point",
				"coordinates": [-84.34094810364498, 42.77973367051448]
			},
			"id": "5f987329cd3f4d4eba31b2d4"
		},
		{
			"type": "Feature",
			"properties": {},
			"geometry": {
				"type": "Point",
				"coordinates": [-84.34091990482065, 42.779662033187556]
			},
			"id": "5f987329cd3f4d4eba31b2d5"
		},
		{
			"type": "Feature",
			"properties": {},
			"geometry": {
				"type": "Point",
				"coordinates": [-84.34140788836078, 42.77939720438586]
			},
			"id": "5f987329cd3f4d4eba31b2d6"
		},
		{
			"type": "Feature",
			"properties": {},
			"geometry": {
				"type": "Point",
				"coordinates": [-84.34144442875036, 42.77945925384416]
			},
			"id": "5f987329cd3f4d4eba31b2d7"
		},
		{
			"type": "Feature",
			"properties": {},
			"geometry": {
				"type": "Point",
				"coordinates": [-84.34121810889091, 42.77941104911175]
			},
			"id": "5f987329cd3f4d4eba31b2d8"
		},
		{
			"type": "Feature",
			"properties": {},
			"geometry": {
				"type": "Point",
				"coordinates": [-84.34133245157935, 42.77955438551693]
			},
			"id": "5f987329cd3f4d4eba31b2d9"
		},
		{
			"type": "Feature",
			"properties": {},
			"geometry": {
				"type": "Point",
				"coordinates": [-84.34091488959754, 42.77977335848097]
			},
			"id": "5f987329cd3f4d4eba31b2da"
		},
		{
			"type": "Feature",
			"properties": {},
			"geometry": {
				"type": "Point",
				"coordinates": [-84.3406673355782, 42.77972458936079]
			},
			"id": "5f987329cd3f4d4eba31b2db"
		},
		{
			"type": "Feature",
			"properties": {},
			"geometry": {
				"type": "Point",
				"coordinates": [-84.3408996393521, 42.77972305394092]
			},
			"id": "5f987329cd3f4d4eba31b2dc"
		},
		{
			"type": "Feature",
			"properties": {},
			"geometry": {
				"type": "Point",
				"coordinates": [-84.34127717445719, 42.77940282412335]
			},
			"id": "5f987329cd3f4d4eba31b2dd"
		},
		{
			"type": "Feature",
			"properties": {},
			"geometry": {
				"type": "Point",
				"coordinates": [-84.341398104081, 42.779493587305474]
			},
			"id": "5f987329cd3f4d4eba31b2de"
		},
		{
			"type": "Feature",
			"properties": {},
			"geometry": {
				"type": "Point",
				"coordinates": [-84.34086045434475, 42.7796849582665]
			},
			"id": "5f987329cd3f4d4eba31b2df"
		},
		{
			"type": "Feature",
			"properties": {},
			"geometry": {
				"type": "Point",
				"coordinates": [-84.34099659548107, 42.77965880694651]
			},
			"id": "5f987329cd3f4d4eba31b2e0"
		},
		{
			"type": "Feature",
			"properties": {},
			"geometry": {
				"type": "Point",
				"coordinates": [-84.34084611377229, 42.77975286960748]
			},
			"id": "5f987329cd3f4d4eba31b2e1"
		},
		{
			"type": "Feature",
			"properties": {},
			"geometry": {
				"type": "Point",
				"coordinates": [-84.34145096332882, 42.77967146265001]
			},
			"id": "5f987329cd3f4d4eba31b2e2"
		},
		{
			"type": "Feature",
			"properties": {},
			"geometry": {
				"type": "Point",
				"coordinates": [-84.34079032918628, 42.77976874943685]
			},
			"id": "5f987329cd3f4d4eba31b2e3"
		},
		{
			"type": "Feature",
			"properties": {},
			"geometry": {
				"type": "Point",
				"coordinates": [-84.34057786344758, 42.77975908383463]
			},
			"id": "5f987329cd3f4d4eba31b2e4"
		},
		{
			"type": "Feature",
			"properties": {},
			"geometry": {
				"type": "Point",
				"coordinates": [-84.34068740978233, 42.77975492106561]
			},
			"id": "5f987329cd3f4d4eba31b2e5"
		},
		{
			"type": "Feature",
			"properties": {},
			"geometry": {
				"type": "Point",
				"coordinates": [-84.34100690819282, 42.779659129165104]
			},
			"id": "5f987329cd3f4d4eba31b2e6"
		},
		{
			"type": "Feature",
			"properties": {},
			"geometry": {
				"type": "Point",
				"coordinates": [-84.34144620420592, 42.77978066134707]
			},
			"id": "5f987329cd3f4d4eba31b2e7"
		},
		{
			"type": "Feature",
			"properties": {},
			"geometry": {
				"type": "Point",
				"coordinates": [-84.34101690467149, 42.779681344884814]
			},
			"id": "5f987329cd3f4d4eba31b2e8"
		}
	],
	"locationCollections": [
		{
			"id": "5f987329cd3f4d4eba31b2e9",
			"object": "5f987329cd3f4d4eba31b2ce",
			"resultOf": "5f987329cd3f4d4eba31b2cf",
			"featureOfInterest": "5f987329cd3f4d4eba31b2cd",
			"features": [
				"5f987329cd3f4d4eba31b2d0",
				"5f987329cd3f4d4eba31b2d1",
				"5f987329cd3f4d4eba31b2d2",
				"5f987329cd3f4d4eba31b2d3",
				"5f987329cd3f4d4eba31b2d4",
				"5f987329cd3f4d4eba31b2d5",
				"5f987329cd3f4d4eba31b2d6",
				"5f987329cd3f4d4eba31b2d7",
				"5f987329cd3f4d4eba31b2d8",
				"5f987329cd3f4d4eba31b2d9",
				"5f987329cd3f4d4eba31b2da",
				"5f987329cd3f4d4eba31b2db",
				"5f987329cd3f4d4eba31b2dc",
				"5f987329cd3f4d4eba31b2dd",
				"5f987329cd3f4d4eba31b2de",
				"5f987329cd3f4d4eba31b2df",
				"5f987329cd3f4d4eba31b2e0",
				"5f987329cd3f4d4eba31b2e1",
				"5f987329cd3f4d4eba31b2e2",
				"5f987329cd3f4d4eba31b2e3",
				"5f987329cd3f4d4eba31b2e4",
				"5f987329cd3f4d4eba31b2e5",
				"5f987329cd3f4d4eba31b2e6",
				"5f987329cd3f4d4eba31b2e7",
				"5f987329cd3f4d4eba31b2e8"
			]
		}
	]
}
