{
  "http://git.bananach.space/advtrains.git":{ "version": "master", "name": "advtrains", "recursive":"false", "modpack": true,
    "SubMods":{
      "advtrains": true,
      "advtrains_interlocking": true,
      "advtrains_itrainmap": true,
      "advtrains_line_automation": true,
      "advtrains_luaautomation": true,
      "advtrains_signals_ks": true,
      "advtrains_train_industrial": true,
      "advtrains_train_japan": true,
      "advtrains_train_steam": true,
      "advtrains_train_subway": true,
      "advtrains_train_track": true
    },
    "enabled": true
  },
  "https://github.com/minetest-mods/technic.git":{ "version": "master", "name": "technic", "recursive":"false", "modpack":true,
    "SubMods":{
      "concrete": true,
      "extranodes": true,
      "technic": true,
      "technic_chests": true,
      "technic_cnc": true,
      "technic_worldgen": true,
      "wrench": true
    }
  },
  "https://github.com/stujones11/minetest-3d_armor.git":{ "version": "master",
    "name": "3d_armor",
    "recursive":"false",
    "modpack": true,
    "SubMods":{
      "3d_armor": true,
      "3d_armor_ip": true,
      "3d_armor_sfinv": true,
      "3d_armor_stand": true,
      "3d_armor_ui": true,
      "shields": true,
      "wieldview": true
    },
    "enabled": true
  },
  "https://github.com/joe7575/techpack.git":{ "version": "master", "name": "techpack", "recursive":"false", "modpack":true,
    "SubMods": {
      "gravelsieve": true,
      "lcdlib": true,
      "safer_lua": true,
      "sl_controller": true,
      "smartline": true,
      "techpack_stairway": true,
      "techpack_warehouse": true,
      "tubelib": true,
      "tubelib_addons1": true,
      "tubelib_addons2": true,
      "tubelib_addons3": true
    },
   "enabled": true 
  },
  "https://gitlab.com/VanessaE/plantlife_modpack.git":{ "version": "master", "name": "plantlife_modpack", "recursive":"false", "modpack":true, 
    "SubMods":{
      "3dmushrooms": false,
      "along_shore": false,
      "bushes": false,
      "bushes_classic": false,
      "cavestuff": true,
      "dryplants": false,
      "ferns": false,
      "flowers_plus": false,
      "junglegrass": false,
      "molehills": false,
      "nature_classic": false,
      "plantlife_i18n": true,
      "poisonivy": false,
      "trunks": false,
      "vines": false,
      "woodsoils": false,
      "youngtrees": false
    }
  },
  "https://github.com/jogag/digiline-stuff.git":{ "version": "master", "name": "digiline-stuff", "recursive":"false", "modpack":true, 
    "SubMods":{
      "digiboard": true,
      "digilines_crafting": true,
      "digilines_memory": true,
      "digilines_weather_sensor": false,
      "digiprinter": true,
      "homedecor_plastic": true
    }
  },
  "https://github.com/minetest-mods/mesecons.git":{ "version": "master", "name": "mesecons", "recursive":"false", "modpack":true, 
    "SubMods":{
      "mesecons": true,
      "mesecons_alias": true,
      "mesecons_blinkyplant": true,
      "mesecons_button": true,
      "mesecons_commandblock": true,
      "mesecons_delayer": true,
      "mesecons_detector": true,
      "mesecons_doors": true,
      "mesecons_extrawires": true,
      "mesecons_fpga": true,
      "mesecons_gates": true,
      "mesecons_hydroturbine": true,
      "mesecons_insulated": true,
      "mesecons_lamp": true,
      "mesecons_lightstone": true,
      "mesecons_luacontroller": true,
      "mesecons_materials": true,
      "mesecons_microcontroller": true,
      "mesecons_movestones": true,
      "mesecons_mvps": true,
      "mesecons_noteblock": true,
      "mesecons_pistons": true,
      "mesecons_powerplant": true,
      "mesecons_pressureplates": true,
      "mesecons_random": true,
      "mesecons_receiver": true,
      "mesecons_solarpanel": true,
      "mesecons_stickyblocks": true,
      "mesecons_switch": true,
      "mesecons_torch": true,
      "mesecons_walllever": true,
      "mesecons_wires": true
    }
  },
  "https://github.com/Uberi/Minetest-WorldEdit.git":{ "version": "master", "name": "worldedit", "recursive":"false", "modpack":true, 
   "submods":{
    "worldedit": true,
    "worldedit_commands": true,
    "worldedit_gui":  true,
    "worldedit_shortcommands": true
   }
  },
  "https://github.com/pyrollo/display_modpack.git":{ "version": "master", "name": "display_modpack", "recursive":"false", "modpack":true,
    "SubMods":{
      "boards": true,
      "display_api": true,
      "font_api": true,
      "font_metro": true,
      "ontime_clocks": true,
      "signs": true,
      "signs_api": true,
      "signs_road": true,
      "steles": true      
    }
  },
  "https://github.com/blert2112/mobs_more_animals.git":{ "version": "master", "name": "mobs_more_animals", "recursive":"false", "modpack":true,
    "SubMods":{
      "mobs_bear": true,
      "mobs_better_rat": true,
      "mobs_bugslive": true,
      "mobs_deer": true,
      "mobs_giraffe": true,
      "mobs_horse": true,
      "mobs_mr_goat": true,
      "mobs_snowman": true,
      "mobs_wolf": true
    }
  },
  "https://gitlab.com/aurelium/aurelium-mods/sea.git":{ "version": "master", "name": "sea", "recursive":"false", "modpack":true,
    "SubMods":{
      "clams": true,
      "noairblocks": true,
      "seacobble": true,
      "seacoral": true,
      "seaglass": true,
      "seagravel": true,
      "sealamps": true,
      "seaplants": false,
      "seastone": true,
      "seastonebrick": true,
      "seawrecks": true,
      "stairsshine": true,
      "whiteshell": true
    }
  },
  "https://gitlab.com/VanessaE/homedecor_modpack.git":{ "version": "master", "name": "homedecor_modpack", "recursive":"false", "modpack":true,
    "SubMods":{
      "building_blocks": true,
      "computer": true,
      "fake_fire": false,
      "homedecor_3d_extras": true,
      "homedecor_bathroom": true,
      "homedecor_bedroom": true,
      "homedecor_books": true,
      "homedecor_climate_control": true,
      "homedecor_clocks": true,
      "homedecor_cobweb": true,
      "homedecor_common": true,
      "homedecor_doors_and_gates": true,
      "homedecor_electrical": true,
      "homedecor_electronics": true,
      "homedecor_exterior": true,
      "homedecor_fences": true,
      "homedecor_foyer": true,
      "homedecor_furniture": true,
      "homedecor_furniture_medieval": true,
      "homedecor_gastronomy": true,
      "homedecor_kitchen": true,
      "homedecor_laundry": true,
      "homedecor_lighting": true,
      "homedecor_misc": true,
      "homedecor_office": true,
      "homedecor_pictures_and_paintings": true,
      "homedecor_roofing": true,
      "homedecor_seating": true,
      "homedecor_tables": true,
      "homedecor_trash_cans": true,
      "homedecor_wardrobe": true,
      "homedecor_windows_and_treatments": true,
      "inbox": true,
      "itemframes": true,
      "lavalamp": true,
      "plasmascreen": true
    }
  },
  "https://github.com/qwrwed/magma_and_ice_mp.git":{ "version": "master", "name": "magma_and_ice_mp", "recursive":"false", "modpack":true,
    "SubMods":{
      "icetools": true,
      "magmatools": true,
      "paxels": true
    }
  },
  "https://github.com/minetest-monitoring/monitoring.git":{ "version": "master", "name": "monitoring", "recursive":"false", "modpack":true,
    "SubMods":{
      "monitoring": true,
      "monitoring_advtrains": true,
      "monitoring_digilines": true,
      "monitoring_digtron": true,
      "monitoring_mesecons": true,
      "monitoring_pipeworks": true,
      "monitoring_protection": true,
      "monitoring_replacer": true,
      "monitoring_technic": true
    }
  },
  "https://gitlab.com/VanessaE/ilights.git":{ "version": "master", "name": "xban2", "recursive":"false", "modpack":false, "enabled": true   },
  "https://github.com/minetest-mods/xban2.git":{ "version": "master", "name": "xban2", "recursive":"false", "modpack":false, "enabled": true   },
  "https://github.com/MT-Eurythmia/pvpplus.git":{ "version": "master", "name": "pvpplus", "recursive":"false", "modpack":false, "enabled": true   },
  "https://github.com/minetest-mods/unifiedbricks.git":{ "version": "master", "name": "unifiedbricks", "recursive":"false", "modpack":false, "enabled": true   },
  "https://github.com/kestral246/tunnelmaker.git":{ "version": "master", "name": "tunnelmaker", "recursive":"false", "modpack":false, "enabled": true   },
  "https://github.com/minetest-mods/spawn_command.git":{ "version": "master", "name": "spawn_command", "recursive":"false", "modpack":false, "enabled": true   },
  "https://github.com/prestidigitator/farming.git":{ "version": "master", "name": "farming", "recursive":"false", "modpack":false, "enabled": true   },
  "https://github.com/Sokomine/travelnet.git":{ "version": "master", "name": "travelnet", "recursive":"false", "modpack":false, "enabled": true   },
  "https://github.com/AntumMT/mod-hudbars.git":{ "version": "master", "name": "hudbars", "recursive":"false", "modpack":false, "enabled": true   },
  "https://github.com/ac-minetest/basic_machines.git":{ "version": "master", "name": "basic_machines", "recursive":"false", "modpack":false, "enabled": false   },
  "https://gitlab.com/VanessaE/basic_materials.git":{ "version": "master", "name": "basic_materials", "recursive":"false", "modpack":false, "enabled": true   },
  "https://github.com/FsxShader2012/rainbow_ore.git":{ "version": "master", "name": "rainbow_ore", "recursive":"false", "modpack":false, "enabled": true   },
  "https://github.com/AiTechEye/smartshop.git":{ "version": "master", "name": "smartshop", "recursive":"false", "modpack":false, "enabled": true   },
  "https://github.com/minetest-mods/digilines.git":{ "version": "master", "name": "digilines", "recursive":"false", "modpack":false, "enabled": true   },
  "https://gitlab.com/aurelium/aurelium-mods/chains.git":{ "version": "master", "name": "chains", "recursive":"false", "modpack":false, "enabled": false   },
  "https://gitlab.com/aurelium/aurelium-mods/christmas_craft.git":{ "version": "master", "name": "christmas_craft", "recursive":"false", "modpack":false, "enabled": true   },
  "https://github.com/Ezhh/caverealms_lite.git":{ "version": "master", "name": "caverealms", "recursive":"false", "modpack":false, "enabled": true   },
  "https://github.com/joe7575/tubelib2.git":{ "version": "master", "name": "tubelib2", "recursive":"false", "modpack":false, "enabled": true   },
  "https://gitlab.com/VanessaE/pipeworks.git":{ "version": "master", "name": "pipeworks", "recursive":"false", "modpack":false, "enabled": true   },
  "https://github.com/minetest-mods/areas.git":{ "version": "master", "name": "areas", "recursive":"false", "modpack":false, "enabled": true   },
  "https://github.com/Terumoc/terumet.git":{ "version": "master", "name": "terumet", "recursive":"false", "modpack":false, "enabled": true   },
  "https://gitlab.com/aurelium/aurelium-mods/creative.git":{ "version": "master", "name": "creative", "recursive":"false", "modpack":false, "enabled": true   },
  "https://github.com/minetest-streets/streets.git":{ "version": "master", "name": "streets", "recursive":"false", "modpack":false, "enabled": true   },
  "https://github.com/GunshipPenguin/serveressentials.git":{ "version": "master", "name": "serveressentials", "recursive":"false", "modpack":false, "enabled": true   },
  "https://gitlab.com/aurelium/aurelium-mods/map.git":{ "version": "master", "name": "map", "recursive":"false", "modpack":false, "enabled": true   },
  "https://gitlab.com/aurelium/aurelium-mods/emergencyphone.git":{ "version": "master", "name": "emergencyphone", "recursive":"false", "modpack":false, "enabled": false   },  
  "https://gitlab.com/aurelium/aurelium-mods/convertnodes.git":{ "version": "master", "name": "convertnodes", "recursive":"false", "modpack":false, "enabled": true   },
  "https://gitlab.com/aurelium/aurelium-mods/dreambuilder_mp_extras.git":{ "version": "master", "name": "dreambuilder_mp_extras", "recursive":"false", "modpack":false, "enabled": true   },
  "https://gitlab.com/aurelium/aurelium-mods/constructionarea.git":{ "version": "master", "name": "constructionarea", "recursive":"false", "modpack":false, "enabled": false   },
  "https://gitlab.com/aurelium/aurelium-mods/concretestairs.git":{ "version": "master", "name": "concretestairs", "recursive":"false", "modpack":false, "enabled": true   },
  "https://gitlab.com/aurelium/aurelium-mods/inspector.git":{ "version": "master", "name": "inspector", "recursive":"false", "modpack":false, "enabled": true   },
  "https://gitlab.com/aurelium/aurelium-mods/infrastructure.git":{ "version": "master", "name": "infrastructure", "recursive":"false", "modpack":false, "enabled": true   },
  "https://gitlab.com/aurelium/aurelium-mods/labels.git":{ "version": "master", "name": "labels", "recursive":"false", "modpack":false, "enabled": false   },
  "https://gitlab.com/aurelium/aurelium-mods/lcd.git":{ "version": "master", "name": "lcd", "recursive":"false", "modpack":false, "enabled": true   },
  "https://gitlab.com/aurelium/aurelium-mods/myspeed.git":{ "version": "master", "name": "myspeed", "recursive":"false", "modpack":false, "enabled": true   },
  "https://gitlab.com/aurelium/aurelium-mods/manholes.git":{ "version": "master", "name": "manholes", "recursive":"false", "modpack":false, "enabled": false   },
  "https://gitlab.com/aurelium/aurelium-mods/mail.git":{ "version": "master", "name": "mail", "recursive":"false", "modpack":false, "enabled": true   },
  "https://gitlab.com/aurelium/aurelium-mods/ltc4000e.git":{ "version": "master", "name": "ltc4000e", "recursive":"false", "modpack":false, "enabled": true   },
  "https://gitlab.com/aurelium/aurelium-mods/santa.git":{ "version": "master", "name": "santa", "recursive":"false", "modpack":false, "enabled": true   },  
  "https://github.com/bdjnk/mini_sun.git":{ "version": "master", "name": "mini_sun", "recursive":"false", "modpack":false, "enabled": true   },
  "https://notabug.org/TenPlus1/ethereal.git":{ "version": "master", "name": "ethereal", "recursive":"false", "modpack":false, "enabled": true   },
  "https://gitlab.com/VanessaE/unifieddyes.git":{ "version": "master", "name": "unifieddyes", "recursive":"false", "modpack":false, "enabled": true   },
  "https://github.com/minetest-mods/anvil.git":{ "version": "master", "name": "anvil", "recursive":"false", "modpack":false, "enabled": true   },
  "https://github.com/minetest-mods/castle_farming.git":{ "version": "master", "name": "castle_farming", "recursive":"false", "modpack":false, "enabled": true   },
  "https://github.com/minetest-mods/castle_gates.git":{ "version": "master", "name": "castle_gates", "recursive":"false", "modpack":false, "enabled": true   },
  "https://github.com/minetest-mods/castle_lighting.git":{ "version": "master", "name": "castle_lighting", "recursive":"false", "modpack":false, "enabled": true   },
  "https://github.com/minetest-mods/castle_masonry.git":{ "version": "master", "name": "castle_masonry", "recursive":"false", "modpack":false, "enabled": true   },
  "https://github.com/minetest-mods/castle_shields.git":{ "version": "master", "name": "castle_shields", "recursive":"false", "modpack":false, "enabled": true   },
  "https://github.com/minetest-mods/castle_storage.git":{ "version": "master", "name": "castle_storage", "recursive":"false", "modpack":false, "enabled": true   },
  "https://github.com/minetest-mods/castle_tapestries.git":{ "version": "master", "name": "castle_tapestries", "recursive":"false", "modpack":false, "enabled": true   },
  "https://github.com/minetest-mods/castle_weapons.git":{ "version": "master", "name": "castle_weapons", "recursive":"false", "modpack":false, "enabled": true   },
  "https://github.com/minetest-mods/crafting_bench.git":{ "version": "master", "name": "crafting_bench", "recursive":"false", "modpack":false, "enabled": true   },
  "https://github.com/minetest-mods/orbs_of_time.git":{ "version": "master", "name": "orbs_of_time", "recursive":"false", "modpack":false, "enabled": true   },
  "https://github.com/minetest-mods/ropes.git":{ "version": "master", "name": "ropes", "recursive":"false", "modpack":false, "enabled": true   },
  "https://github.com/minetest-mods/irc_commands.git":{ "version": "master", "name": "irc_commands", "recursive":"false", "modpack":false, "enabled": true   },
  "https://github.com/minetest-mods/irc.git":{ "version": "master", "name": "irc", "recursive":"true", "modpack":false, "enabled": true   },
  "https://github.com/minetest-mods/moreblocks.git":{ "version": "master", "name": "moreblocks", "recursive":"false", "modpack":false, "enabled": false   },
  "https://github.com/everamzah/books.git":{ "version": "master", "name": "books", "recursive":"false", "modpack":false, "enabled": true   },
  "https://notabug.org/TenPlus1/bonemeal.git":{ "version": "master", "name": "bonemeal", "recursive":"false", "modpack":false, "enabled": true   },
  "https://github.com/minetest-mods/BobBlocks.git":{ "version": "master", "name": "bobblocks", "recursive":"false", "modpack":false, "enabled": true   },
  "https://gitlab.com/VanessaE/blox.git":{ "version": "master", "name": "blox", "recursive":"false", "modpack":false, "enabled": true   },
  "https://gitlab.com/aurelium/aurelium-mods/automappercolors.git":{ "version": "master", "name": "automappercolors", "recursive":"false", "modpack":false, "enabled": true   },
  "https://gitlab.com/VanessaE/biome_lib.git":{ "version": "master", "name": "biome_lib", "recursive":"false", "modpack":false, "enabled": true   },
  "https://cheapiesystems.com/git/arrowboards":{ "version": "master", "name": "arrowboards", "recursive":"false", "modpack":false, "enabled": true   },
  "https://notabug.org/TenPlus1/mobs_redo.git":{ "version": "master", "name": "mobs", "recursive":"false", "modpack":false, "enabled": true   },
  "https://github.com/blert2112/lib_mount.git":{ "version": "master", "name": "lib_mount", "recursive":"false", "modpack":false, "enabled": true   },
  "https://github.com/everamzah/mobs_npc.git":{ "version": "master", "name": "mobs_npc", "recursive":"false", "modpack":false, "enabled": true   },
  "https://github.com/hkzorman/advanced_npc.git":{ "version": "master", "name": "advanced_npc", "recursive":"false", "modpack":false, "enabled": true   },
  "https://github.com/minetest-mods/quartz.git":{ "version": "master", "name": "quartz", "recursive":"false", "modpack":false, "enabled": true   },
  "https://github.com/Tmanyo/bank_accounts.git":{ "version": "master", "name": "bank_accounts", "recursive":"false", "modpack":false, "enabled": false   },
  "https://github.com/minetest-mods/nether.git":{ "version": "master", "name": "nether", "recursive":"false", "modpack":false, "enabled": true   },
  "https://cheapiesystems.com/git/plasticbox":{ "version": "master", "name": "plasticbox", "recursive":"false", "modpack":false, "enabled": true   },
  "https://gitlab.com/VanessaE/titanium.git":{ "version": "master", "name": "titanium", "recursive":"false", "modpack":false, "enabled": true   },
  "https://github.com/minetest-mods/unified_inventory.git":{ "version": "master", "name": "unified_inventory", "recursive":"false", "modpack":false, "enabled": true   },
  "https://github.com/SmallJoker/sneak_glitch.git":{ "version": "master", "name": "sneak_glitch", "recursive":"false", "modpack":false, "enabled": true   },
  "https://notabug.org/TenPlus1/wine.git":{ "version": "master", "name": "wine", "recursive":"false", "modpack":false, "enabled": true   },
  "https://github.com/thomasrudin-mt/vacuum.git":{ "version": "master", "name": "vacuum", "recursive":"false", "modpack":false, "enabled": true   },
  "https://git.rudin.io/minetest/spacesuit.git":{ "version": "master", "name": "spacesuit", "recursive":"false", "modpack":false, "enabled": true   },
  "https://github.com/minetest-mods/stained_glass.git":{ "version": "master", "name": "stained_glass", "recursive":"false", "modpack":false, "enabled": true   },
  "https://github.com/xenonca/ptime.git":{ "version": "master", "name": "ptime", "recursive":"false", "modpack":false, "enabled": true   },
  "https://github.com/Ezhh/other_worlds.git":{ "version": "master", "name": "other_worlds", "recursive":"false", "modpack":false, "enabled": true   },
  "https://github.com/minetest-mods/digtron.git":{ "version": "master", "name": "digtron", "recursive":"false", "modpack":false, "enabled": true   },
  "https://gitlab.com/VanessaE/signs_lib.git":{ "version": "master", "name": "signs_lib", "recursive":"false", "modpack":false, "enabled": true   },
  "https://github.com/minetest-mods/xdecor.git":{ "version": "master", "name": "xdecor", "recursive":"false", "modpack":false, "enabled": true   },
  "https://github.com/Ezhh/server_news.git":{ "version": "master", "name": "server_news", "recursive":"false", "modpack":false, "enabled": true   },
  "https://github.com/Sokomine/replacer.git":{ "version": "master", "name": "replacer", "recursive":"false", "modpack":false, "enabled": true   },
  "https://gitlab.com/VanessaE/led_marquee.git":{ "version": "master", "name": "led_marquee", "recursive":"false", "modpack":false, "enabled": true   },
  "https://notabug.org/TenPlus1/teleport_potion.git":{ "version": "master", "name": "teleport_potion", "recursive":"false", "modpack":false, "enabled": true   },
  "https://github.com/ChaosWormz/teleport-request.git":{ "version": "master", "name": "teleport-request", "recursive":"false", "modpack":false, "enabled": true   },
  "https://github.com/minetest-mods/ts_workshop.git":{ "version": "master", "name": "ts_workshop", "recursive":"false", "modpack":false, "enabled": true   },
  "https://github.com/HybridDog/treecapitator.git":{ "version": "master", "name": "treecapitator", "recursive":"false", "modpack":false, "enabled": true   },
  "https://github.com/DonBatman/traffic_light.git":{ "version": "master", "name": "traffic_light", "recursive":"false", "modpack":false, "enabled": true   },
  "https://github.com/minetest-mods/torches.git":{ "version": "master", "name": "torches", "recursive":"false", "modpack":false, "enabled": true   },
  "https://gitlab.com/VanessaE/coloredwood.git":{ "version": "master", "name": "coloredwood", "recursive":"false", "modpack":false, "enabled": true   },
  "https://github.com/Zeg9/minetest-skins.git":{ "version": "master", "name": "skinsdb", "recursive":"false", "modpack":false, "enabled": true   },
  "https://github.com/PilzAdam/TNT.git":{ "version": "master", "name": "tnt", "recursive":"false", "modpack":false, "enabled": true   },
  "https://github.com/minetest-mods/moreores.git":{ "version": "master", "name": "moreores", "recursive":"false", "modpack":false, "enabled": true   },
  "https://github.com/minetest-mods/maptools.git":{ "version": "master", "name": "maptools", "recursive":"false", "modpack":false, "enabled": true   },
  "https://github.com/Mossmanikin/memorandum.git":{ "version": "master", "name": "memorandum", "recursive":"false", "modpack":false, "enabled": true   },
  "https://github.com/Ezhh/mese_restriction.git":{ "version": "master", "name": "mese_restriction", "recursive":"false", "modpack":false, "enabled": true   },
  "https://github.com/minetest-mods/craftguide.git":{ "version": "master", "name": "craftguide", "recursive":"false", "modpack":false, "enabled": true   },
  "https://github.com/minetest-technic/item_tweaks.git":{ "version": "master", "name": "item_tweaks", "recursive":"false", "modpack":false, "enabled": true   },
  "https://gitlab.com/VanessaE/steel.git":{ "version": "master", "name": "steel", "recursive":"false", "modpack":false, "enabled": true   },
  "https://gitlab.com/aurelium/aurelium-mods/monorail.git":{ "version": "master", "name": "monorail", "recursive":"false", "modpack":false, "enabled": true   },
  "https://gitlab.com/aurelium/aurelium-mods/new_campfire.git":{ "version": "master", "name": "new_campfire", "recursive":"false", "modpack":false, "enabled": true   },
  "https://github.com/jojoa1997/display_blocks.git":{ "version": "master", "name": "display_blocks", "recursive":"false", "modpack":false, "enabled": true   },
  "https://github.com/thefamilygrog66/lrfurn.git":{ "version": "master", "name": "lrfurn", "recursive":"false", "modpack":false, "enabled": true   },
  "https://github.com/Sokomine/locks.git":{ "version": "master", "name": "locks", "recursive":"false", "modpack":false, "enabled": true   },
  "https://github.com/minetest-mods/jumping.git":{ "version": "master", "name": "jumping", "recursive":"false", "modpack":false, "enabled": true   },
  "https://github.com/minetest-technic/datastorage.git":{ "version": "master", "name": "datastorage", "recursive":"false", "modpack":false, "enabled": true   },
  "https://github.com/octacian/minetest-mod-invis.git":{ "version": "master", "name": "invis", "recursive":"false", "modpack":false, "enabled": false   },
  "https://repo.or.cz/minetest_hbhunger.git":{ "version": "master", "name": "hbhunger", "recursive":"false", "modpack":false, "enabled": true   },
  "https://github.com/stujones11/hazmat_suit.git":{ "version": "master", "name": "hazmat_suit", "recursive":"false", "modpack":false, "enabled": true   },
  "https://cheapiesystems.com/git/prefab_redo":{ "version": "master", "name": "prefab_redo", "recursive":"false", "modpack":false, "enabled": true   },
  "https://github.com/h4ml3t/mobs_balrog.git":{ "version": "master", "name": "mobs_balrog", "recursive":"false", "modpack":false, "enabled": true   },
  "https://github.com/h4ml3t/mobs_dwarves.git":{ "version": "master", "name": "mobs_dwarves", "recursive":"false", "modpack":false, "enabled": true   },
  "https://notabug.org/TenPlus1/mobs_animal.git":{ "version": "master", "name": "mobs_animal", "recursive":"false", "modpack":false, "enabled": true   },
  "https://notabug.org/TenPlus1/protector.git":{ "version": "master", "name": "protector", "recursive":"false", "modpack":false, "enabled": true   }
}
