{
  "model_type": "mlp",
  "model_params": {
    "hidden_layer_sizes": [100, 100, 100, 100, 100, 50],
    "activation": "relu",
    "solver": "adam",
    "alpha": 0.0001, "batch_size": "auto",
    "learning_rate_init": 0.001,
    "max_iter": 200,
    "shuffle": true,
    "random_state": 0,
    "tol": 0.0001,
    "verbose": 1,
    "early_stopping": true,
    "validation_fraction": 0.1,
    "beta_1": 0.9,
    "beta_2": 0.999,
    "epsilon": 1e-08
  }
}